{"text_format":"1","workbook":"xlsx","n_sheets":14,"sheets":["Home Page","Instructions","1) Project Information","2) Project Crash Data","3) Analysis Parameters","4) Results","Crash Benefits","Travel Time Benefits","LinkCharacteristics","Reliability Benefits","Vehicle Operation Benefits","Emission Benefits","Lookup","Final Calculations"],"not_rendered":{"charts":3,"images":9,"macros":1,"external_links":2,"defined_names":255,"comments":0,"pivot_tables":0},"unopened":[],"bounds":{"document_bytes":16777216,"sheet_cells":100000,"rows_first":2000,"rows_last":500,"rows_between":2000,"halvings":0,"cell_chars":16384,"cell_head_chars":4096},"cells_cut":0,"cells_raw":0,"read":"whole","date_system":"1900"}

{"sheet":"Home Page","index":0,"n_rows":5,"n_cols":2,"rows_kept":5,"cut":false,"hidden":false,"merged":[[4,1,11,2]]}
["Highway Safety Benefit-Cost Analysis Model (Version 2.0)"]
[]
[]
[]
[null,"Please make sure to save a copy of this tool with a relevant project-alternative name before entering any data."]

{"sheet":"Instructions","index":1,"n_rows":29,"n_cols":6,"rows_kept":29,"cut":false,"hidden":false,"merged":[[17,5,17,11],[18,5,18,11],[19,5,19,11],[21,5,21,11],[22,5,22,11],[12,5,12,11],[13,5,13,9],[14,5,14,11],[15,5,15,11],[16,5,16,11],[1,12,4,26],[6,5,6,12],[8,5,8,12],[10,5,10,12],[11,5,11,11],[29,3,29,9],[23,5,23,11],[24,5,24,11],[25,5,25,11],[26,5,26,11],[28,5,28,11]]}
[" ","Reference Guide: TOOL INSTRUCTIONS"]
[]
[]
[]
[]
[]
[null,null,null,null,null,"TABLE OF CONTENTS"]
[]
[null,null,null,null,null,"INTRODUCTION"]
[]
{"$rows_left_out":20}
{"sheet":"1) Project Information","index":2,"n_rows":102,"n_cols":9,"rows_kept":102,"cut":false,"hidden":false,"merged":[[36,1,36,6],[41,1,41,8],[50,1,50,8],[39,7,40,7],[39,8,40,8],[39,1,40,1],[38,2,38,4],[38,5,38,6],[39,5,40,5],[39,6,40,6],[39,3,40,3],[39,4,40,4],[39,2,40,2],[8,1,8,8],[0,1,0,8],[35,1,35,8],[1,7,1,8],[2,3,2,4],[3,3,3,4],[4,3,4,4],[5,3,5,4],[6,3,6,4],[9,1,9,6],[22,2,23,4]]}
[null,"PROJECT INFORMATION"]
[null,null,null,null,null,null,null,"Legend"]
[null,null,"Agency:",null,null,null,null,"User-Supplied Data",0]
[null,null,"Project Title:",null,null,null,null,"Model Default",0]
[null,null,"Date:",null,null,null,null,"Model Calculation",0]
[null,null,"Analyst:"]
[null,null,"Build Alternative Name"]
[]
[null,"PROJECT DATA"]
[null,"Enter basic project data here. The green cells require user-supplied data when a default blue cell is not adjacent. The blue cells are model defaults, but can be overridden by entering a value in the green cell next to the blue default. All orange text represents model calculations."]
{"$rows_left_out":93}
{"sheet":"2) Project Crash Data","index":3,"n_rows":50,"n_cols":11,"rows_kept":50,"cut":false,"hidden":false,"merged":[[8,1,8,8],[42,3,42,4],[23,1,23,8],[24,1,25,9]]}
[null,"PROJECT CRASH DATA"]
[null,"This sheet calculates annual reductions in crash frequency and severity for single or multiple countermeasures."]
[null,null,null,null,null,null,null,null,null,"Color Codes"]
[null,"1) Single or Multiple Countermeasure",null,null,null,null,null,null,null,"User-Supplied Data",0]
[null,null,null,null,null,null,null,null,null,"Model Parameter",0]
[null,"2) Calculation Method",null,null,null,null,null,null,null,"Model Calculation",{"$f":"'2) Project Crash Data'!H33","v":0}]
[null,null,null,null,null,null,null,null,null,"Linked Cell",{"$f":"'2) Project Crash Data'!F39","v":0}]
[]
[null,"BASELINE CRASH DATA AND CRASH MODIFICATION FACTORS"]
[null,"Enter estimated annual crashes without treatment and Crash Modification Factors (CMF)."]
{"$rows_left_out":41}
{"sheet":"3) Analysis Parameters","index":4,"n_rows":24,"n_cols":10,"rows_kept":24,"cut":false,"hidden":false,"merged":[[3,2,3,5],[8,7,11,9],[2,1,2,10]]}
[null,"ANALYSIS PARAMETERS"]
[null,"This page lists model-defined parameters from the Lookup worksheet.  "]
[null,"Model-defined parameters are based on the \"Roadway Facility Type\" selected by the user on the Project Information worksheet."]
[]
[null,null,"Roadway Facility Type",{"$f":"'1) Project Information'!D12","v":"Urban Interstate/Expressway"},null,null,null,"Color Codes"]
[null,null,null,null,null,null,null,"User-Supplied Data"]
[null,null,null,"Parameter","User Defined",null,null,"Model Parameter"]
[null,null,"Value of Time",{"$f":"IF('1) Project Information'!$E$22>0,'1) Project Information'!$E$22,'1) Project Information'!$D$22)","v":27.014666640000002},null,null," "]
[null,null,null,null,null,null,null,"Users may modify default values by entering user defined values in the green cells on the right of the Lookup entry."]
[null,null,"Travel Time Delay Factors","(Hours/Crash)"]
{"$rows_left_out":15}
{"sheet":"4) Results","index":5,"n_rows":14,"n_cols":12,"rows_kept":14,"cut":false,"hidden":false,"merged":[[12,8,12,10],[0,0,0,13],[1,0,1,13],[8,8,8,10],[9,8,9,10],[10,8,10,10],[11,8,11,10]]}
[{"$f":"'1) Project Information'!D4","v":0}]
["Benefit-Cost Analysis Summary Results"]
[]
[null,"AGENCY:",null,{"$f":"'1) Project Information'!D3","v":0},null,null,null,null,null,"DATE",{"$f":"'1) Project Information'!D5","v":"00:00:00"}]
[]
[]
[null,null,null,null,null,null,null,null,null,null,null,"Present"]
[null,"Present Value Costs ($ Dollars) ",null,null,{"$f":"'Final Calculations'!I72","v":0},null,null,null,"ITEMIZED BENEFITS ($ Dollars)",null,null,"Value"]
[null,"Present Value Benefits ($ Dollars) ",null,null,{"$f":"'Final Calculations'!H72","v":{"$error":"#DIV/0!"}},null,null,null,"Safety",null,null,{"$f":"'Final Calculations'!E72","v":0}]
[null,"Net Present Value ($ Dollars)",null,null,{"$f":"'Final Calculations'!J72","v":{"$error":"#DIV/0!"}},null,null,null,"Travel Time",null,null,{"$f":"'Final Calculations'!C72","v":0}]
{"$rows_left_out":5}
{"sheet":"Crash Benefits","index":6,"n_rows":67,"n_cols":13,"rows_kept":67,"cut":false,"hidden":false,"merged":[[4,1,4,8]]}
[null,"ANNUAL CRASH BENEFIT"]
[null,"This sheet calculates the annual monetary benefit based on the Crash Costs for Highway Safety Analysis developed by the FHWA Office of Safety.",null,null,null,null,null,null,null,null,null,"Color Codes"]
[null,"Formula: Annual Crash Reduction Benefit (3)",null,"= (1) Annual Reduction in Crashes x  (2) Comprehensive Crash Unit Cost",null,null,null,null,null,null,null,"Model Parameter",0]
[null,null,null,null,null,null,null,null,null,null,null,"Model Calculation",{"$f":"'2) Project Crash Data'!L32","v":0}]
[null,"CALCULATION FOR THE MONETIZATION OF ANNUAL CRASH BENEFITS",null,null,null,null,null,null,null,null,null,"Linked Cell",{"$f":"'2) Project Crash Data'!J38","v":0}]
[]
[null,null,"Year","Present Value"]
[null,null,1,{"$f":"IF(C8<='1) Project Information'!D$14,(1/(1+(IF('1) Project Information'!$E$17>0,'1) Project Information'!$E$17,'1) Project Information'!$D$17)))^C8)*'Crash Benefits'!$E$67,0)","v":0}]
[null,null,2,{"$f":"IF(C9<='1) Project Information'!D$14,(1/(1+(IF('1) Project Information'!$E$17>0,'1) Project Information'!$E$17,'1) Project Information'!$D$17)))^C9)*'Crash Benefits'!$E$67,0)","v":0}]
[null,null,3,{"$f":"IF(C10<='1) Project Information'!D$14,(1/(1+(IF('1) Project Information'!$E$17>0,'1) Project Information'!$E$17,'1) Project Information'!$D$17)))^C10)*'Crash Benefits'!$E$67,0)","v":0}]
{"$rows_left_out":58}
{"sheet":"Travel Time Benefits","index":7,"n_rows":73,"n_cols":10,"rows_kept":73,"cut":false,"hidden":false,"merged":[[9,1,9,8]]}
[null,"ANNUAL TRAVEL TIME BENEFIT"]
[null,"This sheet calculates the annual monetary benefit of travel time savings as a result of the annual crash reductions. "]
[]
[null,"Formula 1: Delay Reduction (3) ",null,"= (1) Annual Crash Reduction x (2) Reduction Factor",null,null,null,null,"Color Codes"]
[]
[null,"Formula 2: Annual Benefit",null,"= Total Delay x Unit Value of Time",null,null,null,null,"Model Parameter",0]
[null,null,null,null,null,null,null,null,"Model Calculation",{"$f":"'2) Project Crash Data'!G34","v":0}]
[null,null,null,null,null,null,null,null,"Linked Cell",{"$f":"'2) Project Crash Data'!E40","v":0}]
[]
[null,"CALCULATION FOR THE MONETIZATION OF ANNUAL TRAVEL TIME BENEFITS"]
{"$rows_left_out":64}
{"sheet":"LinkCharacteristics","index":8,"n_rows":61,"n_cols":26,"rows_kept":61,"cut":false,"hidden":true,"merged":[]}
["Back"]
["Home",null,"Facility Types"]
[null,null,"ID","Name","Hourly Lane Capacity","FFS","VCCurve","crashRatePickerName",null,null,null,"Speed flow curve(s)",null,null,null,null,null,null,null,null,null,null,"Speed flow curve(s)"]
[null,null,1,"Rural Interstate/Principal Arterial",2200,70,"Freeways","Freeways",null,null,null,null,null,"V/C","Volume","Capacity","FFS","Speed","Factor",null,null,null,null,null,"V/C","Factor"]
[null,null,2,"Urban Interstate/Expressway",2200,70,"Freeways","Freeways",null,null,null,"Freeways",null,0.2,{"$f":"N5*$E$4","v":440},{"$f":"$E$4","v":2200},{"$f":"$F$4","v":70},{"$f":"Q5*S5","v":69.998312663777185},{"$f":"1/(1+0.312*N5^5.883)","v":0.99997589519681684},null,null,null,"Freeways",null,0.2,0.99997589519681684]
[null,null,3,"Urban Arterial",1800,45,"Arterials","Arterials",null,null,null,null,null,0.3,{"$f":"N6*$E$4","v":660},{"$f":"$E$4","v":2200},{"$f":"$F$4","v":70},{"$f":"Q6*S6","v":69.981675030150456},{"$f":"1/(1+0.312*N6^5.883)","v":0.99973821471643498},null,null,null,null,null,0.3,0.99973821471643498]
[null,null,4,"Rural Other",1600,40,"Ramps","Arterials",null,null,null,null,null,0.5,1100,2200,70,69.631868332805496,{"$f":"1/(1+0.312*N7^5.883)","v":0.99474097618293567},null,null,null,null,null,0.5,0.99474097618293567]
[null,null,5,"Urban Other",1600,35,"Arterials","Arterials",null,null,null,null,null,0.7,1540,2200,70,67.419797411401731,0.9631399630200248,null,null,null,null,null,0.7,0.9631399630200248]
[null,null,6,null,null,null,null,null,null,null,null,null,null,0.8,1760,2200,70,64.578482971657436,0.92254975673796347,null,null,null,null,null,0.8,0.92254975673796347]
[null,null,null,null,null,null,null,null,null,null,null,null,null,0.9,1980,2200,70,59.938372726849288,0.85626246752641844,null,{"$f":"+S10*Q10","v":59.938372726849288},null,null,null,0.9,0.85626246752641844]
{"$rows_left_out":52}
{"sheet":"Reliability Benefits","index":9,"n_rows":33,"n_cols":5,"rows_kept":33,"cut":false,"hidden":false,"merged":[[21,4,22,4],[23,4,25,4],[24,6,24,11]]}
["ANNUAL RELIABILITY TIME BENEFIT"]
["This sheet calculates the annual monetary benefit of reliability as a result of the annual crash reductions. "]
[]
["Reliability Calculations","Input Data","Source"]
["Period of Analysis (Years)",{"$f":"'1) Project Information'!D14","v":20},"User or Default"]
["Segment Type",{"$f":"inputFacilityType","v":"Urban Interstate/Expressway"},"User or Default"]
["Segment Length (Miles)",{"$f":"IF('1) Project Information'!$E$25>0,'1) Project Information'!$E$25,'1) Project Information'!$D$25)","v":5},"User or Default"]
["Number of Lanes",{"$f":"IF('1) Project Information'!$E$26>0,'1) Project Information'!$E$26,'1) Project Information'!$D$26)","v":2},"User or Default"]
["Free Flow Speed (MPH)",{"$f":"defaultFFS","v":70},"User or Default"]
["Traffic Volume (during peak period)",{"$f":"+inputLinkVolume","v":0},"User or Default"]
{"$rows_left_out":24}
{"sheet":"Vehicle Operation Benefits","index":10,"n_rows":74,"n_cols":12,"rows_kept":74,"cut":false,"hidden":false,"merged":[[15,1,15,3],[17,1,17,3]]}
[null,"ANNUAL VEHICLE OPERATING COST BENEFIT"]
[null,"This sheet calculates the annual monetary benefit to fuel-related vehicle operating costs as a result of crash reductions. "]
[]
[null,"Formula 1: Annual fuel use reduction",null,"= (1) Estimated Annual Crash Reduction x (2) NHTSA Fuel Use Factor",null,null,null,null,null,null,"Color Codes"]
[null,null,null,null,null,null,null,null,null,null,"Model Parameter",0]
[null,"Formula 2: Annual CO2 reduction",null,"= (5) Estimated Annual Crash Reduction x (6) NHTSA CO2 Factor",null,null,null,null,null,null,"Model Calculation",{"$f":"'2) Project Crash Data'!I34","v":0}]
[null,null,null,null,null,null,null,null,null,null,"Linked Cell",{"$f":"'2) Project Crash Data'!G39","v":0}]
[null,"Monetization of Annual Fuel-Related VOC Benefits"]
[null,null,"(1)","(2)","(3)"]
[null,"Injury Scale","Estimated Annual Crash Reduction","NHTSA Fuel Use Consumption","Annual Fuel Use Reduction Benefit (Gallons)"]
{"$rows_left_out":65}
{"sheet":"Emission Benefits","index":11,"n_rows":79,"n_cols":16,"rows_kept":79,"cut":false,"hidden":false,"merged":[[11,2,11,4],[6,2,6,4],[7,2,7,4],[8,2,8,4],[9,2,9,4],[10,2,10,4]]}
[null,"ANNUAL EMISSIONS BENEFIT"]
[null,"This sheet calculates the annual monetary benefit of emissions reductions as a result of crash reductions. ",null,null,null,null,null,null,null,null,null,null,null,null,"Color Codes"]
[null,null,null,null,null,null,null,null,null,null,null,null,null,null,"Model Parameter",0]
[null,"Formula 1: Annual Emissions Benefit (3)",null,null,null,"= Annual Crash Reduction (1) x NHTSA Emissions Factor (2)",null,null,null,null,null,null,null,null,"Model Calculation",{"$f":"'2) Project Crash Data'!K36","v":0}]
[null,null,null,null,null,null,null,null,null,null,null,null,null,null,"Linked Cell",{"$f":"'2) Project Crash Data'!K37","v":0}]
[null,"Annual Estimated Reduction in Crash Frequency and Severity (1)"]
[null,{"$f":"'2) Project Crash Data'!B31","v":"Injury Severity Scale"},"Annual reductions in crashes with treatment"]
[null,{"$f":"'2) Project Crash Data'!B32","v":"K"},{"$f":"IF('2) Project Crash Data'!G32>0,'2) Project Crash Data'!G32,'2) Project Crash Data'!F32)","v":0}]
[null,{"$f":"'2) Project Crash Data'!B33","v":"A"},{"$f":"IF('2) Project Crash Data'!G33>0,'2) Project Crash Data'!G33,'2) Project Crash Data'!F33)","v":0}]
[null,{"$f":"'2) Project Crash Data'!B34","v":"B"},{"$f":"IF('2) Project Crash Data'!G34>0,'2) Project Crash Data'!G34,'2) Project Crash Data'!F34)","v":0}]
{"$rows_left_out":70}
{"sheet":"Lookup","index":12,"n_rows":64,"n_cols":40,"rows_kept":64,"cut":false,"hidden":false,"merged":[[33,32,34,39],[28,17,29,22],[33,26,34,28],[9,17,9,22],[14,1,16,7],[29,1,33,7],[6,18,8,18],[4,1,4,7],[4,10,4,13],[4,32,4,39],[6,26,6,28],[4,26,4,28],[6,19,8,19],[6,20,8,20],[6,21,8,21],[6,22,8,22],[4,17,4,22]]}
["LOOKUP TABLES"]
["The lookup tables on this worksheet are used to populate the Analysis Parameters worksheet."]
[]
[]
[null,"FMCSA VALUE OF TIME ($2017 Dollars)",null,null,null,null,null,null,null,null,null,null,null,null,null,null,null,"NHTSA TRAVEL TIME DELAY FACTORS",null,null,null,null,null,null,null,null,"NHTSA VEHICLE OPERATING COSTS",null,null,null,null,null,"NHTSA EMIISSIONS FACTORS ($ 2017 Dollars)"]
[null,null,"Inflation Factor 2010-2017",1.1128]
[null,null,null,null,null,null,null,null,null,null,"Severity","Comprehensive Crash Unit Cost",null,null,null,null,null,null,"Urban Interstates/ Expressways\n","Urban Arterials","Urban Other","Rural Interstate/ Principal Arterials","Rural Other",null,null,null,"Net Increase in and Cost of Fuel Consumption, Fatal Crashes",null,null,null,null,null,"Estimated Value of Net Emissions/Crash by Facility Type, All Fatal Crashes ($ 2017 Dollars)"]
[null,null,"Road Type","Average VOT","VOT for Passenger Vehicles","VOT all Trucks","Percentage Trucks","Percentage Cars",null,null,"K",11637947,null,null,null,null,null,null,null,null,null,null,null,null,null,null,"Facility Type",null,"Gallons/fuel",null,null,null,"Facility Type","CO2","CO","NOx","PM10","PM2.5","SO2","VOC"]
[null,null,"Urban Interstate/Expressway",{"$f":"E9*H9+F9*G9","v":27.014666640000002},{"$f":"L57","v":26.006136000000001},{"$f":"((30.48*0.375+37.23*0.625)*$D$6)","v":38.612769},0.08,{"$f":"1-G9","v":0.92},null,null,"A",674353,null,null,null,null,null,null,null,null,null,null,null,null,null,null,"Urban Interstate/Expressway",null,1951,null,null,null,"Urban Interstate/Expressway",827.90094399999998,0,197.58876800000002,0,895.5258,70.785207999999997,23.613616]
[null,null,"Urban Arterial",{"$f":"E10*H10+F10*G10","v":26.603932159999999},{"$f":"L58","v":26.061776000000002},{"$f":"((30.44*0.6+37.25*0.4)*$D$6)","v":36.904899200000003},0.05,{"$f":"1-G10","v":0.95},null,null,"B",204143,null,null,null,null,null,"Fatal Crashes",null,null,null,null,null,null,null,null,"Urban Arterial",null,504,null,null,null,"Urban Arterial",213.6576,0,50.265176000000004,0,133.82532800000001,18.094128000000001,3.9949520000000001]
{"$rows_left_out":55}
{"sheet":"Final Calculations","index":13,"n_rows":76,"n_cols":15,"rows_kept":76,"cut":false,"hidden":false,"merged":[[6,2,6,6]]}
[null,"FINAL CALCULATIONS"]
[null,"This sheet performs the final calculations before presenting the summary results.",null,null,null,null,null,null,null,null,null,null,null,"Color Codes"]
[null,null,null,null,null,null,null,null,null,null,null,null,null,"Model Parameter",0]
[null,"Formula 1: Present Value of Costs and Benefits",null,null,"=  Future Value  (in Constant Dollars) /   ( 1 + Real Discount Rate) ^ Year",null,null,null,null,null,null,null,null,"Model Calculation",{"$f":"'2) Project Crash Data'!L32","v":0}]
[null,null,null,null,null,null,null,null,null,null,null,null,null,"Linked Cell",{"$f":"'2) Project Crash Data'!J37","v":0}]
[]
[null,null,"PRESENT VALUE OF USER BENEFITS",null,null,null,null,"Present","Present"]
[null,null,null,null,null,null,null,"Value","Value"]
[null,null,"Travel","Vehicle",null,"Vehicle",null,"of Total","of Total","NET"]
[null,"Year","Time","VOC","Crash ","Emission","Reliability","User","Project","PRESENT"]
{"$rows_left_out":66}