{"text_format":"1","workbook":"xlsx","n_sheets":23,"sheets":["Setup","Specs","Agg","Rap","Agg Blends",".45 Power","Gmm","Trial Blends","VCA","Design Agg","Gmm2","AC Trials","AC Charts","Nmax","Drain Down","T-283","Height Data","Correction Factor","TR 448A","Sheet1","Blend 1","Blend 2","Blend 3"],"not_rendered":{"charts":9,"images":1,"macros":1,"external_links":4,"defined_names":44,"comments":2,"pivot_tables":0},"unopened":[],"bounds":{"document_bytes":16777216,"sheet_cells":100000,"rows_first":2000,"rows_last":500,"rows_between":2000,"halvings":0,"cell_chars":16384,"cell_head_chars":4096},"cells_cut":0,"cells_raw":0,"read":"whole","date_system":"1900"}

{"sheet":"Setup","index":0,"n_rows":43,"n_cols":29,"rows_kept":43,"cut":false,"hidden":false,"merged":[[13,7,13,9],[13,17,13,18],[14,17,14,18],[15,17,15,18],[23,2,23,4],[23,5,23,6],[14,2,14,3],[14,4,14,6],[15,2,15,3],[15,4,15,6],[16,2,16,3],[16,4,16,6],[13,2,13,3],[13,4,13,6],[10,4,10,6],[12,2,12,3],[12,4,12,6],[28,2,28,6],[24,2,24,4],[24,5,24,6],[25,2,25,6],[21,2,21,6],[17,2,17,3],[17,4,17,6],[20,2,20,4],[20,5,20,6],[19,5,19,6],[19,2,19,4],[29,1,30,7],[8,2,8,3],[8,4,8,6],[2,0,3,8],[5,2,5,3],[5,4,5,6],[6,2,6,3],[6,4,6,6],[7,4,7,6],[4,2,4,3],[4,4,4,6],[9,2,9,3],[9,4,9,6],[11,2,11,3],[11,4,11,6],[10,2,10,3],[31,1,31,3],[32,1,32,3],[33,1,33,3],[34,1,34,3],[31,5,31,6]]}
[null,null,null,null,null,null,null,null,null,null,null,null,4.75,"SP4.75",null,null,null,null,null,{"$f":"IF(E13=\"<.3\",1,IF(E13=\".3 to <3\",2,IF(OR(E13=\"3 to <10\",E13=\"10 to <30\",E13=\"3 to <30\",E13=\">30\"),3)))","v":false}]
["ESB-21",null,null,null,null,null,null,null,null,null,null,null,6.33,"SR4.75"]
["PA DESIGN SOFTWARE FOR HMA AND SMA",null,null,null,null,null,null,null,null,null,null,null,9.5,"SP6.33"]
[null,null,null,null,null,null,null,null,null,null,null,null,12.5,"SP9.5"]
[null,null,"JMF ID",null,null,null,null,null,null,null,null,null,19,"SR9.5"]
[null,null,"Date",null,null,null,null,null,null,null,null,null,25,"SP12.5",null,null,null,null,null,null,null,null,null,null,null,null,null,null,{"$f":"IF(ISBLANK(E6),\"\",YEAR(E6))","v":""}]
[null,null,"Producer",null,null,null,null,null,null,null,null,null,37.5,"SR12.5"]
[null,null,"Plant Code"]
[null,null,"Designed by",null,null,null,null,null,null,null,null,null,"<.3","SP19W"]
[null,null,"Nominal Size of Mix",null,null,null,null,null,null,null,null,null,".3 to <3","SP19B"]
[null,null,"Material Class",null,null,null,null,null,null,null,null,null,"3 to <10","SR19W"]
[null,null,"SRL",null,null,null,null,null,null,null,null,null,"10 to <30","SR19B"]
[null,null,"Esals",null,null,null,null,null,null,null,null,null,"3 to <30","SP25B"]
[null,null,"Asphalt Supplier",null,null,null,null,"Additional Asphalt Suppliers",null,null,null,null,">30","SP25BC"]
[null,null,"Grade of Asphalt",null,null,null,null,null,null,null,null,null,null,"SR25B"]
[null,null,"Gb of Asphalt",null,null,null,null,null,null,null,null,null,null,"SR25BC"]
[null,null,"Gyrations @ Ndesign",null,null,null,null,null,null,null,null,null,null,"SP37.5"]
[null,null,"Percent Rcycled",null,null,null,null,null,null,null,null,null,null,"SR37.5",null,"Volumeter"]
[null,null,null,null,null,null,null,null,null,null,null,null,null,"SMA95",null,"Suspension"]
[null,null,"Method of Testing Max Gravity",null,null,null,null,null,null,null,null,null,null,"SMA125"]
[null,null,"Calibration of Volumeter",null,null,null,null,null,null,null,null,null,null,"ATPBC"]
[null,null,"(Weight of volumeter + H2O or Weight of volumeter in H2O)",null,null,null,null,null,null,null,null,null,null,"WM6.33"]
[null,null,null,null,null,null,null,null,null,null,null,null,null,"WM9.5"]
[null,null,"Method of Testing Plug Gravity",null,null,null,null,null,null,null,null,null,null,"WR9.5"]
[null,null,"Calibration of Volumeter",null,null,null,null,null,null,null,null,null,null,"WM12.5"]
[null,null,"(Weight of volumeter + H2O or Weight of volumeter in H2O)",null,null,null,null,null,null,null,null,null,null,"WR12.5"]
[null,null,null,null,null,null,null,null,null,null,null,null,null,"WM19W"]
[null,null,null,null,null,null,null,null,null,null,null,null,null,"WM19B"]
[null,null,"Equipment Information.",null,null,null,null,null,null,null,null,null,null,"WR19W"]
[null,"List and identify each ignition oven that will be used for testing. If Centrifuge method is used for Ashalt Content determination, enter \"Centrifuge\"",null,null,null,null,null,null,null,null,null,null,null,"WR19B"]
[null,null,null,null,null,null,null,null,null,null,null,null,null,"WM25B"]
[null,"Gyratory Manufacturer",null,null,null,"Mold Diameter (mm)",null,null,null,null,null,null,null,"WR25B"]
[null,"Ignition Oven Manufacturer",null,null,null,null,null,null,null,null,null,null,null,"WR25BC"]
[null,"Ignition Oven Identification",null,null,null,null,null,null,null,null,null,null,null,"WM37.5"]
[null,"Oven Set Temperature (celsius)",null,null,null,null,null,null,null,null,null,null,null,"WR37.5"]
[null,null,null,null,null,null,null,null,null,null,null,null,null,"SP19W / SP19B"]
[null,null,null,null,null,null,null,null,null,null,null,null,null,"SR19W / SR19B"]
[null,null,null,null,null,null,null,null,null,null,null,null,null,"SP25B / SP25BC"]
[null,null,null,null,null,null,null,null,null,null,null,null,null,"SR25B / SR25BC"]
[null,null,null,null,null,null,null,null,null,null,null,null,null,"WM19W / WM19B"]
[null,null,null,null,null,null,null,null,null,null,null,null,null,"WR19W / WR19B"]
[null,null,null,null,null,null,null,null,null,null,null,null,null,"WM25B / WM25BC"]
[null,null,null,null,null,null,null,null,null,null,null,null,null,"WR25B / WR25BC"]

{"sheet":"Specs","index":1,"n_rows":57,"n_cols":81,"rows_kept":57,"cut":false,"hidden":true,"merged":[[55,28,55,32],[55,33,55,39],[56,28,56,32],[56,33,56,39],[52,28,52,32],[52,33,52,39],[53,28,53,32],[53,33,53,39],[54,28,54,32],[54,33,54,39],[49,28,49,32],[49,33,49,39],[50,28,50,32],[50,33,50,39],[51,28,51,32],[51,33,51,39],[46,28,46,32],[46,33,46,39],[47,28,47,32],[47,33,47,39],[48,28,48,32],[48,33,48,39],[43,28,43,32],[43,33,43,39],[44,28,44,32],[44,33,44,39],[45,28,45,32],[45,33,45,39],[38,28,38,32],[38,33,38,39],[39,28,39,32],[39,33,39,39],[41,28,41,39],[42,28,42,32],[42,33,42,39],[35,28,35,32],[35,33,35,39],[36,28,36,32],[36,33,36,39],[37,28,37,32],[37,33,37,39],[31,28,31,39],[32,28,32,32],[32,33,32,39],[33,28,33,32],[33,33,33,39],[34,28,34,32],[34,33,34,39],[28,28,28,33],[28,34,28,36],[28,37,28,39],[29,28,29,33],[29,34,29,36],[29,37,29,39],[26,67,26,78],[27,28,27,33],[27,34,27,36],[27,37,27,39],[27,67,27,68],[27,69,27,70],[27,71,27,72],[27,73,27,74],[27,75,27,76],[27,77,27,78],[25,28,25,33],[25,34,25,36],[25,37,25,39],[26,28,26,33],[26,34,26,36],[26,37,26,39],[23,28,23,33],[23,34,23,36],[23,37,23,39],[24,28,24,33],[24,34,24,36],[24,37,24,39],[18,28,18,39],[18,67,22,67],[18,68,22,68],[19,28,19,33],[19,34,19,36],[19,37,19,39],[20,28,20,33],[23,65,23,67],[23,69,23,74],[20,34,20,36],[20,37,20,39],[20,66,22,66],[21,28,21,33],[21,34,21,36],[21,37,21,39],[22,28,22,33],[22,34,22,36],[22,37,22,39],[15,23,15,33],[15,34,15,44],[15,65,17,65],[15,66,15,68],[15,69,15,74],[15,75,15,80],[16,34,16,44],[16,66,17,66],[16,67,17,67],[16,68,17,68],[16,69,16,74],[16,75,16,80],[17,28,17,39],[11,23,11,33],[11,71,11,72],[12,23,12,33],[12,71,12,72],[13,23,13,33],[14,23,14,33],[14,34,14,44],[8,23,8,33],[8,71,8,72],[9,23,9,33],[9,71,9,72],[10,23,10,33],[10,71,10,72],[5,75,6,76],[5,77,7,77],[5,78,7,78],[6,23,6,33],[6,34,6,44],[7,23,7,33],[7,34,7,35],[0,23,0,24],[2,23,3,44],[5,23,5,44],[5,66,6,66],[5,71,7,72],[5,73,6,74]]}
[]
[]
[null,null,null,null,null,null,null,null,null,null,null,null,null,null,null,null,null,null,null,null,null,null,null,"Specification Requirements for SMA",null,null,null,null,null,null,null,null,null,null,null,null,null,null,null,null,null,null,null,null,null,null,null,null,null,null,null,null,null,null,null,null,null,null,null,null,null,null,null,null,null,"    SUPERPAVE SPECIFICATION REFERENCES"]
[null,null,null,null,null,null,null,null,null,null,null,null,null,null,null,null,null,null,null,null,null,null,null,null,null,null,null,null,null,null,null,null,null,null,null,null,null,null,null,null,null,null,null,null,null,null,null,null,null,null,null,null,null,null,null,null,null,null,null,null,null,null,null,null,null,null,"Revision to AASHTO R35 Bulletin 27 change 3",null,null,null,null,"Revision to AASHTO M323 Bulletin 27 change 3"]
[null,null,null,null,null,null,null,null,null,null,null,null,null,null,null,null,null,null,null,null,null,null,null,null,null,null,null,null,null,null,null,null,null,null,null,null,null,null,null,null,null,null,null,null,null,null,null,null,null,null,null,null,null,null,null,null,null,null,null,null,null,null,null,null,null,null,"Table 1 - Gyratory Compaction Effort",null,null,null,null,"Table 5 - Superpave Aggregate Consensus Property Requirements"]
[null,null,null,null,null,null,null,null,null,null,null,null,null,null,null,null,null,null,null,null,null,null,null,"Aggregate Quality Requirements",null,null,null,null,null,null,null,null,null,null,null,null,null,null,null,null,null,null,null,null,null,null,null,null,null,null,null,null,null,null,null,null,null,null,null,null,null,null,null,null,null,null,"Design ESALs (millions)","Compaction Parameters",null,null,null,"Design ESALs (millions)",null,"Coarse Aggregate Angularity (Percent), minimum",null,"Uncompacted Voids of Fine Aggregate (Percent), minimum",null,"Sand Equivalent (Percent), minimum","Flat and Elongated (Percent), maximum"]
[null,null,null,null,null,null,null,null,null,null,null,null,null,null,null,null,null,null,null,null,null,null,null,"Characteristic",null,null,null,null,null,null,null,null,null,null,"Required Values",null,null,null,null,null,null,null,null,null,null,null,null,null,null,null,null,null,null,null,null,null,null,null,null,null,null,null,null,null,null,null,null,"Ninitial","Ndesign","Nmax"]
[null,null,null,null,null,null,null,null,null,null,null,null,null,null,null,null,null,null,null,null,null,null,null,"Abrasion, Max %.",null,null,null,null,null,null,null,null,null,null,35,null,null,null,null,null,null,null,null,null,null,null,null,null,null,null,null,null,null,null,null,null,null,null,null,null,null,null,null,null,null,null,"<0.3",6,50,75,null,null,null,"£ 100 mm","> 100 mm","£ 100 mm","> 100 mm"]
[null,null,null,null,null,null,null,null,null,null,null,null,null,null,null,null,null,null,null,null,null,null,null,"Flat and Elongates Particles, % Max. ASTM D 4791",null,null,null,null,null,null,null,null,null,null,null,null,null,null,null,null,null,null,null,null,null,null,null,null,null,null,null,null,null,null,null,null,null,null,null,null,null,null,null,null,null,null,"0.3 to < 3",7,75,115,null,"<0.3",null,"55/-","-/-","-","-",40,"-"]
[null,null,null,null,null,null,null,null,null,null,null,null,null,null,null,null,null,null,null,null,null,null,null,"(measured by mass or by material retained on or above ",null,null,null,null,null,null,null,null,null,null,null,null,null,null,null,null,null,null,null,null,null,null,null,null,null,null,null,null,null,null,null,null,null,null,null,null,null,null,null,null,null,null,"3 to < 30",8,100,160,null,"0.3 to < 3",null,"75/-","50/-",40,40,40,10]
[null,null,null,null,null,null,null,null,null,null,null,null,null,null,null,null,null,null,null,null,null,null,null,"the #4 sieve)",null,null,null,null,null,null,null,null,null,null,null,null,null,null,null,null,null,null,null,null,null,null,null,null,null,null,null,null,null,null,null,null,null,null,null,null,null,null,null,null,null,null,null,null,null,null,null,"3 to < 10",null,"85/80","60/-",45,40,45]
[null,null,null,null,null,null,null,null,null,null,null,null,null,null,null,null,null,null,null,null,null,null,null,"3:1",null,null,null,null,null,null,null,null,null,null,20,null,null,null,null,null,null,null,null,null,null,null,null,null,null,null,null,null,null,null,null,null,null,null,null,null,null,null,null,null,null,null,null,null,null,null,null,"3 to < 30",null,"95/90","80/75",45,40,45]
[null,null,null,null,null,null,null,null,null,null,null,null,null,null,null,null,null,null,null,null,null,null,null,"5:1",null,null,null,null,null,null,null,null,null,null,10,null,null,null,null,null,null,null,null,null,null,null,null,null,null,null,null,null,null,null,null,null,null,null,null,null,null,null,null,null,null,null,null,null,null,null,null,"³ 30",null,"95/90","95/90",45,45,50]
[null,null,null,null,null,null,null,null,null,null,null,null,null,null,null,null,null,null,null,null,null,null,null,"Absorption, Max % AASHTO T85",null,null,null,null,null,null,null,null,null,null,2,null,null,null,null,null,null,null,null,null,null,null,null,null,null,null,null,null,null,null,null,null,null,null,null,null,null,null,null,null,null,"Revision to AASHTO M323 Bulletin 27 change 3"]
[null,null,null,null,null,null,null,null,null,null,null,null,null,null,null,null,null,null,null,null,null,null,null,"Crushed fragments, Min %",null,null,null,null,null,null,null,null,null,null,"100 for one fractured face",null,null,null,null,null,null,null,null,null,null,null,null,null,null,null,null,null,null,null,null,null,null,null,null,null,null,null,null,null,null,"Table 6 - Superpave Volumetric Mixture Design Requirements"]
[null,null,null,null,null,null,null,null,null,null,null,null,null,null,null,null,null,null,null,null,null,null,null,null,null,null,null,null,null,null,null,null,null,null,"90 for two fractured faces",null,null,null,null,null,null,null,null,null,null,null,null,null,null,null,null,null,null,null,null,null,null,null,null,null,null,null,null,null,null,"Design ESALs (millions)","Required Density (% of Theoretical Maximum Specific Gravity)",null,null,"Voids-in-the Mineral Aggregate, (Percent) minimum",null,null,null,null,null,"Voids Filled With Asphalt (Percent) minimum"]
[null,null,null,null,null,null,null,null,null,null,null,null,null,null,null,null,null,null,null,null,null,null,null,null,null,null,null,null,null,null,null,null,null,null,null,null,null,null,null,null,null,null,null,null,null,null,null,null,null,null,null,null,null,null,null,null,null,null,null,null,null,null,null,null,null,null,"Ninitial","Ndesign","Nmax","Nominal Maximum Aggregate Size, mm",null,null,null,null,null,"Nominal Maximum Aggregate Size, mm"]
[null,null,null,null,null,null,null,null,null,null,null,null,null,null,null,null,null,null,null,null,null,null,null,null,null,null,null,null,"Mix Design Reqqirements for SMA",null,null,null,null,null,null,null,null,null,null,null,null,null,null,null,null,null,null,null,null,null,null,null,null,null,null,null,null,null,null,null,null,null,null,null,null,null,null,null,null,37.5,25,19,12.5,9.5,4.75,37.5,25,19,12.5,9.5,4.75]
[null,null,null,null,null,null,null,null,null,null,null,null,null,null,null,null,null,null,null,null,null,null,null,null,null,null,null,null,"Aggregate Gradation Requirements, Percent passing",null,null,null,null,null,null,null,null,null,null,null,null,null,null,null,null,null,null,null,null,null,null,null,null,null,null,null,null,null,null,null,null,null,null,null,null,"<0.3","£91.5","96.0","£98.0",11.5,12.5,13.5,15,16,16,"65-78","68-78","70-78","73-78","75-78","75-78"]
[null,null,null,null,null,null,null,null,null,null,null,null,null,null,null,null,null,null,null,null,null,null,null,null,null,null,null,null,"Sieve Size",null,null,null,null,null,"9.5 mm",null,null,"12.5 mm",null,null,null,null,null,null,null,null,null,null,null,null,null,null,null,null,null,null,null,null,null,null,null,null,null,null,null,"0.3 to < 3","£90.5",null,null,11.5,12.5,13.5,15,16,16,"65-78","68-78","70-78","73-78","75-78","75-78"]
[null,null,null,null,null,null,null,null,null,null,null,null,null,null,null,null,null,null,null,null,null,null,null,null,null,null,null,null,"19.0mm (3/4)",null,null,null,null,null,null,null,null,100,null,null,null,null,null,null,null,null,null,null,null,null,null,null,null,null,null,null,null,null,null,null,null,null,null,null,null,"3 to < 10","£89.0",null,null,11.5,12.5,13.5,15,15.5,16,"65-75","68-75","70-75.","73-75","75-76","75-78"]
[null,null,null,null,null,null,null,null,null,null,null,null,null,null,null,null,null,null,null,null,null,null,null,null,null,null,null,null,"12.5mm (1/2)",null,null,null,null,null,100,null,null,"90-99",null,null,null,null,null,null,null,null,null,null,null,null,null,null,null,null,null,null,null,null,null,null,null,null,null,null,null,"3 to < 30",null,null,null,11.5,12.5,13.5,15,15.5,16,"65-75","68-75","70-75","73-75","75-76","75-78"]
[null,null,null,null,null,null,null,null,null,null,null,null,null,null,null,null,null,null,null,null,null,null,null,null,null,null,null,null,"9.5mm (3/8)",null,null,null,null,null,"75-95",null,null,"70-85",null,null,null,null,null,null,null,null,null,null,null,null,null,null,null,null,null,null,null,null,null,null,null,null,null,null,null,"³ 30",null,null,null,11.5,12.5,13.5,15,15.5,16,"65-75","68-75","70-75","73-75","75-76","75-78"]
[null,null,null,null,null,null,null,null,null,null,null,null,null,null,null,null,null,null,null,null,null,null,null,null,null,null,null,null,"4.75mm (No 4)",null,null,null,null,null,"30-50",null,null,"28-40",null,null,null,null,null,null,null,null,null,null,null,null,null,null,null,null,null,null,null,null,null,null,null,null,null,null,null,"Dust-to-Binder Ratio",null,null,null,"0.6 -1.2"]
[null,null,null,null,null,null,null,null,null,null,null,null,null,null,null,null,null,null,null,null,null,null,null,null,null,null,null,null,"2.36mm (No 8)",null,null,null,null,null,"20-30",null,null,"18-30",null,null,null,null,null,null,null,null,null,null,null,null,null,null,null,null,null,null,null,null,null,null,null,null,null,null,null,null,null,"Revision to AASHTO M323 Bulletin 27 change 3"]
[null,null,null,null,null,null,null,null,null,null,null,null,null,null,null,null,null,null,null,null,null,null,null,null,null,null,null,null,"1.18mm (No 16)",null,null,null,null,null,"-",null,null,"-",null,null,null,null,null,null,null,null,null,null,null,null,null,null,null,null,null,null,null,null,null,null,null,null,null,null,null,null,null,"Table 3 - Aggregate Gradation Control Points"]
[null,null,null,null,null,null,null,null,null,null,null,null,null,null,null,null,null,null,null,null,null,null,null,null,null,null,null,null,"600μm (No 30)",null,null,null,null,null,"-",null,null,"-",null,null,null,null,null,null,null,null,null,null,null,null,null,null,null,null,null,null,null,null,null,null,null,null,null,null,null,null,null,"Nominal Maximum Aggregate Size - Control Points (Percent Passing)"]
[null,null,null,null,null,null,null,null,null,null,null,null,null,null,null,null,null,null,null,null,null,null,null,null,null,null,null,null,"300μm (No 50)",null,null,null,null,null,"-",null,null,"-",null,null,null,null,null,null,null,null,null,null,null,null,null,null,null,null,null,null,null,null,null,null,null,null,null,null,null,null,null,"37.5 mm",null,"25.0 mm",null,"19.0 mm",null,"12.5 mm",null,"9.5 mm",null,"4.75 mm"]
[null,null,null,null,null,null,null,null,null,null,null,null,null,null,null,null,null,null,null,null,null,null,null,null,null,null,null,null,"150μm (No 100)",null,null,null,null,null,"-",null,null,"-",null,null,null,null,null,null,null,null,null,null,null,null,null,null,null,null,null,null,null,null,null,null,null,null,null,null,null,null,"Sieve Size","Min.","Max.","Min.","Max.","Min.","Max.","Min.","Max.","Min.","Max.","Min.","Max."]
[null,null,null,null,null,null,null,null,null,null,null,null,null,null,null,null,null,null,null,null,null,null,null,null,null,null,null,null,".075μm (No 200)",null,null,null,null,null,"8-13",null,null,"8-11",null,null,null,null,null,null,null,null,null,null,null,null,null,null,null,null,null,null,null,null,null,null,null,null,null,null,null,null,"50mm",100]
[null,null,null,null,null,null,null,null,null,null,null,null,null,null,null,null,null,null,null,null,null,null,null,null,null,null,null,null,null,null,null,null,null,null,null,null,null,null,null,null,null,null,null,null,null,null,null,null,null,null,null,null,null,null,null,null,null,null,null,null,null,null,null,null,null,null,"37.5mm",90,100,100]
[null,null,null,null,null,null,null,null,null,null,null,null,null,null,null,null,null,null,null,null,null,null,null,null,null,null,null,null,"Volumetric Design Requirements",null,null,null,null,null,null,null,null,null,null,null,null,null,null,null,null,null,null,null,null,null,null,null,null,null,null,null,null,null,null,null,null,null,null,null,null,null,"25.0mm",null,89,90,100,100]
[null,null,null,null,null,null,null,null,null,null,null,null,null,null,null,null,null,null,null,null,null,null,null,null,null,null,null,null,"Design Gyrations",null,null,null,null,100,null,null,null,null,null,null,null,null,null,null,null,null,null,null,null,null,null,null,null,null,null,null,null,null,null,null,null,null,null,null,null,null,"19.0mm",null,null,null,89,90,100,100]
[null,null,null,null,null,null,null,null,null,null,null,null,null,null,null,null,null,null,null,null,null,null,null,null,null,null,null,null,"VMA",null,null,null,null,"18.0 % Min.",null,null,null,null,null,null,null,null,null,null,null,null,null,null,null,null,null,null,null,null,null,null,null,null,null,null,null,null,null,null,null,null,"12.5mm",null,null,null,null,null,89,90,100,100,null,100]
[null,null,null,null,null,null,null,null,null,null,null,null,null,null,null,null,null,null,null,null,null,null,null,null,null,null,null,null,"Coarse Agg. Structure",null,null,null,null,"VCAMIX < VCADRC",null,null,null,null,null,null,null,null,null,null,null,null,null,null,null,null,null,null,null,null,null,null,null,null,null,null,null,null,null,null,null,null,"9.5mm",null,null,null,null,null,null,null,89,90,100,95,100]
[null,null,null,null,null,null,null,null,null,null,null,null,null,null,null,null,null,null,null,null,null,null,null,null,null,null,null,null,"Design Air Voids",null,null,null,null,"3.5 - 4.0 %",null,null,null,null,null,null,null,null,null,null,null,null,null,null,null,null,null,null,null,null,null,null,null,null,null,null,null,null,null,null,null,null,"4.75mm",null,null,null,null,null,null,null,null,null,89,89,100]
[null,null,null,null,null,null,null,null,null,null,null,null,null,null,null,null,null,null,null,null,null,null,null,null,null,null,null,null,"Binder Grade",null,null,null,null,"PG 76-22",null,null,null,null,null,null,null,null,null,null,null,null,null,null,null,null,null,null,null,null,null,null,null,null,null,null,null,null,null,null,null,null,"2.36mm",15,41,19,45,23,49,28,58,32,67]
[null,null,null,null,null,null,null,null,null,null,null,null,null,null,null,null,null,null,null,null,null,null,null,null,null,null,null,null,"Stabilizer Content",null,null,null,null,"Celulose: 0.2 to 0.4 by total mix wt.",null,null,null,null,null,null,null,null,null,null,null,null,null,null,null,null,null,null,null,null,null,null,null,null,null,null,null,null,null,null,null,null,"1.18mm",null,null,null,null,null,null,null,null,null,null,30,60]
[null,null,null,null,null,null,null,null,null,null,null,null,null,null,null,null,null,null,null,null,null,null,null,null,null,null,null,null,null,null,null,null,null,"Mineral: 0.3 to 0.4 by total mix wt.",null,null,null,null,null,null,null,null,null,null,null,null,null,null,null,null,null,null,null,null,null,null,null,null,null,null,null,null,null,null,null,null,"600µm"]
[null,null,null,null,null,null,null,null,null,null,null,null,null,null,null,null,null,null,null,null,null,null,null,null,null,null,null,null,"Draindown",null,null,null,null,"0.3 maximum",null,null,null,null,null,null,null,null,null,null,null,null,null,null,null,null,null,null,null,null,null,null,null,null,null,null,null,null,null,null,null,null,"300µm"]
[null,null,null,null,null,null,null,null,null,null,null,null,null,null,null,null,null,null,null,null,null,null,null,null,null,null,null,null,null,null,null,null,null,null,null,null,null,null,null,null,null,null,null,null,null,null,null,null,null,null,null,null,null,null,null,null,null,null,null,null,null,null,null,null,null,null,"150µm"]
[null,null,null,null,null,null,null,null,null,null,null,null,null,null,null,null,null,null,null,null,null,null,null,null,null,null,null,null,"Minimum Asphalt  Requiremnets for SMA Mixtures",null,null,null,null,null,null,null,null,null,null,null,null,null,null,null,null,null,null,null,null,null,null,null,null,null,null,null,null,null,null,null,null,null,null,null,null,null,"75µm",0,6,1,7,2,8,2,10,2,10,6,12]
[null,null,null,null,null,null,null,null,null,null,null,null,null,null,null,null,null,null,null,null,null,null,null,null,null,null,null,null,"Combined Aggregate",null,null,null,null,"Minimin Asphalt Content % by"]
[null,null,null,null,null,null,null,null,null,null,null,null,null,null,null,null,null,null,null,null,null,null,null,null,null,null,null,null,"Bulk Specific Gravity",null,null,null,null,"Total Mix Weight",null,null,null,null,null,null,null,null,null,null,null,null,null,null,null,null,null,null,null,null,null,null,null,null,null,null,null,null,null,null,null,null,null,null,"AASHTO M323"]
[null,null,null,null,null,null,null,null,null,null,null,null,null,null,null,null,null,null,null,null,null,null,null,null,null,null,null,null,2.4,null,null,null,null,7.4,null,null,null,null,null,null,null,null,null,null,null,null,null,null,null,null,null,null,null,null,null,null,null,null,null,null,null,null,null,null,null,null,null,null,"Table 4 - PCS Control Point for Mixture Nominal Maximum Aggregate Size"]
[null,null,null,null,null,null,null,null,null,null,null,null,null,null,null,null,null,null,null,null,null,null,null,null,null,null,null,null,2.4500000000000002,null,null,null,null,7.2,null,null,null,null,null,null,null,null,null,null,null,null,null,null,null,null,null,null,null,null,null,null,null,null,null,null,null,null,null,null,null,null,null,null,"Nominal Maximum Aggregate Size",null,null,"37.5 mm","25.0 mm","19.0 mm","12.5 mm","9.5 mm"]
[null,null,null,null,null,null,null,null,null,null,null,null,null,null,null,null,null,null,null,null,null,null,null,null,null,null,null,null,2.5,null,null,null,null,7.1,null,null,null,null,null,null,null,null,null,null,null,null,null,null,null,null,null,null,null,null,null,null,null,null,null,null,null,null,null,null,null,null,null,null,"Primary Control Sieve",null,null,"9.5 mm","4.75 mm","4.75 mm","2.36 mm","2.36 mm"]
[null,null,null,null,null,null,null,null,null,null,null,null,null,null,null,null,null,null,null,null,null,null,null,null,null,null,null,null,2.5499999999999998,null,null,null,null,7]
[null,null,null,null,null,null,null,null,null,null,null,null,null,null,null,null,null,null,null,null,null,null,null,null,null,null,null,null,2.6,null,null,null,null,6.8]
[null,null,null,null,null,null,null,null,null,null,null,null,null,null,null,null,null,null,null,null,null,null,null,null,null,null,null,null,2.65,null,null,null,null,6.7]
[null,null,null,null,null,null,null,null,null,null,null,null,null,null,null,null,null,null,null,null,null,null,null,null,null,null,null,null,2.7,null,null,null,null,6.6]
[null,null,null,null,null,null,null,null,null,null,null,null,null,null,null,null,null,null,null,null,null,null,null,null,null,null,null,null,2.75,null,null,null,null,6.5,null,null,null,null,null,null,null,null,null,null,null,null,null,null,null,null,null,null,null,null,null,null,null,null,null,null,null,null,null,null,null,null,null,null,"PCS Control Point (% Passing)",null,null,47,40,47,39,47]
[null,null,null,null,null,null,null,null,null,null,null,null,null,null,null,null,null,null,null,null,null,null,null,null,null,null,null,null,2.8,null,null,null,null,6.4]
[null,null,null,null,null,null,null,null,null,null,null,null,null,null,null,null,null,null,null,null,null,null,null,null,null,null,null,null,2.85,null,null,null,null,6.3]
[null,null,null,null,null,null,null,null,null,null,null,null,null,null,null,null,null,null,null,null,null,null,null,null,null,null,null,null,2.9,null,null,null,null,6.2]
[null,null,null,null,null,null,null,null,null,null,null,null,null,null,null,null,null,null,null,null,null,null,null,null,null,null,null,null,2.95,null,null,null,null,6.1]
[null,null,null,null,null,null,null,null,null,null,null,null,null,null,null,null,null,null,null,null,null,null,null,null,null,null,null,null,3,null,null,null,null,6]

{"sheet":"Agg","index":2,"n_rows":163,"n_cols":29,"rows_kept":163,"cut":false,"hidden":false,"merged":[[0,0,0,3],[2,1,2,24],[3,2,3,4],[3,5,3,8],[3,9,3,12],[3,13,3,16],[3,18,3,21],[14,0,14,4],[14,5,14,8],[14,9,14,12],[14,13,14,16],[14,17,14,20],[14,21,14,24],[7,1,9,24],[11,5,11,24],[13,0,13,4],[13,5,13,8],[13,9,13,12],[13,13,13,16],[13,17,13,20],[13,21,13,24],[4,22,4,23],[5,2,5,4],[5,5,5,7],[5,9,5,12],[5,13,5,15],[5,17,5,18],[5,19,5,21],[5,22,5,23],[4,2,4,4],[4,5,4,8],[4,9,4,12],[4,13,4,15],[4,17,4,18],[4,19,4,21],[17,1,17,4],[17,5,17,8],[17,9,17,12],[17,13,17,16],[17,17,17,20],[17,21,17,24],[16,0,16,4],[16,5,16,8],[16,9,16,12],[16,13,16,16],[16,17,16,20],[16,21,16,24],[15,0,15,4],[15,5,15,8],[15,9,15,12],[15,13,15,16],[15,17,15,20],[15,21,15,24],[19,17,19,18],[19,19,19,20],[19,21,19,22],[19,23,19,24],[20,5,20,6],[20,7,20,8],[20,9,20,10],[20,11,20,12],[20,13,20,14],[20,15,20,16],[18,17,18,18],[18,19,18,20],[18,21,18,22],[18,23,18,24],[19,5,19,6],[19,7,19,8],[19,9,19,10],[19,11,19,12],[19,13,19,14],[19,15,19,16],[18,5,18,6],[18,7,18,8],[18,9,18,10],[18,11,18,12],[18,13,18,14],[18,15,18,16],[21,17,21,18],[21,19,21,20],[21,21,21,22],[21,23,21,24],[22,5,22,6],[22,7,22,8],[22,9,22,10],[22,11,22,12],[22,13,22,14],[22,15,22,16],[20,17,20,18],[20,19,20,20],[20,21,20,22],[20,23,20,24],[21,5,21,6],[21,7,21,8],[21,9,21,10],[21,11,21,12],[21,13,21,14],[21,15,21,16],[23,17,23,18],[23,19,23,20],[23,21,23,22],[23,23,23,24],[24,5,24,6],[24,7,24,8],[24,9,24,10],[24,11,24,12],[24,13,24,14],[24,15,24,16],[22,17,22,18],[22,19,22,20],[22,21,22,22],[22,23,22,24],[23,5,23,6],[23,7,23,8],[23,9,23,10],[23,11,23,12],[23,13,23,14],[23,15,23,16],[25,17,25,18],[25,19,25,20],[25,21,25,22],[25,23,25,24],[26,5,26,6],[26,7,26,8],[26,9,26,10],[26,11,26,12],[26,13,26,14],[26,15,26,16],[24,17,24,18],[24,19,24,20],[24,21,24,22],[24,23,24,24],[25,5,25,6],[25,7,25,8],[25,9,25,10],[25,11,25,12],[25,13,25,14],[25,15,25,16],[29,0,29,4],[29,5,29,8],[29,9,29,12],[29,13,29,16],[29,17,29,20],[29,21,29,24],[28,0,28,4],[28,5,28,8],[28,9,28,12],[28,13,28,16],[28,17,28,20],[28,21,28,24],[26,17,26,18],[26,19,26,20],[26,21,26,22],[26,23,26,24],[27,0,27,4],[27,5,27,8],[27,9,27,12],[27,13,27,16],[27,17,27,20],[27,21,27,24],[33,5,33,24],[35,0,35,4],[35,5,35,8],[35,9,35,12],[35,13,35,16],[35,17,35,20],[35,21,35,24],[31,0,31,4],[31,5,31,8],[31,9,31,12],[31,13,31,16],[31,17,31,20],[31,21,31,24],[30,0,30,4],[30,5,30,8],[30,9,30,12],[30,13,30,16],[30,17,30,20],[30,21,30,24],[38,0,38,4],[38,5,38,8],[38,9,38,12],[38,13,38,16],[38,17,38,20],[38,21,38,24],[37,0,37,4],[37,5,37,8],[37,9,37,12],[37,13,37,16],[37,17,37,20],[37,21,37,24],[36,0,36,4],[36,5,36,8],[36,9,36,12],[36,13,36,16],[36,17,36,20],[36,21,36,24],[40,17,40,18],[40,19,40,20],[40,21,40,22],[40,23,40,24],[41,5,41,6],[41,7,41,8],[41,9,41,10],[41,11,41,12],[41,13,41,14],[41,15,41,16],[40,5,40,6],[40,7,40,8],[40,9,40,10],[40,11,40,12],[40,13,40,14],[40,15,40,16],[39,1,39,4],[39,5,39,8],[39,9,39,12],[39,13,39,16],[39,17,39,20],[39,21,39,24],[43,17,43,18],[43,19,43,20],[43,21,43,22],[43,23,43,24],[44,5,44,6],[44,7,44,8],[44,9,44,10],[44,11,44,12],[44,13,44,14],[44,15,44,16],[41,17,41,18],[41,19,41,20],[41,21,41,22],[41,23,41,24],[43,5,43,6],[43,7,43,8],[43,9,43,10],[43,11,43,12],[43,13,43,14],[43,15,43,16],[42,5,42,6],[42,23,42,24],[42,21,42,22],[42,19,42,20],[42,17,42,18],[42,15,42,16],[42,13,42,14],[42,11,42,12],[42,9,42,10],[42,7,42,8],[45,17,45,18],[45,19,45,20],[45,21,45,22],[45,23,45,24],[46,5,46,6],[46,7,46,8],[46,9,46,10],[46,11,46,12],[46,13,46,14],[46,15,46,16],[44,17,44,18],[44,19,44,20],[44,21,44,22],[44,23,44,24],[45,5,45,6],[45,7,45,8],[45,9,45,10],[45,11,45,12],[45,13,45,14],[45,15,45,16],[47,17,47,18],[47,19,47,20],[47,21,47,22],[47,23,47,24],[48,5,48,6],[48,7,48,8],[48,9,48,10],[48,11,48,12],[48,13,48,14],[48,15,48,16],[46,17,46,18],[46,19,46,20],[46,21,46,22],[46,23,46,24],[47,5,47,6],[47,7,47,8],[47,9,47,10],[47,11,47,12],[47,13,47,14],[47,15,47,16],[51,0,51,4],[51,5,51,8],[51,9,51,12],[51,13,51,16],[51,17,51,20],[51,21,51,24],[49,17,49,18],[49,19,49,20],[49,21,49,22],[49,23,49,24],[50,0,50,4],[50,5,50,8],[50,9,50,12],[50,13,50,16],[50,17,50,20],[50,21,50,24],[48,17,48,18],[48,19,48,20],[48,21,48,22],[48,23,48,24],[49,5,49,6],[49,7,49,8],[49,9,49,10],[49,11,49,12],[49,13,49,14],[49,15,49,16],[54,0,54,4],[54,5,54,8],[54,9,54,12],[54,13,54,16],[54,17,54,20],[54,21,54,24],[53,0,53,4],[53,5,53,8],[53,9,53,12],[53,13,53,16],[53,17,53,20],[53,21,53,24],[52,0,52,4],[52,5,52,8],[52,9,52,12],[52,13,52,16],[52,17,52,20],[52,21,52,24],[58,5,58,24],[60,0,60,4],[60,5,60,8],[60,9,60,12],[60,13,60,16],[60,17,60,20],[60,21,60,24],[56,0,56,4],[56,5,56,8],[56,9,56,12],[56,13,56,16],[56,17,56,20],[56,21,56,24],[55,0,55,4],[55,5,55,8],[55,9,55,12],[55,13,55,16],[55,17,55,20],[55,21,55,24],[63,0,63,4],[63,5,63,8],[63,9,63,12],[63,13,63,16],[63,17,63,20],[63,21,63,24],[62,0,62,4],[62,5,62,8],[62,9,62,12],[62,13,62,16],[62,17,62,20],[62,21,62,24],[61,0,61,4],[61,5,61,8],[61,9,61,12],[61,13,61,16],[61,17,61,20],[61,21,61,24],[65,17,65,18],[65,19,65,20],[65,21,65,22],[65,23,65,24],[66,5,66,6],[66,7,66,8],[66,9,66,10],[66,11,66,12],[66,13,66,14],[66,15,66,16],[65,5,65,6],[65,7,65,8],[65,9,65,10],[65,11,65,12],[65,13,65,14],[65,15,65,16],[64,1,64,4],[64,5,64,8],[64,9,64,12],[64,13,64,16],[64,17,64,20],[64,21,64,24],[67,17,67,18],[67,19,67,20],[67,21,67,22],[67,23,67,24],[68,5,68,6],[68,7,68,8],[68,9,68,10],[68,11,68,12],[68,13,68,14],[68,15,68,16],[66,17,66,18],[66,19,66,20],[66,21,66,22],[66,23,66,24],[67,5,67,6],[67,7,67,8],[67,9,67,10],[67,11,67,12],[67,13,67,14],[67,15,67,16],[69,17,69,18],[69,19,69,20],[69,21,69,22],[69,23,69,24],[70,5,70,6],[70,7,70,8],[70,9,70,10],[70,11,70,12],[70,13,70,14],[70,15,70,16],[68,17,68,18],[68,19,68,20],[68,21,68,22],[68,23,68,24],[69,5,69,6],[69,7,69,8],[69,9,69,10],[69,11,69,12],[69,13,69,14],[69,15,69,16],[71,17,71,18],[71,19,71,20],[71,21,71,22],[71,23,71,24],[72,5,72,6],[72,7,72,8],[72,9,72,10],[72,11,72,12],[72,13,72,14],[72,15,72,16],[70,17,70,18],[70,19,70,20],[70,21,70,22],[70,23,70,24],[71,5,71,6],[71,7,71,8],[71,9,71,10],[71,11,71,12],[71,13,71,14],[71,15,71,16],[73,17,73,18],[73,19,73,20],[73,21,73,22],[73,23,73,24],[74,5,74,6],[74,7,74,8],[74,9,74,10],[74,11,74,12],[74,13,74,14],[74,15,74,16],[72,17,72,18],[72,19,72,20],[72,21,72,22],[72,23,72,24],[73,5,73,6],[73,7,73,8],[73,9,73,10],[73,11,73,12],[73,13,73,14],[73,15,73,16],[77,0,77,4],[77,5,77,8],[77,9,77,12],[77,13,77,16],[77,17,77,20],[77,21,77,24],[76,0,76,4],[76,5,76,8],[76,9,76,12],[76,13,76,16],[76,17,76,20],[76,21,76,24],[74,17,74,18],[74,19,74,20],[74,21,74,22],[74,23,74,24],[75,0,75,4],[75,5,75,8],[75,9,75,12],[75,13,75,16],[75,17,75,20],[75,21,75,24],[80,0,80,4],[80,5,80,8],[80,9,80,12],[80,13,80,16],[80,17,80,20],[80,21,80,24],[79,0,79,4],[79,5,79,8],[79,9,79,12],[79,13,79,16],[79,17,79,20],[79,21,79,24],[78,0,78,4],[78,5,78,8],[78,9,78,12],[78,13,78,16],[78,17,78,20],[78,21,78,24],[86,0,86,4],[86,5,86,8],[86,9,86,12],[86,13,86,16],[86,17,86,20],[86,21,86,24],[83,5,83,24],[85,0,85,4],[85,5,85,8],[85,9,85,12],[85,13,85,16],[85,17,85,20],[85,21,85,24],[81,0,81,4],[81,5,81,8],[81,9,81,12],[81,13,81,16],[81,17,81,20],[81,21,81,24],[89,1,89,4],[89,5,89,8],[89,9,89,12],[89,13,89,16],[89,17,89,20],[89,21,89,24],[88,0,88,4],[88,5,88,8],[88,9,88,12],[88,13,88,16],[88,17,88,20],[88,21,88,24],[87,0,87,4],[87,5,87,8],[87,9,87,12],[87,13,87,16],[87,17,87,20],[87,21,87,24],[91,17,91,18],[91,19,91,20],[91,21,91,22],[91,23,91,24],[92,5,92,6],[92,7,92,8],[92,9,92,10],[92,11,92,12],[92,13,92,14],[92,15,92,16],[90,17,90,18],[90,19,90,20],[90,21,90,22],[90,23,90,24],[91,5,91,6],[91,7,91,8],[91,9,91,10],[91,11,91,12],[91,13,91,14],[91,15,91,16],[90,5,90,6],[90,7,90,8],[90,9,90,10],[90,11,90,12],[90,13,90,14],[90,15,90,16],[93,17,93,18],[93,19,93,20],[93,21,93,22],[93,23,93,24],[94,5,94,6],[94,7,94,8],[94,9,94,10],[94,11,94,12],[94,13,94,14],[94,15,94,16],[92,17,92,18],[92,19,92,20],[92,21,92,22],[92,23,92,24],[93,5,93,6],[93,7,93,8],[93,9,93,10],[93,11,93,12],[93,13,93,14],[93,15,93,16],[95,17,95,18],[95,19,95,20],[95,21,95,22],[95,23,95,24],[96,5,96,6],[96,7,96,8],[96,9,96,10],[96,11,96,12],[96,13,96,14],[96,15,96,16],[94,17,94,18],[94,19,94,20],[94,21,94,22],[94,23,94,24],[95,5,95,6],[95,7,95,8],[95,9,95,10],[95,11,95,12],[95,13,95,14],[95,15,95,16],[97,17,97,18],[97,19,97,20],[97,21,97,22],[97,23,97,24],[98,5,98,6],[98,7,98,8],[98,9,98,10],[98,11,98,12],[98,13,98,14],[98,15,98,16],[96,17,96,18],[96,19,96,20],[96,21,96,22],[96,23,96,24],[97,5,97,6],[97,7,97,8],[97,9,97,10],[97,11,97,12],[97,13,97,14],[97,15,97,16],[99,17,99,18],[99,19,99,20],[99,21,99,22],[99,23,99,24],[100,5,100,6],[100,7,100,8],[100,9,100,10],[100,11,100,12],[100,13,100,14],[100,15,100,16],[98,17,98,18],[98,19,98,20],[98,21,98,22],[98,23,98,24],[99,5,99,6],[99,7,99,8],[99,9,99,10],[99,11,99,12],[99,13,99,14],[99,15,99,16],[103,0,103,4],[103,5,103,8],[103,9,103,12],[103,13,103,16],[103,17,103,20],[103,21,103,24],[102,0,102,4],[102,5,102,8],[102,9,102,12],[102,13,102,16],[102,17,102,20],[102,21,102,24],[100,17,100,18],[100,19,100,20],[100,21,100,22],[100,23,100,24],[101,0,101,4],[101,5,101,8],[101,9,101,12],[101,13,101,16],[101,17,101,20],[101,21,101,24],[106,0,106,4],[106,5,106,8],[106,9,106,12],[106,13,106,16],[106,17,106,20],[106,21,106,24],[105,0,105,4],[105,5,105,8],[105,9,105,12],[105,13,105,16],[105,17,105,20],[105,21,105,24],[104,0,104,4],[104,5,104,8],[104,9,104,12],[104,13,104,16],[104,17,104,20],[104,21,104,24],[112,0,112,4],[112,5,112,8],[112,9,112,12],[112,13,112,16],[112,17,112,20],[112,21,112,24],[109,5,109,24],[111,0,111,4],[111,5,111,8],[111,9,111,12],[111,13,111,16],[111,17,111,20],[111,21,111,24],[107,0,107,4],[107,5,107,8],[107,9,107,12],[107,13,107,16],[107,17,107,20],[107,21,107,24],[115,1,115,4],[115,5,115,8],[115,9,115,12],[115,13,115,16],[115,17,115,20],[115,21,115,24],[114,0,114,4],[114,5,114,8],[114,9,114,12],[114,13,114,16],[114,17,114,20],[114,21,114,24],[113,0,113,4],[113,5,113,8],[113,9,113,12],[113,13,113,16],[113,17,113,20],[113,21,113,24],[117,17,117,18],[117,19,117,20],[117,21,117,22],[117,23,117,24],[118,5,118,6],[118,7,118,8],[118,9,118,10],[118,11,118,12],[118,13,118,14],[118,15,118,16],[116,17,116,18],[116,19,116,20],[116,21,116,22],[116,23,116,24],[117,5,117,6],[117,7,117,8],[117,9,117,10],[117,11,117,12],[117,13,117,14],[117,15,117,16],[116,5,116,6],[116,7,116,8],[116,9,116,10],[116,11,116,12],[116,13,116,14],[116,15,116,16],[119,17,119,18],[119,19,119,20],[119,21,119,22],[119,23,119,24],[120,5,120,6],[120,7,120,8],[120,9,120,10],[120,11,120,12],[120,13,120,14],[120,15,120,16],[118,17,118,18],[118,19,118,20],[118,21,118,22],[118,23,118,24],[119,5,119,6],[119,7,119,8],[119,9,119,10],[119,11,119,12],[119,13,119,14],[119,15,119,16],[121,17,121,18],[121,19,121,20],[121,21,121,22],[121,23,121,24],[122,5,122,6],[122,7,122,8],[122,9,122,10],[122,11,122,12],[122,13,122,14],[122,15,122,16],[120,17,120,18],[120,19,120,20],[120,21,120,22],[120,23,120,24],[121,5,121,6],[121,7,121,8],[121,9,121,10],[121,11,121,12],[121,13,121,14],[121,15,121,16],[123,17,123,18],[123,19,123,20],[123,21,123,22],[123,23,123,24],[124,5,124,6],[124,7,124,8],[124,9,124,10],[124,11,124,12],[124,13,124,14],[124,15,124,16],[122,17,122,18],[122,19,122,20],[122,21,122,22],[122,23,122,24],[123,5,123,6],[123,7,123,8],[123,9,123,10],[123,11,123,12],[123,13,123,14],[123,15,123,16],[125,17,125,18],[125,19,125,20],[125,21,125,22],[125,23,125,24],[126,5,126,6],[126,7,126,8],[126,9,126,10],[126,11,126,12],[126,13,126,14],[126,15,126,16],[124,17,124,18],[124,19,124,20],[124,21,124,22],[124,23,124,24],[125,5,125,6],[125,7,125,8],[125,9,125,10],[125,11,125,12],[125,13,125,14],[125,15,125,16],[129,0,129,4],[129,5,129,8],[129,9,129,12],[129,13,129,16],[129,17,129,20],[129,21,129,24],[127,17,127,18],[127,19,127,20],[127,21,127,22],[127,23,127,24],[128,0,128,4],[128,5,128,8],[128,9,128,12],[128,13,128,16],[128,17,128,20],[128,21,128,24],[126,17,126,18],[126,19,126,20],[126,21,126,22],[126,23,126,24],[127,5,127,6],[127,7,127,8],[127,9,127,10],[127,11,127,12],[127,13,127,14],[127,15,127,16],[132,0,132,4],[132,5,132,8],[132,9,132,12],[132,13,132,16],[132,17,132,20],[132,21,132,24],[131,0,131,4],[131,5,131,8],[131,9,131,12],[131,13,131,16],[131,17,131,20],[131,21,131,24],[130,0,130,4],[130,5,130,8],[130,9,130,12],[130,13,130,16],[130,17,130,20],[130,21,130,24],[136,5,136,24],[138,0,138,4],[138,5,138,8],[138,9,138,12],[138,13,138,16],[138,17,138,20],[138,21,138,24],[134,0,134,4],[134,5,134,8],[134,9,134,12],[134,13,134,16],[134,17,134,20],[134,21,134,24],[133,0,133,4],[133,5,133,8],[133,9,133,12],[133,13,133,16],[133,17,133,20],[133,21,133,24],[141,0,141,4],[141,5,141,8],[141,9,141,12],[141,13,141,16],[141,17,141,20],[141,21,141,24],[140,0,140,4],[140,5,140,8],[140,9,140,12],[140,13,140,16],[140,17,140,20],[140,21,140,24],[139,0,139,4],[139,5,139,8],[139,9,139,12],[139,13,139,16],[139,17,139,20],[139,21,139,24],[143,17,143,18],[143,19,143,20],[143,21,143,22],[143,23,143,24],[144,5,144,6],[144,7,144,8],[144,9,144,10],[144,11,144,12],[144,13,144,14],[144,15,144,16],[143,5,143,6],[143,7,143,8],[143,9,143,10],[143,11,143,12],[143,13,143,14],[143,15,143,16],[142,1,142,4],[142,5,142,8],[142,9,142,12],[142,13,142,16],[142,17,142,20],[142,21,142,24],[145,17,145,18],[145,19,145,20],[145,21,145,22],[145,23,145,24],[146,5,146,6],[146,7,146,8],[146,9,146,10],[146,11,146,12],[146,13,146,14],[146,15,146,16],[144,17,144,18],[144,19,144,20],[144,21,144,22],[144,23,144,24],[145,5,145,6],[145,7,145,8],[145,9,145,10],[145,11,145,12],[145,13,145,14],[145,15,145,16],[147,17,147,18],[147,19,147,20],[147,21,147,22],[147,23,147,24],[148,5,148,6],[148,7,148,8],[148,9,148,10],[148,11,148,12],[148,13,148,14],[148,15,148,16],[146,17,146,18],[146,19,146,20],[146,21,146,22],[146,23,146,24],[147,5,147,6],[147,7,147,8],[147,9,147,10],[147,11,147,12],[147,13,147,14],[147,15,147,16],[149,17,149,18],[149,19,149,20],[149,21,149,22],[149,23,149,24],[150,5,150,6],[150,7,150,8],[150,9,150,10],[150,11,150,12],[150,13,150,14],[150,15,150,16],[148,17,148,18],[148,19,148,20],[148,21,148,22],[148,23,148,24],[149,5,149,6],[149,7,149,8],[149,9,149,10],[149,11,149,12]],"merged_total":1099,"flags":["merged_cut"]}
[{"$f":"Setup!A2","v":"ESB-21"}]
[]
[null,"Aggregate Gradations, Gravities and Consensus Properties"]
[null,null,"Producer:",null,null,{"$f":"Setup!E7","v":0},null,null,null,"Material Class:",null,null,null,{"$f":"Setup!E11","v":0},null,null,null,null,"JMF ID",null,null,null,{"$f":"Setup!E5","v":0}]
[null,null,"Designed By:",null,null,{"$f":"Setup!E9","v":0},null,null,null,"Esals:",null,null,null,{"$f":"Setup!E13","v":0},null,null,null,null,null,"SRL:",null,null,{"$f":"Setup!E12","v":0}]
[null,null,"Date:",null,null,{"$f":"Setup!E6","v":"00:00:00"},null,null,null,"Percent Recycled:",null,null,null,{"$f":"Setup!E18","v":0},null,null,null,null,null,"PG Grade:",null,null,{"$f":"Setup!E15","v":0}]
[]
[null,"This worksheet allows for multiple fine and coarse aggregates to be entered. Enter the gradations, gravities, absorptions and consensus properties of the aggregates. You will then select these aggregates on the aggregate blend sheet. These values and the aggregate identifiers will be used throughout the workbook"]
[]
[]
[]
[null,null,null,null,null,"Fine Aggregate"]
[]
["Supplier Name",null,null,null,null,null,null,null,null,null,null,null,null,null,null,null,null,null,null,null,null,null,null,null,null,null,null,null,"L "]
["Supplier Code",null,null,null,null,null,null,null,null,null,null,null,null,null,null,null,null,null,null,null,null,null,null,null,null,null,null,null,"M"]
["Fine Agg Identifier",null,null,null,null,null,null,null,null,null,null,null,null,null,null,null,null,null,null,null,null,null,null,null,null,null,null,null,"G"]
["Aggregate SRL",null,null,null,null,null,null,null,null,null,null,null,null,null,null,null,null,null,null,null,null,null,null,null,null,null,null,null,"H"]
[null,"Material Class",null,null,null,207,null,null,null,207,null,null,null,207,null,null,null,207,null,null,null,207,null,null,null,null,null,null,"E"]
[null,null,null,null,null,0.5,null,null,null,0.5,null,null,null,0.5,null,null,null,0.5,null,null,null,0.5]
[null,null,null,null,null,0.375,null,null,null,0.375,null,null,null,0.375,null,null,null,0.375,null,null,null,0.375]
[null,null,null,null,null,4,null,null,null,4,null,null,null,4,null,null,null,4,null,null,null,4]
[null,null,null,null,null,8,null,null,null,8,null,null,null,8,null,null,null,8,null,null,null,8]
[null,null,null,null,null,16,null,null,null,16,null,null,null,16,null,null,null,16,null,null,null,16]
[null,null,null,null,null,30,null,null,null,30,null,null,null,30,null,null,null,30,null,null,null,30]
[null,null,null,null,null,50,null,null,null,50,null,null,null,50,null,null,null,50,null,null,null,50]
[null,null,null,null,null,100,null,null,null,100,null,null,null,100,null,null,null,100,null,null,null,100]
[null,null,null,null,null,200,null,null,null,200,null,null,null,200,null,null,null,200,null,null,null,200]
["Bulk SpGr (Gsb)"]
["Absorption"]
["App SpGr (Gsa)",null,null,null,null,{"$f":"IF(F29,1/(1/F28-F29/100),F28)","v":0},null,null,null,{"$f":"IF(J29,1/(1/J28-J29/100),J28)","v":0},null,null,null,{"$f":"IF(N29,1/(1/N28-N29/100),N28)","v":0},null,null,null,{"$f":"IF(R29,1/(1/R28-R29/100),R28)","v":0},null,null,null,{"$f":"IF(V29,1/(1/V28-V29/100),V28)","v":0}]
["Sand Equivalency"]
["Uncompacted Voids"]
[]
[null,null,null,null,null,"#8 / #9 Aggregate"]
[]
["Supplier Name"]
["Supplier Code"]
["Coarse Agg Identifier"]
["Aggregate SRL"]
[null,"Material Class",null,null,null,203,null,null,null,203,null,null,null,203,null,null,null,203,null,null,null,203]
[null,null,null,null,null,0.5,null,null,null,0.5,null,null,null,0.5,null,null,null,0.5,null,null,null,0.5]
[null,null,null,null,null,0.375,null,null,null,0.375,null,null,null,0.375,null,null,null,0.375,null,null,null,0.375]
[null,null,null,null,null,0.25,null,null,null,0.25,null,null,null,0.25,null,null,null,0.25,null,null,null,0.25]
[null,null,null,null,null,4,null,null,null,4,null,null,null,4,null,null,null,4,null,null,null,4]
[null,null,null,null,null,8,null,null,null,8,null,null,null,8,null,null,null,8,null,null,null,8]
[null,null,null,null,null,16,null,null,null,16,null,null,null,16,null,null,null,16,null,null,null,16]
[null,null,null,null,null,30,null,null,null,30,null,null,null,30,null,null,null,30,null,null,null,30]
[null,null,null,null,null,50,null,null,null,50,null,null,null,50,null,null,null,50,null,null,null,50]
[null,null,null,null,null,100,null,null,null,100,null,null,null,100,null,null,null,100,null,null,null,100]
[null,null,null,null,null,200,null,null,null,200,null,null,null,200,null,null,null,200,null,null,null,200]
["Bulk SpGr (Gsb)"]
["Absorption"]
["App SpGr (Gsa)",null,null,null,null,{"$f":"IF(F52,1/(1/F51-F52/100),\" \")","v":" "},null,null,null,{"$f":"IF(J52,1/(1/J51-J52/100),\" \")","v":" "},null,null,null,{"$f":"IF(N52,1/(1/N51-N52/100),\" \")","v":" "},null,null,null,{"$f":"IF(R52,1/(1/R51-R52/100),\" \")","v":" "},null,null,null,{"$f":"IF(V52,1/(1/V51-V52/100),\" \")","v":" "}]
["Flat & Elongated 3:1 "]
["Flat & Elongated 5:1 "]
["CA Angularity 1 Face"]
["CA Angularity 2 Faces"]
[]
[null,null,null,null,null,"#7 / 78 Aggregate"]
[]
["Supplier Name"]
["Supplier Code"]
["Coarse Agg Identifier"]
["Aggregate SRL"]
[null,"Material Class",null,null,null,203,null,null,null,203,null,null,null,203,null,null,null,203,null,null,null,203]
[null,null,null,null,null,0.75,null,null,null,0.75,null,null,null,0.75,null,null,null,0.75,null,null,null,0.75]
[null,null,null,null,null,0.5,null,null,null,0.5,null,null,null,0.5,null,null,null,0.5,null,null,null,0.5]
[null,null,null,null,null,0.375,null,null,null,0.375,null,null,null,0.375,null,null,null,0.375,null,null,null,0.375]
[null,null,null,null,null,4,null,null,null,4,null,null,null,4,null,null,null,4,null,null,null,4]
[null,null,null,null,null,8,null,null,null,8,null,null,null,8,null,null,null,8,null,null,null,8]
[null,null,null,null,null,16,null,null,null,16,null,null,null,16,null,null,null,16,null,null,null,16]
[null,null,null,null,null,30,null,null,null,30,null,null,null,30,null,null,null,30,null,null,null,30]
[null,null,null,null,null,50,null,null,null,50,null,null,null,50,null,null,null,50,null,null,null,50]
[null,null,null,null,null,100,null,null,null,100,null,null,null,100,null,null,null,100,null,null,null,100]
[null,null,null,null,null,200,null,null,null,200,null,null,null,200,null,null,null,200,null,null,null,200]
["Bulk SpGr (Gsb)"]
["Absorption"]
["App SpGr (Gsa)",null,null,null,null,{"$f":"IF(F77,1/(1/F76-F77/100),\" \")","v":" "},null,null,null,{"$f":"IF(J77,1/(1/J76-J77/100),\" \")","v":" "},null,null,null,{"$f":"IF(N77,1/(1/N76-N77/100),\" \")","v":" "},null,null,null,{"$f":"IF(R77,1/(1/R76-R77/100),\" \")","v":" "},null,null,null,{"$f":"IF(V77,1/(1/V76-V77/100),\" \")","v":" "}]
["Flat & Elongated 3:1 "]
["Flat & Elongated 5:1 "]
["CA Angularity 1 Face"]
["CA Angularity 2 Faces"]
[]
[null,null,null,null,null,"#67 Aggregate"]
[]
["Supplier Name"]
["Supplier Code"]
["Coarse Agg Identifier"]
["Aggregate SRL"]
[null,"Material Class",null,null,null,203,null,null,null,203,null,null,null,203,null,null,null,203,null,null,null,203]
[null,null,null,null,null,1,null,null,null,1,null,null,null,1,null,null,null,1,null,null,null,1]
[null,null,null,null,null,0.75,null,null,null,0.75,null,null,null,0.75,null,null,null,0.75,null,null,null,0.75]
[null,null,null,null,null,0.5,null,null,null,0.5,null,null,null,0.5,null,null,null,0.5,null,null,null,0.5]
[null,null,null,null,null,0.375,null,null,null,0.375,null,null,null,0.375,null,null,null,0.375,null,null,null,0.375]
[null,null,null,null,null,4,null,null,null,4,null,null,null,4,null,null,null,4,null,null,null,4]
[null,null,null,null,null,8,null,null,null,8,null,null,null,8,null,null,null,8,null,null,null,8]
[null,null,null,null,null,16,null,null,null,16,null,null,null,16,null,null,null,16,null,null,null,16]
[null,null,null,null,null,30,null,null,null,30,null,null,null,30,null,null,null,30,null,null,null,30]
[null,null,null,null,null,50,null,null,null,50,null,null,null,50,null,null,null,50,null,null,null,50]
[null,null,null,null,null,100,null,null,null,100,null,null,null,100,null,null,null,100,null,null,null,100]
[null,null,null,null,null,200,null,null,null,200,null,null,null,200,null,null,null,200,null,null,null,200]
["Bulk SpGr (Gsb)"]
["Absorption"]
["App SpGr (Gsa)",null,null,null,null,{"$f":"IF(F103,1/(1/F102-F103/100),\" \")","v":" "},null,null,null,{"$f":"IF(J103,1/(1/J102-J103/100),\" \")","v":" "},null,null,null,{"$f":"IF(N103,1/(1/N102-N103/100),\" \")","v":" "},null,null,null,{"$f":"IF(R103,1/(1/R102-R103/100),\" \")","v":" "},null,null,null,{"$f":"IF(V103,1/(1/V102-V103/100),\" \")","v":" "}]
["Flat & Elongated 3:1 "]
["Flat & Elongated 5:1 "]
["CA Angularity 1 Face"]
["CA Angularity 2 Faces"]
[]
[null,null,null,null,null,"#57 Aggregate"]
[]
["Supplier Name"]
["Supplier Code"]
["Coarse Agg Identifier"]
["Aggregate SRL"]
[null,"Material Class",null,null,null,203,null,null,null,203,null,null,null,203,null,null,null,203,null,null,null,203]
[null,null,null,null,null,1.5,null,null,null,1.5,null,null,null,1.5,null,null,null,1.5,null,null,null,1.5]
[null,null,null,null,null,1,null,null,null,1,null,null,null,1,null,null,null,1,null,null,null,1]
[null,null,null,null,null,0.75,null,null,null,0.75,null,null,null,0.75,null,null,null,0.75,null,null,null,0.75]
[null,null,null,null,null,0.5,null,null,null,0.5,null,null,null,0.5,null,null,null,0.5,null,null,null,0.5]
[null,null,null,null,null,0.375,null,null,null,0.375,null,null,null,0.375,null,null,null,0.375,null,null,null,0.375]
[null,null,null,null,null,4,null,null,null,4,null,null,null,4,null,null,null,4,null,null,null,4]
[null,null,null,null,null,8,null,null,null,8,null,null,null,8,null,null,null,8,null,null,null,8]
[null,null,null,null,null,16,null,null,null,16,null,null,null,16,null,null,null,16,null,null,null,16]
[null,null,null,null,null,30,null,null,null,30,null,null,null,30,null,null,null,30,null,null,null,30]
[null,null,null,null,null,50,null,null,null,50,null,null,null,50,null,null,null,50,null,null,null,50]
[null,null,null,null,null,100,null,null,null,100,null,null,null,100,null,null,null,100,null,null,null,100]
[null,null,null,null,null,200,null,null,null,200,null,null,null,200,null,null,null,200,null,null,null,200]
["Bulk SpGr (Gsb)"]
["Absorption"]
["App SpGr (Gsa)",null,null,null,null,{"$f":"IF(F130,1/(1/F129-F130/100),\" \")","v":" "},null,null,null,{"$f":"IF(J130,1/(1/J129-J130/100),\" \")","v":" "},null,null,null,{"$f":"IF(N130,1/(1/N129-N130/100),\" \")","v":" "},null,null,null,{"$f":"IF(R130,1/(1/R129-R130/100),\" \")","v":" "},null,null,null,{"$f":"IF(V130,1/(1/V129-V130/100),\" \")","v":" "}]
["Flat & Elongated 3:1 "]
["Flat & Elongated 5:1 "]
["CA Angularity 1 Face"]
["CA Angularity 2 Faces"]
[]
[null,null,null,null,null,"#467 Aggregate"]
[]
["Supplier Name"]
["Supplier Code"]
["Coarse Agg Identifier"]
["Aggregate SRL"]
[null,"Material Class",null,null,null,203,null,null,null,203,null,null,null,203,null,null,null,203,null,null,null,203]
[null,null,null,null,null,2,null,null,null,2,null,null,null,2,null,null,null,2,null,null,null,2]
[null,null,null,null,null,1.5,null,null,null,1.5,null,null,null,1.5,null,null,null,1.5,null,null,null,1.5]
[null,null,null,null,null,1,null,null,null,1,null,null,null,1,null,null,null,1,null,null,null,1]
[null,null,null,null,null,0.75,null,null,null,0.75,null,null,null,0.75,null,null,null,0.75,null,null,null,0.75]
[null,null,null,null,null,0.5,null,null,null,0.5,null,null,null,0.5,null,null,null,0.5,null,null,null,0.5]
[null,null,null,null,null,0.375,null,null,null,0.375,null,null,null,0.375,null,null,null,0.375,null,null,null,0.375]
[null,null,null,null,null,4,null,null,null,4,null,null,null,4,null,null,null,4,null,null,null,4]
[null,null,null,null,null,8,null,null,null,8,null,null,null,8,null,null,null,8,null,null,null,8]
[null,null,null,null,null,16,null,null,null,16,null,null,null,16,null,null,null,16,null,null,null,16]
[null,null,null,null,null,30,null,null,null,30,null,null,null,30,null,null,null,30,null,null,null,30]
[null,null,null,null,null,50,null,null,null,50,null,null,null,50,null,null,null,50,null,null,null,50]
[null,null,null,null,null,100,null,null,null,100,null,null,null,100,null,null,null,100,null,null,null,100]
[null,null,null,null,null,200,null,null,null,200,null,null,null,200,null,null,null,200,null,null,null,200]
["Bulk SpGr (Gsb)"]
["Absorption"]
["App SpGr (Gsa)",null,null,null,null,{"$f":"IF(F158,1/(1/F157-F158/100),\" \")","v":" "},null,null,null,{"$f":"IF(J158,1/(1/J157-J158/100),\" \")","v":" "},null,null,null,{"$f":"IF(N158,1/(1/N157-N158/100),\" \")","v":" "},null,null,null,{"$f":"IF(R158,1/(1/R157-R158/100),\" \")","v":" "},null,null,null,{"$f":"IF(V158,1/(1/V157-V158/100),\" \")","v":" "}]
["Flat & Elongated 3:1 "]
["Flat & Elongated 5:1 "]
["CA Angularity 1 Face"]
["CA Angularity 2 Faces"]

{"sheet":"Rap","index":3,"n_rows":50,"n_cols":36,"rows_kept":50,"cut":false,"hidden":false,"merged":[[32,27,32,28],[28,27,28,28],[27,27,27,28],[26,15,28,20],[32,19,32,20],[31,19,31,20],[30,19,30,20],[29,19,29,20],[32,15,32,18],[31,15,31,18],[30,15,30,18],[29,15,29,18],[29,21,29,22],[30,21,30,22],[31,21,31,22],[44,19,44,20],[44,21,44,22],[44,23,44,24],[43,1,43,2],[26,25,26,28],[26,21,28,24],[31,27,31,28],[31,25,31,26],[30,27,30,28],[30,25,30,26],[29,27,29,28],[29,25,29,26],[26,1,28,6],[26,7,28,10],[31,7,31,8],[30,7,30,8],[29,7,29,8],[31,9,31,10],[30,9,30,10],[29,9,29,10],[27,11,27,12],[31,11,31,12],[28,11,28,12],[29,11,29,12],[49,1,49,2],[49,3,49,4],[49,5,49,6],[49,7,49,8],[49,9,49,10],[49,23,49,24],[48,1,48,2],[48,3,48,4],[48,5,48,6],[48,7,48,8],[48,9,48,10],[49,25,49,26],[49,27,49,28],[49,11,49,12],[49,13,49,14],[49,15,49,16],[49,17,49,18],[49,19,49,20],[49,21,49,22],[47,19,47,20],[47,21,47,22],[47,23,47,24],[47,25,47,26],[48,19,48,20],[48,21,48,22],[48,23,48,24],[48,25,48,26],[48,27,48,28],[48,11,48,12],[48,13,48,14],[48,15,48,16],[48,17,48,18],[46,25,46,26],[46,27,46,28],[47,1,47,2],[47,3,47,4],[47,5,47,6],[47,7,47,8],[47,9,47,10],[47,11,47,12],[47,13,47,14],[46,11,46,12],[46,13,46,14],[46,15,46,16],[46,17,46,18],[46,19,46,20],[46,21,46,22],[47,27,47,28],[47,15,47,16],[47,17,47,18],[46,1,46,2],[46,3,46,4],[46,5,46,6],[46,7,46,8],[46,9,46,10],[46,23,46,24],[45,19,45,20],[45,21,45,22],[45,23,45,24],[45,25,45,26],[45,27,45,28],[45,1,45,2],[45,3,45,4],[45,5,45,6],[45,7,45,8],[45,9,45,10],[45,11,45,12],[45,13,45,14],[45,15,45,16],[45,17,45,18],[43,3,43,4],[43,5,43,6],[43,7,43,8],[43,9,43,10],[43,23,43,24],[43,25,43,26],[43,27,43,28],[44,1,44,2],[44,3,44,4],[44,5,44,6],[44,7,44,8],[44,9,44,10],[44,11,44,12],[44,13,44,14],[43,11,43,12],[43,13,43,14],[43,15,43,16],[43,17,43,18],[43,19,43,20],[43,21,43,22],[44,27,44,28],[44,15,44,16],[44,17,44,18],[44,25,44,26],[41,19,41,20],[41,21,41,22],[41,23,41,24],[41,25,41,26],[42,19,42,20],[42,21,42,22],[42,23,42,24],[42,25,42,26],[42,27,42,28],[42,1,42,2],[42,3,42,4],[42,5,42,6],[42,7,42,8],[42,9,42,10],[42,11,42,12],[42,13,42,14],[42,15,42,16],[42,17,42,18],[40,1,40,2],[40,3,40,4],[40,5,40,6],[40,7,40,8],[40,9,40,10],[40,23,40,24],[40,25,40,26],[40,27,40,28],[41,1,41,2],[41,3,41,4],[41,5,41,6],[41,7,41,8],[41,9,41,10],[41,11,41,12],[41,13,41,14],[40,11,40,12],[40,13,40,14],[40,15,40,16],[40,17,40,18],[40,19,40,20],[40,21,40,22],[41,27,41,28],[41,15,41,16],[41,17,41,18],[38,27,38,28],[39,1,39,2],[39,3,39,4],[39,5,39,6],[39,7,39,8],[39,9,39,10],[39,11,39,12],[39,13,39,14],[39,15,39,16],[39,17,39,18],[38,15,38,16],[38,17,38,18],[38,19,38,20],[38,21,38,22],[38,23,38,24],[38,25,38,26],[39,19,39,20],[39,21,39,22],[39,23,39,24],[39,25,39,26],[39,27,39,28],[38,1,38,2],[38,3,38,4],[38,5,38,6],[38,7,38,8],[38,9,38,10],[38,11,38,12],[38,13,38,14],[37,11,37,12],[37,13,37,14],[36,19,36,20],[36,21,36,22],[36,23,36,24],[36,25,36,26],[36,27,36,28],[37,1,37,2],[37,3,37,4],[37,5,37,6],[37,7,37,8],[37,9,37,10],[37,23,37,24],[37,25,37,26],[37,27,37,28],[37,15,37,16],[37,17,37,18],[37,19,37,20],[37,21,37,22],[36,1,36,2],[36,3,36,4],[36,5,36,6],[36,7,36,8],[36,9,36,10],[36,11,36,12],[36,13,36,14],[36,15,36,16],[36,17,36,18],[34,27,35,28],[35,3,35,4],[35,5,35,6],[35,7,35,8],[35,9,35,10],[35,11,35,12],[35,17,35,18],[35,19,35,20],[35,21,35,22],[35,23,35,24],[35,25,35,26],[32,1,32,4],[32,5,32,6],[34,1,35,2],[34,3,34,12],[34,13,35,14],[34,15,35,16],[34,17,34,26],[32,11,32,12],[32,13,32,14],[32,25,32,26],[30,1,30,4],[30,5,30,6],[31,1,31,4],[31,5,31,6],[29,1,29,4],[29,5,29,6],[24,26,24,27],[25,8,25,11],[25,12,25,13],[25,22,25,25],[25,26,25,27],[27,13,27,14],[30,11,30,12],[26,11,26,14],[31,13,31,14],[30,13,30,14],[29,13,29,14],[28,13,28,14],[31,23,31,24],[30,23,30,24],[29,23,29,24],[27,25,27,26],[28,25,28,26],[24,20,24,21],[24,22,24,23],[24,24,24,25],[21,2,21,5],[21,6,21,7],[21,8,21,9],[21,10,21,11],[21,12,21,13],[21,16,21,19],[23,20,23,21],[23,22,23,23],[23,24,23,25],[24,2,24,5],[24,6,24,7],[24,8,24,9],[24,10,24,11],[24,12,24,13],[24,16,24,19],[22,26,22,27],[23,2,23,5],[23,6,23,7],[23,8,23,9],[23,10,23,11],[23,12,23,13],[23,16,23,19],[21,20,21,21],[21,22,21,23],[21,24,21,25],[21,26,21,27],[22,2,22,5],[22,6,22,7],[22,8,22,9],[22,10,22,11],[22,12,22,13],[22,16,22,19],[22,20,22,21],[22,22,22,23],[22,24,22,25],[23,26,23,27],[19,20,19,21],[19,22,19,23],[19,24,19,25],[19,26,19,27],[20,2,20,5],[20,6,20,7],[20,8,20,9],[20,10,20,11],[20,12,20,13],[20,16,20,19],[19,2,19,5],[19,6,19,7],[19,8,19,9],[19,10,19,11],[19,12,19,13],[19,16,19,19],[20,20,20,21],[20,22,20,23],[20,24,20,25],[20,26,20,27],[15,4,15,7],[15,8,15,11],[15,18,15,21],[15,22,15,25],[17,2,17,13],[17,16,17,27],[13,4,13,7],[13,8,13,11],[13,18,13,21],[13,22,13,25],[14,4,14,7],[14,8,14,11],[14,18,14,21],[14,22,14,25],[10,4,10,11],[10,18,10,25],[12,4,12,7],[12,8,12,11],[12,18,12,21],[12,22,12,25],[4,26,4,27],[5,2,5,4],[5,5,5,7],[5,9,5,14],[5,15,5,17],[5,19,5,21],[5,22,5,25],[5,26,5,27],[4,2,4,4],[4,5,4,8],[4,9,4,14],[4,15,4,17],[4,20,4,21],[4,22,4,25],[0,0,0,3],[2,1,2,28],[3,2,3,4],[3,5,3,8],[3,9,3,14],[3,15,3,18],[3,22,3,25],[7,1,8,28],[3,26,3,28]]}
[{"$f":"Setup!A2","v":"ESB-21"}]
[]
[null,"Maximum Specific Gravity and Gse of Recycled"]
[null,null,"Producer:",null,null,{"$f":"Setup!E7","v":0},null,null,null,"Material Class:",null,null,null,null,null,{"$f":"Setup!E11","v":0},null,null,null,null,null,null,"JMF:",null,null,null,{"$f":"Setup!E5","v":0}]
[null,null,"Designed By:",null,null,{"$f":"Setup!E9","v":0},null,null,null,"Esals:",null,null,null,null,null,{"$f":"Setup!E13","v":0},null,null,null,null,null,null,"SRL:",null,null,null,{"$f":"Setup!E12","v":0}]
[null,null,"Date:",null,null,{"$f":"Setup!E6","v":"00:00:00"},null,null,null,"Recycled:",null,null,null,null,null,{"$f":"Setup!E18","v":0},null,null,null,null,null,null,"PG Grade:",null,null,null,{"$f":"Setup!E15","v":0}]
[]
[null,"This worksheet is for verifying recycled gravities and gradations. It allows for two different recycled sources to be utilized. Each source will need a different identifier to be used on the TR-448"]
[null,null,null,null,null,null,null,null,null,null,null,null,null,null,null,null,null,null,null,null,null,null,null,null,null,null,null,null,null,null,null,null,null,null,"RAP"]
[null,null,null,null,null,null,null,null,null,null,null,null,null,null,null,null,null,null,null,null,null,null,null,null,null,null,null,null,null,null,null,null,null,null,"RAS"]
[null,null,null,null,"Recycled Source 1",null,null,null,null,null,null,null,null,null,null,null,null,null,"Recycled Source 2"]
[]
[null,null,null,null,"Supplier Name",null,null,null,null,null,null,null,null,null,null,null,null,null,"Supplier Name"]
[null,null,null,null,"Supplier Code",null,null,null,null,null,null,null,null,null,null,null,null,null,"Supplier Code"]
[null,null,null,null,"Recycled Identifier",null,null,null,null,null,null,null,null,null,null,null,null,null,"Recycled Identifier"]
[null,null,null,null,"Material Class",null,null,null,null,null,null,null,null,null,null,null,null,null,"Material Class"]
[]
[null,null,"Maximun Specific Gravity of Recycled Material",null,null,null,null,null,null,null,null,null,null,null,null,null,"Maximun Specific Gravity of Recycled Material"]
[]
[null,null,"Sample No",null,null,null,"1",null,2,null,3,null,4,null,null,null,"Sample No",null,null,null,"1",null,2,null,3,null,4]
[null,null,"Dry Wt. of Sample",null,null,null,null,null,null,null,null,null,null,null,null,null,"Dry Wt. of Sample"]
[null,null,{"$f":"IF(Setup!$F$20=\"Suspension\",\"Mass of Pyc in Water\",\"Mass of Pyc + Water\")","v":"Mass of Pyc + Water"},null,null,null,null,null,null,null,null,null,null,null,null,null,{"$f":"IF(Setup!$F$20=\"Suspension\",\"Mass of Pyc in Water\",\"Mass of Pyc + Water\")","v":"Mass of Pyc + Water"}]
[null,null,{"$f":"IF(Setup!$F$20=\"Suspension\",\"Mass of Pyc in H2O\",\"Mass of Pyc+Mix+H2O\")","v":"Mass of Pyc+Mix+H2O"},null,null,null,null,null,null,null,null,null,null,null,null,null,{"$f":"IF(Setup!$F$20=\"Suspension\",\"Mass of Pyc in H2O\",\"Mass of Pyc+Mix+H2O\")","v":"Mass of Pyc+Mix+H2O"}]
[null,null,"Vol Voidless Mix",null,null,null,{"$f":"IF(G23,ROUND(G21+G22-G23,1),\" \")","v":" "},null,{"$f":"IF(I23,ROUND(I21+I22-I23,1),\" \")","v":" "},null,{"$f":"IF(K23,ROUND(K21+K22-K23,1),\" \")","v":" "},null,{"$f":"IF(M23,ROUND(M21+M22-M23,1),\" \")","v":" "},null,null,null,"Vol Voidless Mix",null,null,null,{"$f":"IF(U23,ROUND(U21+U22-U23,1),\" \")","v":" "},null,{"$f":"IF(W23,ROUND(W21+W22-W23,1),\" \")","v":" "},null,{"$f":"IF(Y23,ROUND(Y21+Y22-Y23,1),\" \")","v":" "},null,{"$f":"IF(AA23,ROUND(AA21+AA22-AA23,1),\" \")","v":" "}]
[null,null,"Max Sp Gr of Mix",null,null,null,{"$f":"IF(G23,ROUND(G21/G24,3),\" \")","v":" "},null,{"$f":"IF(I23,ROUND(I21/I24,3),\" \")","v":" "},null,{"$f":"IF(K23,ROUND(K21/K24,3),\" \")","v":" "},null,{"$f":"IF(M23,ROUND(M21/M24,3),\" \")","v":" "},null,null,null,"Max Sp Gr of Mix",null,null,null,{"$f":"IF(U23,ROUND(U21/U24,3),\" \")","v":" "},null,{"$f":"IF(W23,ROUND(W21/W24,3),\" \")","v":" "},null,{"$f":"IF(Y23,ROUND(Y21/Y24,3),\" \")","v":" "},null,{"$f":"IF(AA23,ROUND(AA21/AA24,3),\" \")","v":" "}]
[null,null,null,null,null,null,null,null,"Average",null,null,null,{"$f":"IF(G23,AVERAGE(G25:N25),\"\")","v":""},null,null,null,null,null,null,null,null,null,"Average",null,null,null,{"$f":"IF(U23,AVERAGE(U25:AB25),\"\")","v":""}]
[null,"If mix contains < 15% rap, enter asphalt content to calculate Gse",null,null,null,null,null,"If mix contains > 15% rap enter Gsb and Abs. of Rap Agg",null,null,null,"Consensus Prop.",null,null,null,"If mix contains < 15% rap, enter asphalt content to calculate Gse",null,null,null,null,null,"If mix contains > 15% rap enter Gsb and Abs. of Rap Agg",null,null,null,"Consensus Prop."]
[null,null,null,null,null,null,null,null,null,null,null,"Sand Equ.",null,null,null,null,null,null,null,null,null,null,null,null,null,"Sand Equ.",null,null,null,null,null,{"$f":"Setup!E18*100","v":0}]
[null,null,null,null,null,null,null,null,null,null,null,"Unc. Voids",null,null,null,null,null,null,null,null,null,null,null,null,null,"Unc. Voids"]
[null,"Max. Sp. Gr. Of Rec.",null,null,null,{"$f":"M26","v":""},null,"Gsb",null,null,null,"FL 3:1",null,null,null,"Max. Sp. Gr. Of Rec.",null,null,null,{"$f":"AA26","v":""},null,"Gsb",null,null,null,"FL 3:1",null,null,null,null,null,"Source 1",null,null,null,"Source 2"]
[null,"% AC in Rec.",null,null,null,null,null,"Absorp.",null,null,null,"FL 5:1",null,null,null,"% AC in Rec.",null,null,null,null,null,"Absorp.",null,null,null,"FL 5:1",null,null,null,null,null,{"$f":"IF($AF$28<=15,F33,IF(AF28>15,J30))","v":""},null,null,null,{"$f":"IF($AF$28<=15,T33,IF(AF28>15,X30))","v":""}]
[null,"Sp Gr. Of Binder",null,null,null,1.03,null,"Gsa",null,{"$f":"IF(J31,1/(1/J30-J31/100),\" \")","v":" "},null,"CA Ang 1",null,null,null,"Sp Gr. Of Binder",null,null,null,1.03,null,"Gsa",null,{"$f":"IF(X31,1/(1/X30-X31/100),\" \")","v":" "},null,"CA Ang 1",null,null,null,null,null,{"$f":"IF($AF$28<=15,0,IF(AF$28>15,J31))","v":0},"$",null,null,{"$f":"IF($AF$28<=15,0,IF(AF$28>15,X31))","v":0}]
[null,"Gse",null,null,null,{"$f":"IF(F31,(100-F31)/(100/F30-F31/F32),\"\")","v":""},null,null,null,null,null,"CA Ang 2",null,null,null,"Gse",null,null,null,{"$f":"IF(T31,(100-T31)/(100/T30-T31/T32),\"\")","v":""},null,null,null,null,null,"CA Ang 2",null,null,null,null,null,{"$f":"IF($AF$28<=15,F33,IF(AF$28>15,J32))","v":""},null,null,null,{"$f":"IF($AF$28<=15,T33,IF(AF$28>15,X32))","v":""}]
[]
[null,"Sieve Size",null,"Recycled Gradation and Asphalt Content",null,null,null,null,null,null,null,null,null,"Average",null,"Sieve Size",null,"Recycled Gradation and Asphalt Content",null,null,null,null,null,null,null,null,null,"Average"]
[null,null,null,1,null,2,null,3,null,4,null,5,null,null,null,null,null,1,null,2,null,3,null,4,null,5]
[null,"2\"",null,null,null,null,null,null,null,null,null,null,null,{"$f":"IF(D37,ROUND(AVERAGE(D37:M37),1),\" \")","v":" "},null,"2\"",null,null,null,null,null,null,null,null,null,null,null,{"$f":"IF(R37,ROUND(AVERAGE(R37:AA37),1),\" \")","v":" "}]
[null,"1 1/2\"",null,null,null,null,null,null,null,null,null,null,null,{"$f":"IF(D38,ROUND(AVERAGE(D38:M38),1),\" \")","v":" "},null,"1 1/2\"",null,null,null,null,null,null,null,null,null,null,null,{"$f":"IF(R38,ROUND(AVERAGE(R38:AA38),1),\" \")","v":" "}]
[null,"1\"",null,null,null,null,null,null,null,null,null,null,null," ",null,"1\"",null,null,null,null,null,null,null,null,null,null,null," "]
[null,"3/4\"",null,null,null,null,null,null,null,null,null,null,null," ",null,"3/4\"",null,null,null,null,null,null,null,null,null,null,null," "]
[null,"1/2\"",null,null,null,null,null,null,null,null,null,null,null," ",null,"1/2\"",null,null,null,null,null,null,null,null,null,null,null," "]
[null,"3/8\"",null,null,null,null,null,null,null,null,null,null,null," ",null,"3/8\"",null,null,null,null,null,null,null,null,null,null,null," "]
[null,"#4",null,null,null,null,null,null,null,null,null,null,null," ",null,"#4",null,null,null,null,null,null,null,null,null,null,null," "]
[null,"#8",null,null,null,null,null,null,null,null,null,null,null," ",null,"#8",null,null,null,null,null,null,null,null,null,null,null," ",null,null,"`"]
[null,"#16",null,null,null,null,null,null,null,null,null,null,null," ",null,"#16",null,null,null,null,null,null,null,null,null,null,null," "]
[null,"#30",null,null,null,null,null,null,null,null,null,null,null," ",null,"#30",null,null,null,null,null,null,null,null,null,null,null," "]
[null,"#50",null,null,null,null,null,null,null,null,null,null,null," ",null,"#50",null,null,null,null,null,null,null,null,null,null,null," "]
[null,"#100",null,null,null,null,null,null,null,null,null,null,null," ",null,"#100",null,null,null,null,null,null,null,null,null,null,null," "]
[null,"#200",null,null,null,null,null,null,null,null,null,null,null," ",null,"#200",null,null,null,null,null,null,null,null,null,null,null," "]
[null,"Asphalt",null,null,null,null,null,null,null,null,null,null,null," ",null,"Asphalt",null,null,null,null,null,null,null,null,null,null,null," "]

{"sheet":"Agg Blends","index":4,"n_rows":90,"n_cols":93,"rows_kept":90,"cut":false,"hidden":false,"merged":[[35,56,35,57],[41,21,41,23],[19,22,19,24],[41,24,41,26],[30,24,30,26],[41,27,41,29],[30,27,30,29],[34,1,34,10],[12,2,12,4],[13,2,13,4],[15,2,15,4],[12,8,12,10],[13,8,13,10],[16,8,16,10],[12,5,12,6],[13,5,13,6],[15,5,15,6],[55,7,55,8],[55,19,55,20],[55,21,55,22],[46,1,46,10],[47,2,47,10],[89,90,89,91],[30,21,30,23],[18,14,18,15],[18,11,18,13],[3,1,3,2],[3,10,3,11],[3,5,3,6],[15,8,15,10],[18,1,18,2],[18,3,18,10],[41,1,41,13],[14,1,14,13],[16,2,16,4],[16,5,16,6],[4,1,4,2],[4,3,4,4],[1,1,1,15],[2,1,2,2],[2,5,2,6],[2,10,2,11],[9,2,9,4],[8,2,8,4],[8,5,8,6],[9,5,9,6],[6,11,6,13],[6,8,7,10],[4,10,4,11],[4,12,4,13],[4,5,4,6],[5,2,5,13],[6,7,7,7],[6,5,7,6],[2,19,2,26],[10,2,10,4],[11,2,11,4],[6,2,7,4],[10,8,10,10],[11,8,11,10],[10,5,10,6],[11,5,11,6],[9,8,9,10],[8,8,8,10]]}
[null,{"$f":"Setup!A2","v":"ESB-21"},null,null,null,null,null,null,null,null,null,null,null,null,null,null,null,null,null,null,null,null,null,null,null,null,null,null,null,{"$f":"Setup!E10","v":0},null,{"$f":"Setup!E10","v":0}]
[null,"Aggregate Gradations and Consensus Properties"]
[null,"Producer:",null,{"$f":"Setup!E7","v":0},null,"Material Class:",null,{"$f":"Setup!E11","v":"00:00:00"},null,null,"JMF",null,{"$f":"Setup!E5","v":0},null,null,null,null,null,null,"Conditional Formatting for 3/4 thru 2'\" screens"]
[null,"Designed By:",null,{"$f":"Setup!E9","v":0},null,"Esals:",null,{"$f":"Setup!E13","v":0},null,null,"SRL:",null,{"$f":"Setup!E12","v":0},null,null,null,null,null,null,"Agg1","Agg2","Agg3","Agg4","Agg5","Agg6","Rec1","Rec2"]
[null,"Date:",null,{"$f":"Setup!E6","v":"00:00:00"},null," Rap:",null,{"$f":"Setup!E18","v":0},null,null,"PG Grade",null,{"$f":"Setup!E15","v":0},null,null,null,null,null,null,{"$f":"IF(ISBLANK($I9),1,\"\")","v":1},{"$f":"IF(ISBLANK($I10),1,\"\")","v":1},{"$f":"IF(ISBLANK($I11),1,\"\")","v":1},{"$f":"IF(ISBLANK($I12),1,\"\")","v":1},{"$f":"IF(ISBLANK($I13),1,\"\")","v":1},{"$f":"IF(ISBLANK($I14),1,\"\")","v":1},{"$f":"IF(ISBLANK($I16),1,\"\")","v":1},{"$f":"IF(ISBLANK($I17),1,\"\")","v":1},null,null,null,null,null,null,null,null,null,null,null,null,null,null,null,null,null,null,null,null,null,null,null,null,null,null,null,null,null,null,null,null,null,null,null,null,null,null,null,"Name","Row","Validation","Code","Row","Validation","Identifier","Row","Validation",null,"Validation"]
[null,null,"Virgin Material",null,null,null,null,null,null,null,null,null,null,null,null,null,null,null,null,null,null,null,null,null,null,null,null,null,null,null,null,null,null,null,null,null,null,null,null,null,null,null,null,null,null,null,null,null,null,null,null,null,null,null,null,null,null,null,null,null,null,null,null,null,null,null,null,{"$f":"ROWS(BO$6:BO6)","v":1},{"$f":"IF(ROWS(BQ$6:BQ6)>COUNTA($BO$6:$BO$36),\"\",INDEX($BO$6:$BO$36,SMALL(IF($BO$6:$BO$36<>\"\",ROW($BO$6:$BO$36)-ROW($BO$6)+1),ROWS(BQ$6:BQ6))))","v":""},null,{"$f":"ROWS(BR$6:BR6)","v":1},{"$f":"IF(ROWS(BT$6:BT6)>COUNTA($BR$6:$BR$36),\"\",INDEX($BR$6:$BR$36,SMALL(IF($BR$6:$BR$36<>\"\",ROW($BR$6:$BR$36)-ROW($BR$6)+1),ROWS(BT$6:BT6))))","v":""},null,{"$f":"ROWS(BU$6:BU6)","v":1},{"$f":"IF(ROWS(BW$6:BW6)>COUNTA($BU$6:$BU$36),\"\",INDEX($BU$6:$BU$36,SMALL(IF($BU$6:$BU$36<>\"\",ROW($BU$6:$BU$36)-ROW($BU$6)+1),ROWS(BW$6:BW6))))","v":""},null,203]
[null,null,"Supplier Name",null,null,"Supplier Code",null,"Material Code","Material Class                    (Identifier)",null,null,"% in Blend",null,null,null,null,null,null,null,null,null,null,null,null,null,null,null,null,null,null,null,null,null,null,null,null,null,null,null,null,null,null,null,null,null,null,null,null,null,null,null,null,null,null,null,null,null,null,null,null,null,null,null,null,null,null,null,{"$f":"ROWS(BO$6:BO7)","v":2},{"$f":"IF(ROWS(BQ$6:BQ7)>COUNTA($BO$6:$BO$36),\"\",INDEX($BO$6:$BO$36,SMALL(IF($BO$6:$BO$36<>\"\",ROW($BO$6:$BO$36)-ROW($BO$6)+1),ROWS(BQ$6:BQ7))))","v":""},null,{"$f":"ROWS(BR$6:BR7)","v":2},{"$f":"IF(ROWS(BT$6:BT7)>COUNTA($BR$6:$BR$36),\"\",INDEX($BR$6:$BR$36,SMALL(IF($BR$6:$BR$36<>\"\",ROW($BR$6:$BR$36)-ROW($BR$6)+1),ROWS(BT$6:BT7))))","v":""},null,{"$f":"ROWS(BU$6:BU7)","v":2},{"$f":"IF(ROWS(BW$6:BW7)>COUNTA($BU$6:$BU$36),\"\",INDEX($BU$6:$BU$36,SMALL(IF($BU$6:$BU$36<>\"\",ROW($BU$6:$BU$36)-ROW($BU$6)+1),ROWS(BW$6:BW7))))","v":""},null,207]
[null,null,null,null,null,null,null,null,null,null,null,"Blend 1","Blend 2","Blend 3",null,null,null,null,null,null,null,null,null,null,null,null,null,null,null,null,null,null,null,null,null,null,null,null,null,null,null,null,null,null,null,null,null,null,null,null,null,null,null,null,null,null,null,null,null,null,null,null,null,null,null,null,null,{"$f":"ROWS(BO$6:BO8)","v":3},{"$f":"IF(ROWS(BQ$6:BQ8)>COUNTA($BO$6:$BO$36),\"\",INDEX($BO$6:$BO$36,SMALL(IF($BO$6:$BO$36<>\"\",ROW($BO$6:$BO$36)-ROW($BO$6)+1),ROWS(BQ$6:BQ8))))","v":""},null,{"$f":"ROWS(BR$6:BR8)","v":3},{"$f":"IF(ROWS(BT$6:BT8)>COUNTA($BR$6:$BR$36),\"\",INDEX($BR$6:$BR$36,SMALL(IF($BR$6:$BR$36<>\"\",ROW($BR$6:$BR$36)-ROW($BR$6)+1),ROWS(BT$6:BT8))))","v":""},null,{"$f":"ROWS(BU$6:BU8)","v":3},{"$f":"IF(ROWS(BW$6:BW8)>COUNTA($BU$6:$BU$36),\"\",INDEX($BU$6:$BU$36,SMALL(IF($BU$6:$BU$36<>\"\",ROW($BU$6:$BU$36)-ROW($BU$6)+1),ROWS(BW$6:BW8))))","v":""}]
[null,"Agg 1",null,null,null,null,null,null,null,null,null,null,null,null,null,null,null,null,null,null,null,null,null,null,null,null,null,null,null,null,null,null,null,null,null,null,null,null,null,null,null,null,null,null,null,null,null,null,null,null,null,null,null,null,null,null,null,null,null,null,null,null,null,null,null,null,null,{"$f":"ROWS(BO$6:BO9)","v":4},{"$f":"IF(ROWS(BQ$6:BQ9)>COUNTA($BO$6:$BO$36),\"\",INDEX($BO$6:$BO$36,SMALL(IF($BO$6:$BO$36<>\"\",ROW($BO$6:$BO$36)-ROW($BO$6)+1),ROWS(BQ$6:BQ9))))","v":""},null,{"$f":"ROWS(BR$6:BR9)","v":4},{"$f":"IF(ROWS(BT$6:BT9)>COUNTA($BR$6:$BR$36),\"\",INDEX($BR$6:$BR$36,SMALL(IF($BR$6:$BR$36<>\"\",ROW($BR$6:$BR$36)-ROW($BR$6)+1),ROWS(BT$6:BT9))))","v":""},null,{"$f":"ROWS(BU$6:BU9)","v":4},{"$f":"IF(ROWS(BW$6:BW9)>COUNTA($BU$6:$BU$36),\"\",INDEX($BU$6:$BU$36,SMALL(IF($BU$6:$BU$36<>\"\",ROW($BU$6:$BU$36)-ROW($BU$6)+1),ROWS(BW$6:BW9))))","v":""}]
[null,"Agg 2",null,null,null,null,null,null,null,null,null,null,null,null,null,null,null,null,null,null,null,null,null,null,null,null,null,null,null,null,null,null,null,null,null,null,null,null,null,null,null,null,null,null,null,null,null,null,null,null,null,null,null,null,null,null,null,null,null,null,null,null,null,null,null,null,null,{"$f":"ROWS(BO$6:BO10)","v":5},{"$f":"IF(ROWS(BQ$6:BQ10)>COUNTA($BO$6:$BO$36),\"\",INDEX($BO$6:$BO$36,SMALL(IF($BO$6:$BO$36<>\"\",ROW($BO$6:$BO$36)-ROW($BO$6)+1),ROWS(BQ$6:BQ10))))","v":""},null,{"$f":"ROWS(BR$6:BR10)","v":5},{"$f":"IF(ROWS(BT$6:BT10)>COUNTA($BR$6:$BR$36),\"\",INDEX($BR$6:$BR$36,SMALL(IF($BR$6:$BR$36<>\"\",ROW($BR$6:$BR$36)-ROW($BR$6)+1),ROWS(BT$6:BT10))))","v":""},null,{"$f":"ROWS(BU$6:BU10)","v":5},{"$f":"IF(ROWS(BW$6:BW10)>COUNTA($BU$6:$BU$36),\"\",INDEX($BU$6:$BU$36,SMALL(IF($BU$6:$BU$36<>\"\",ROW($BU$6:$BU$36)-ROW($BU$6)+1),ROWS(BW$6:BW10))))","v":""}]
[null,"Agg 3",null,null,null,null,null,null,null,null,null,null,null,null,null,null,null,null,null,null,null,null,null,null,null,null,null,null,null,null,null,null,null,null,null,null,null,null,null,null,null,null,null,null,null,null,null,null,null,null,null,null,null,null,null,null,null,null,null,null,null,null,null,null,null,null,null,{"$f":"ROWS(BO$6:BO11)","v":6},{"$f":"IF(ROWS(BQ$6:BQ11)>COUNTA($BO$6:$BO$36),\"\",INDEX($BO$6:$BO$36,SMALL(IF($BO$6:$BO$36<>\"\",ROW($BO$6:$BO$36)-ROW($BO$6)+1),ROWS(BQ$6:BQ11))))","v":""},null,{"$f":"ROWS(BR$6:BR11)","v":6},{"$f":"IF(ROWS(BT$6:BT11)>COUNTA($BR$6:$BR$36),\"\",INDEX($BR$6:$BR$36,SMALL(IF($BR$6:$BR$36<>\"\",ROW($BR$6:$BR$36)-ROW($BR$6)+1),ROWS(BT$6:BT11))))","v":""},null,{"$f":"ROWS(BU$6:BU11)","v":6},{"$f":"IF(ROWS(BW$6:BW11)>COUNTA($BU$6:$BU$36),\"\",INDEX($BU$6:$BU$36,SMALL(IF($BU$6:$BU$36<>\"\",ROW($BU$6:$BU$36)-ROW($BU$6)+1),ROWS(BW$6:BW11))))","v":""}]
[null,"Agg 4",null,null,null,null,null,null,null,null,null,null,null,null,null,null,null,null,null,null,null,null,null,null,null,null,null,null,null,null,null,null,null,null,null,null,null,null,null,null,null,null,null,null,null,null,null,null,null,null,null,null,null,null,null,null,null,null,null,null,null,null,null,null,null,null,null,{"$f":"ROWS(BO$6:BO12)","v":7},{"$f":"IF(ROWS(BQ$6:BQ12)>COUNTA($BO$6:$BO$36),\"\",INDEX($BO$6:$BO$36,SMALL(IF($BO$6:$BO$36<>\"\",ROW($BO$6:$BO$36)-ROW($BO$6)+1),ROWS(BQ$6:BQ12))))","v":""},null,{"$f":"ROWS(BR$6:BR12)","v":7},{"$f":"IF(ROWS(BT$6:BT12)>COUNTA($BR$6:$BR$36),\"\",INDEX($BR$6:$BR$36,SMALL(IF($BR$6:$BR$36<>\"\",ROW($BR$6:$BR$36)-ROW($BR$6)+1),ROWS(BT$6:BT12))))","v":""},null,{"$f":"ROWS(BU$6:BU12)","v":7},{"$f":"IF(ROWS(BW$6:BW12)>COUNTA($BU$6:$BU$36),\"\",INDEX($BU$6:$BU$36,SMALL(IF($BU$6:$BU$36<>\"\",ROW($BU$6:$BU$36)-ROW($BU$6)+1),ROWS(BW$6:BW12))))","v":""}]
[null,"Agg 5",null,null,null,null,null,null,null,null,null,null,null,null,null,null,null,null,null,null,null,null,null,null,null,null,null,null,null,null,null,null,null,null,null,null,null,null,null,null,null,null,null,null,null,null,null,null,null,null,null,null,null,null,null,null,null,null,null,null,null,null,null,null,null,null,null,{"$f":"ROWS(BO$6:BO13)","v":8},{"$f":"IF(ROWS(BQ$6:BQ13)>COUNTA($BO$6:$BO$36),\"\",INDEX($BO$6:$BO$36,SMALL(IF($BO$6:$BO$36<>\"\",ROW($BO$6:$BO$36)-ROW($BO$6)+1),ROWS(BQ$6:BQ13))))","v":""},null,{"$f":"ROWS(BR$6:BR13)","v":8},{"$f":"IF(ROWS(BT$6:BT13)>COUNTA($BR$6:$BR$36),\"\",INDEX($BR$6:$BR$36,SMALL(IF($BR$6:$BR$36<>\"\",ROW($BR$6:$BR$36)-ROW($BR$6)+1),ROWS(BT$6:BT13))))","v":""},null,{"$f":"ROWS(BU$6:BU13)","v":8},{"$f":"IF(ROWS(BW$6:BW13)>COUNTA($BU$6:$BU$36),\"\",INDEX($BU$6:$BU$36,SMALL(IF($BU$6:$BU$36<>\"\",ROW($BU$6:$BU$36)-ROW($BU$6)+1),ROWS(BW$6:BW13))))","v":""}]
[null,"Agg 6",null,null,null,null,null,null,null,null,null,null,null,null,null,null,null,null,null,null,null,null,null,null,null,null,null,null,null,null,null,null,null,null,null,null,null,null,null,null,null,null,null,null,null,null,null,null,null,null,null,null,null,null,null,null,null,null,null,null,null,null,null,null,null,null,null,{"$f":"ROWS(BO$6:BO14)","v":9},{"$f":"IF(ROWS(BQ$6:BQ14)>COUNTA($BO$6:$BO$36),\"\",INDEX($BO$6:$BO$36,SMALL(IF($BO$6:$BO$36<>\"\",ROW($BO$6:$BO$36)-ROW($BO$6)+1),ROWS(BQ$6:BQ14))))","v":""},null,{"$f":"ROWS(BR$6:BR14)","v":9},{"$f":"IF(ROWS(BT$6:BT14)>COUNTA($BR$6:$BR$36),\"\",INDEX($BR$6:$BR$36,SMALL(IF($BR$6:$BR$36<>\"\",ROW($BR$6:$BR$36)-ROW($BR$6)+1),ROWS(BT$6:BT14))))","v":""},null,{"$f":"ROWS(BU$6:BU14)","v":9},{"$f":"IF(ROWS(BW$6:BW14)>COUNTA($BU$6:$BU$36),\"\",INDEX($BU$6:$BU$36,SMALL(IF($BU$6:$BU$36<>\"\",ROW($BU$6:$BU$36)-ROW($BU$6)+1),ROWS(BW$6:BW14))))","v":""}]
[null,"Recycled Material",null,null,null,null,null,null,null,null,null,null,null,null,null,null,null,null,null,null,null,null,null,null,null,null,null,null,null,null,null,null,null,null,null,null,null,null,null,null,null,null,null,null,null,null,null,null,null,null,null,null,null,null,null,null,null,null,null,null,null,null,null,null,null,null,null,{"$f":"ROWS(BO$6:BO15)","v":10},{"$f":"IF(ROWS(BQ$6:BQ15)>COUNTA($BO$6:$BO$36),\"\",INDEX($BO$6:$BO$36,SMALL(IF($BO$6:$BO$36<>\"\",ROW($BO$6:$BO$36)-ROW($BO$6)+1),ROWS(BQ$6:BQ15))))","v":""},null,{"$f":"ROWS(BR$6:BR15)","v":10},{"$f":"IF(ROWS(BT$6:BT15)>COUNTA($BR$6:$BR$36),\"\",INDEX($BR$6:$BR$36,SMALL(IF($BR$6:$BR$36<>\"\",ROW($BR$6:$BR$36)-ROW($BR$6)+1),ROWS(BT$6:BT15))))","v":""},null,{"$f":"ROWS(BU$6:BU15)","v":10},{"$f":"IF(ROWS(BW$6:BW15)>COUNTA($BU$6:$BU$36),\"\",INDEX($BU$6:$BU$36,SMALL(IF($BU$6:$BU$36<>\"\",ROW($BU$6:$BU$36)-ROW($BU$6)+1),ROWS(BW$6:BW15))))","v":""}]
[null,"Rec. 1",null,null,null,null,null,null,null,null,null,null,null,null,null,null,null,null,null,null,null,null,null,null,null,null,null,null,null,null,null,null,null,null,null,null,null,null,null,null,null,null,null,null,null,null,null,null,null,null,null,null,null,null,null,null,null,null,null,null,null,null,null,null,null,null,null,{"$f":"ROWS(BO$6:BO16)","v":11},{"$f":"IF(ROWS(BQ$6:BQ16)>COUNTA($BO$6:$BO$36),\"\",INDEX($BO$6:$BO$36,SMALL(IF($BO$6:$BO$36<>\"\",ROW($BO$6:$BO$36)-ROW($BO$6)+1),ROWS(BQ$6:BQ16))))","v":""},null,{"$f":"ROWS(BR$6:BR16)","v":11},{"$f":"IF(ROWS(BT$6:BT16)>COUNTA($BR$6:$BR$36),\"\",INDEX($BR$6:$BR$36,SMALL(IF($BR$6:$BR$36<>\"\",ROW($BR$6:$BR$36)-ROW($BR$6)+1),ROWS(BT$6:BT16))))","v":""},null,{"$f":"ROWS(BU$6:BU16)","v":11},{"$f":"IF(ROWS(BW$6:BW16)>COUNTA($BU$6:$BU$36),\"\",INDEX($BU$6:$BU$36,SMALL(IF($BU$6:$BU$36<>\"\",ROW($BU$6:$BU$36)-ROW($BU$6)+1),ROWS(BW$6:BW16))))","v":""}]
[null,"Rec. 2",null,null,null,null,null,null,null,null,null,null,null,null,null,null,null,null,null,null,null,null,null,null,null,null,null,null,null,null,null,null,null,null,null,null,null,null,null,null,null,null,null,null,null,null,null,null,null,null,null,null,null,null,null,null,null,null,null,null,null,null,null,null,null,null,null,{"$f":"ROWS(BO$6:BO17)","v":12},null,null,{"$f":"ROWS(BR$6:BR17)","v":12},null,null,{"$f":"ROWS(BU$6:BU17)","v":12}]
[null,null,null,null,null,null,null,null,null,null,"Sum",{"$f":"SUM(L9:L14,L16:L17)","v":0},{"$f":"SUM(M9:M14,M16:M17)","v":0},{"$f":"SUM(N9:N14,N16:N17)","v":0},null,null,null,null,null,null,null,null,null,null,null,null,null,null,null,null,null,null,null,null,null,null,null,null,null,null,null,null,null,null,null,null,null,null,null,null,null,null,null,null,null,null,null,null,null,null,null,null,null,null,null,null,null,{"$f":"ROWS(BO$6:BO18)","v":13},{"$f":"IF(ROWS(BQ$6:BQ18)>COUNTA($BO$6:$BO$36),\"\",INDEX($BO$6:$BO$36,SMALL(IF($BO$6:$BO$36<>\"\",ROW($BO$6:$BO$36)-ROW($BO$6)+1),ROWS(BQ$6:BQ18))))","v":""},null,{"$f":"ROWS(BR$6:BR18)","v":13},{"$f":"IF(ROWS(BT$6:BT18)>COUNTA($BR$6:$BR$36),\"\",INDEX($BR$6:$BR$36,SMALL(IF($BR$6:$BR$36<>\"\",ROW($BR$6:$BR$36)-ROW($BR$6)+1),ROWS(BT$6:BT18))))","v":""},null,{"$f":"ROWS(BU$6:BU18)","v":13},{"$f":"IF(ROWS(BW$6:BW18)>COUNTA($BU$6:$BU$36),\"\",INDEX($BU$6:$BU$36,SMALL(IF($BU$6:$BU$36<>\"\",ROW($BU$6:$BU$36)-ROW($BU$6)+1),ROWS(BW$6:BW18))))","v":""}]
[null,"Sieve Size",null,"Aggregate Gradations",null,null,null,null,null,null,null,"Trial Blends",null,null,"Specs",null,null,null,null,null,null,null,null,null,null,null,null,null,null,null,null,null,null,null,null,null,null,null,null,null,null,null,null,null,null,null,null,null,null,null,null,null,null,null,null,null,null,null,null,null,null,null,null,null,null,null,null,{"$f":"ROWS(BO$6:BO19)","v":14},{"$f":"IF(ROWS(BQ$6:BQ19)>COUNTA($BO$6:$BO$36),\"\",INDEX($BO$6:$BO$36,SMALL(IF($BO$6:$BO$36<>\"\",ROW($BO$6:$BO$36)-ROW($BO$6)+1),ROWS(BQ$6:BQ19))))","v":""},null,{"$f":"ROWS(BR$6:BR19)","v":14},{"$f":"IF(ROWS(BT$6:BT19)>COUNTA($BR$6:$BR$36),\"\",INDEX($BR$6:$BR$36,SMALL(IF($BR$6:$BR$36<>\"\",ROW($BR$6:$BR$36)-ROW($BR$6)+1),ROWS(BT$6:BT19))))","v":""},null,{"$f":"ROWS(BU$6:BU19)","v":14},{"$f":"IF(ROWS(BW$6:BW19)>COUNTA($BU$6:$BU$36),\"\",INDEX($BU$6:$BU$36,SMALL(IF($BU$6:$BU$36<>\"\",ROW($BU$6:$BU$36)-ROW($BU$6)+1),ROWS(BW$6:BW19))))","v":""}]
[null,"Metric","Standard","Agg 1","Agg 2","Agg 3","Agg 4","Agg 5","Agg 6","Rec. 1","Rec. 2","Blend 1","Blend 2","Blend 3","Min","Max",null,null,null,null,null,null,"4.75 / 9.5mm",null,null,null,null,"12.5mm",null,null,null,"19mm",null,null,null,"25mm",null,null,null,"37.5mm",null,null,null,null,null,null,null,null,null,null,null,null,null,null,null,null,null,null,null,null,null,null,null,null,null,null,null,{"$f":"ROWS(BO$6:BO20)","v":15},{"$f":"IF(ROWS(BQ$6:BQ20)>COUNTA($BO$6:$BO$36),\"\",INDEX($BO$6:$BO$36,SMALL(IF($BO$6:$BO$36<>\"\",ROW($BO$6:$BO$36)-ROW($BO$6)+1),ROWS(BQ$6:BQ20))))","v":""},null,{"$f":"ROWS(BR$6:BR20)","v":15},{"$f":"IF(ROWS(BT$6:BT20)>COUNTA($BR$6:$BR$36),\"\",INDEX($BR$6:$BR$36,SMALL(IF($BR$6:$BR$36<>\"\",ROW($BR$6:$BR$36)-ROW($BR$6)+1),ROWS(BT$6:BT20))))","v":""},null,{"$f":"ROWS(BU$6:BU20)","v":15},{"$f":"IF(ROWS(BW$6:BW20)>COUNTA($BU$6:$BU$36),\"\",INDEX($BU$6:$BU$36,SMALL(IF($BU$6:$BU$36<>\"\",ROW($BU$6:$BU$36)-ROW($BU$6)+1),ROWS(BW$6:BW20))))","v":""}]
[null,"50.0mm","2\"",{"$f":"$BR$81","v":100},{"$f":"$BR$82","v":100},{"$f":"$BR$83","v":100},{"$f":"$BR$84","v":100},{"$f":"$BR$85","v":100},{"$f":"$BR$86","v":100},{"$f":"$BR$87","v":100},{"$f":"BR88","v":100},null,null,null,{"$f":"'.45 Power'!E4","v":" "},{"$f":"'.45 Power'!F4","v":0},null,null,null,null,null,null,null,null,null,null,null,null,null,null,null,null,null,null,null,null,null,null,{"$f":"(($D21*$L$9)+($E21*$L$10)+($F21*$L$11)+($G21*$L$12)+($H21*$L$13)+($I21*$L$14)+($J21*$L$16)+($K21*$L$17))/100","v":0},{"$f":"(($D21*$M$9)+($E21*$M$10)+($F21*$M$11)+($G21*$M$12)+($H21*$M$13)+($I21*$M$14)+($J21*$M$16)+($K21*$M$17))/100","v":0},{"$f":"(($D21*$N$9)+($E21*$N$10)+($F21*$N$11)+($G21*$N$12)+($H21*$N$13)+($I21*$N$14)+($J21*$N$16)+($K21*$N$17))/100","v":0},null,null,null,null,null,null,null,null,null,null,null,null,null,null,null,null,null,null,null,null,null,null,null,null,null,null,{"$f":"ROWS(BO$6:BO21)","v":16},{"$f":"IF(ROWS(BQ$6:BQ21)>COUNTA($BO$6:$BO$36),\"\",INDEX($BO$6:$BO$36,SMALL(IF($BO$6:$BO$36<>\"\",ROW($BO$6:$BO$36)-ROW($BO$6)+1),ROWS(BQ$6:BQ21))))","v":""},null,{"$f":"ROWS(BR$6:BR21)","v":16},{"$f":"IF(ROWS(BT$6:BT21)>COUNTA($BR$6:$BR$36),\"\",INDEX($BR$6:$BR$36,SMALL(IF($BR$6:$BR$36<>\"\",ROW($BR$6:$BR$36)-ROW($BR$6)+1),ROWS(BT$6:BT21))))","v":""},null,{"$f":"ROWS(BU$6:BU21)","v":16},{"$f":"IF(ROWS(BW$6:BW21)>COUNTA($BU$6:$BU$36),\"\",INDEX($BU$6:$BU$36,SMALL(IF($BU$6:$BU$36<>\"\",ROW($BU$6:$BU$36)-ROW($BU$6)+1),ROWS(BW$6:BW21))))","v":""}]
[null,"37.5mm","1 1/2\"",{"$f":"$BS$81","v":100},{"$f":"$BS$82","v":100},{"$f":"$BS$83","v":100},{"$f":"$BS$84","v":100},{"$f":"$BS$85","v":100},{"$f":"$BS$86","v":100},{"$f":"$BS$87","v":100},{"$f":"BS88","v":100},null,null,null,{"$f":"'.45 Power'!E5","v":false},{"$f":"'.45 Power'!F5","v":false},null,null,null,null,null,null,null,null,null,null,null,null,null,null,null,null,null,null,{"$f":"(($D22*$L$9)+($E22*$L$10)+($F22*$L$11)+($G22*$L$12)+($H22*$L$13)+($I22*$L$14)+($J22*$L$16)+($K22*$L$17))/100","v":0},{"$f":"(($D22*$M$9)+($E22*$M$10)+($F22*$M$11)+($G22*$M$12)+($H22*$M$13)+($I22*$M$14)+($J22*$M$16)+($K22*$M$17))/100","v":0},{"$f":"(($D22*$N$9)+($E22*$N$10)+($F22*$N$11)+($G22*$N$12)+($H22*$N$13)+($I22*$N$14)+($J22*$N$16)+($K22*$N$17))/100","v":0},null,{"$f":"(($D22*$L$9)+($E22*$L$10)+($F22*$L$11)+($G22*$L$12)+($H22*$L$13)+($I22*$L$14)+($J22*$L$16)+($K22*$L$17))/100","v":0},{"$f":"(($D22*$M$9)+($E22*$M$10)+($F22*$M$11)+($G22*$M$12)+($H22*$M$13)+($I22*$M$14)+($J22*$M$16)+($K22*$M$17))/100","v":0},{"$f":"(($D22*$N$9)+($E22*$N$10)+($F22*$N$11)+($G22*$N$12)+($H22*$N$13)+($I22*$N$14)+($J22*$N$16)+($K22*$N$17))/100","v":0},null,null,null,null,null,null,null,null,null,null,null,null,null,null,null,null,null,null,null,null,null,null,null,null,null,null,{"$f":"ROWS(BO$6:BO22)","v":17},{"$f":"IF(ROWS(BQ$6:BQ22)>COUNTA($BO$6:$BO$36),\"\",INDEX($BO$6:$BO$36,SMALL(IF($BO$6:$BO$36<>\"\",ROW($BO$6:$BO$36)-ROW($BO$6)+1),ROWS(BQ$6:BQ22))))","v":""},null,{"$f":"ROWS(BR$6:BR22)","v":17},{"$f":"IF(ROWS(BT$6:BT22)>COUNTA($BR$6:$BR$36),\"\",INDEX($BR$6:$BR$36,SMALL(IF($BR$6:$BR$36<>\"\",ROW($BR$6:$BR$36)-ROW($BR$6)+1),ROWS(BT$6:BT22))))","v":""},null,{"$f":"ROWS(BU$6:BU22)","v":17},{"$f":"IF(ROWS(BW$6:BW22)>COUNTA($BU$6:$BU$36),\"\",INDEX($BU$6:$BU$36,SMALL(IF($BU$6:$BU$36<>\"\",ROW($BU$6:$BU$36)-ROW($BU$6)+1),ROWS(BW$6:BW22))))","v":""}]
[null,"25.0mm","1\"",{"$f":"$BT$81","v":100},{"$f":"$BT$82","v":100},{"$f":"$BT$83","v":100},{"$f":"$BT$84","v":100},{"$f":"$BT$85","v":100},{"$f":"$BT$86","v":100},{"$f":"$BT$87","v":100},{"$f":"BT88","v":100},null,null,null,{"$f":"'.45 Power'!E6","v":false},{"$f":"'.45 Power'!F6","v":false},null,null,null,null,null,null,null,null,null,null,null,null,null,null,{"$f":"(($D23*$L$9)+($E23*$L$10)+($F23*$L$11)+($G23*$L$12)+($H23*$L$13)+($I23*$L$14)+($J23*$L$16)+($K23*$L$17))/100","v":0},{"$f":"(($D23*$M$9)+($E23*$M$10)+($F23*$M$11)+($G23*$M$12)+($H23*$M$13)+($I23*$M$14)+($J23*$M$16)+($K23*$M$17))/100","v":0},{"$f":"(($D23*$N$9)+($E23*$N$10)+($F23*$N$11)+($G23*$N$12)+($H23*$N$13)+($I23*$N$14)+($J23*$N$16)+($K23*$N$17))/100","v":0},null,{"$f":"(($D23*$L$9)+($E23*$L$10)+($F23*$L$11)+($G23*$L$12)+($H23*$L$13)+($I23*$L$14)+($J23*$L$16)+($K23*$L$17))/100","v":0},{"$f":"(($D23*$M$9)+($E23*$M$10)+($F23*$M$11)+($G23*$M$12)+($H23*$M$13)+($I23*$M$14)+($J23*$M$16)+($K23*$M$17))/100","v":0},{"$f":"(($D23*$N$9)+($E23*$N$10)+($F23*$N$11)+($G23*$N$12)+($H23*$N$13)+($I23*$N$14)+($J23*$N$16)+($K23*$N$17))/100","v":0},null,{"$f":"(($D23*$L$9)+($E23*$L$10)+($F23*$L$11)+($G23*$L$12)+($H23*$L$13)+($I23*$L$14)+($J23*$L$16)+($K23*$L$17))/100","v":0},{"$f":"(($D23*$M$9)+($E23*$M$10)+($F23*$M$11)+($G23*$M$12)+($H23*$M$13)+($I23*$M$14)+($J23*$M$16)+($K23*$M$17))/100","v":0},{"$f":"(($D23*$N$9)+($E23*$N$10)+($F23*$N$11)+($G23*$N$12)+($H23*$N$13)+($I23*$N$14)+($J23*$N$16)+($K23*$N$17))/100","v":0},null,null,null,null,null,null,null,null,null,null,null,null,null,null,null,null,null,null,null,null,null,null,null,null,null,null,{"$f":"ROWS(BO$6:BO23)","v":18},{"$f":"IF(ROWS(BQ$6:BQ23)>COUNTA($BO$6:$BO$36),\"\",INDEX($BO$6:$BO$36,SMALL(IF($BO$6:$BO$36<>\"\",ROW($BO$6:$BO$36)-ROW($BO$6)+1),ROWS(BQ$6:BQ23))))","v":""},null,{"$f":"ROWS(BR$6:BR23)","v":18},{"$f":"IF(ROWS(BT$6:BT23)>COUNTA($BR$6:$BR$36),\"\",INDEX($BR$6:$BR$36,SMALL(IF($BR$6:$BR$36<>\"\",ROW($BR$6:$BR$36)-ROW($BR$6)+1),ROWS(BT$6:BT23))))","v":""},null,{"$f":"ROWS(BU$6:BU23)","v":18},{"$f":"IF(ROWS(BW$6:BW23)>COUNTA($BU$6:$BU$36),\"\",INDEX($BU$6:$BU$36,SMALL(IF($BU$6:$BU$36<>\"\",ROW($BU$6:$BU$36)-ROW($BU$6)+1),ROWS(BW$6:BW23))))","v":""}]
[null,"19.0mm","3/4\"",{"$f":"$BU$81","v":100},{"$f":"$BU$82","v":100},{"$f":"$BU$83","v":100},{"$f":"$BU$84","v":100},{"$f":"$BU$85","v":100},{"$f":"$BU$86","v":100},{"$f":"$BU$87","v":100},{"$f":"$BU$88","v":100},100,100,100,{"$f":"'.45 Power'!E7","v":false},{"$f":"'.45 Power'!F7","v":false},null,null,null,null,null,null,null,null,null,null,{"$f":"(($D24*$L$9)+($E24*$L$10)+($F24*$L$11)+($G24*$L$12)+($H24*$L$13)+($I24*$L$14)+($J24*$L$16)+($K24*$L$17))/100","v":0},{"$f":"(($D24*$M$9)+($E24*$M$10)+($F24*$M$11)+($G24*$M$12)+($H24*$M$13)+($I24*$M$14)+($J24*$M$16)+($K24*$M$17))/100","v":0},{"$f":"(($D24*$N$9)+($E24*$N$10)+($F24*$N$11)+($G24*$N$12)+($H24*$N$13)+($I24*$N$14)+($J24*$N$16)+($K24*$N$17))/100","v":0},null,{"$f":"(($D24*$L$9)+($E24*$L$10)+($F24*$L$11)+($G24*$L$12)+($H24*$L$13)+($I24*$L$14)+($J24*$L$16)+($K24*$L$17))/100","v":0},{"$f":"(($D24*$M$9)+($E24*$M$10)+($F24*$M$11)+($G24*$M$12)+($H24*$M$13)+($I24*$M$14)+($J24*$M$16)+($K24*$M$17))/100","v":0},{"$f":"(($D24*$N$9)+($E24*$N$10)+($F24*$N$11)+($G24*$N$12)+($H24*$N$13)+($I24*$N$14)+($J24*$N$16)+($K24*$N$17))/100","v":0},null,{"$f":"(($D24*$L$9)+($E24*$L$10)+($F24*$L$11)+($G24*$L$12)+($H24*$L$13)+($I24*$L$14)+($J24*$L$16)+($K24*$L$17))/100","v":0},{"$f":"(($D24*$M$9)+($E24*$M$10)+($F24*$M$11)+($G24*$M$12)+($H24*$M$13)+($I24*$M$14)+($J24*$M$16)+($K24*$M$17))/100","v":0},{"$f":"(($D24*$N$9)+($E24*$N$10)+($F24*$N$11)+($G24*$N$12)+($H24*$N$13)+($I24*$N$14)+($J24*$N$16)+($K24*$N$17))/100","v":0},null,{"$f":"(($D24*$L$9)+($E24*$L$10)+($F24*$L$11)+($G24*$L$12)+($H24*$L$13)+($I24*$L$14)+($J24*$L$16)+($K24*$L$17))/100","v":0},{"$f":"(($D24*$M$9)+($E24*$M$10)+($F24*$M$11)+($G24*$M$12)+($H24*$M$13)+($I24*$M$14)+($J24*$M$16)+($K24*$M$17))/100","v":0},{"$f":"(($D24*$N$9)+($E24*$N$10)+($F24*$N$11)+($G24*$N$12)+($H24*$N$13)+($I24*$N$14)+($J24*$N$16)+($K24*$N$17))/100","v":0},null,null,null,null,null,null,null,null,null,null,null,null,null,null,null,null,null,null,null,null,null,null,null,null,null,null,{"$f":"ROWS(BO$6:BO24)","v":19},{"$f":"IF(ROWS(BQ$6:BQ24)>COUNTA($BO$6:$BO$36),\"\",INDEX($BO$6:$BO$36,SMALL(IF($BO$6:$BO$36<>\"\",ROW($BO$6:$BO$36)-ROW($BO$6)+1),ROWS(BQ$6:BQ24))))","v":""},null,{"$f":"ROWS(BR$6:BR24)","v":19},{"$f":"IF(ROWS(BT$6:BT24)>COUNTA($BR$6:$BR$36),\"\",INDEX($BR$6:$BR$36,SMALL(IF($BR$6:$BR$36<>\"\",ROW($BR$6:$BR$36)-ROW($BR$6)+1),ROWS(BT$6:BT24))))","v":""},null,{"$f":"ROWS(BU$6:BU24)","v":19},{"$f":"IF(ROWS(BW$6:BW24)>COUNTA($BU$6:$BU$36),\"\",INDEX($BU$6:$BU$36,SMALL(IF($BU$6:$BU$36<>\"\",ROW($BU$6:$BU$36)-ROW($BU$6)+1),ROWS(BW$6:BW24))))","v":""}]
[null,"12.5mm","1/2\"",{"$f":"$BV$81","v":0},{"$f":"$BV$82","v":0},{"$f":"$BV$83","v":0},{"$f":"$BV$84","v":0},{"$f":"$BV$85","v":0},{"$f":"$BV$86","v":0},{"$f":"$BV$87","v":0},{"$f":"$BV$88","v":0},{"$f":"IF(ISTEXT(L18),\"\",(((($D25*$L$9)+($E25*$L$10)+($F25*$L$11)+($G25*$L$12)+($H25*$L$13)+($I25*$L$14)+($J25*$L$16)+($K25*$L$17))/100)))+L$35","v":0},{"$f":"IF(ISTEXT(M18),\"\",(((($D25*$M$9)+($E25*$M$10)+($F25*$M$11)+($G25*$M$12)+($H25*$M$13)+($I25*$M$14)+($J25*$M$16)+($K25*$M$17))/100)))+M$35","v":0},{"$f":"IF(ISTEXT(N18),\"\",(((($D25*$N$9)+($E25*$N$10)+($F25*$N$11)+($G25*$N$12)+($H25*$N$13)+($I25*$N$14)+($J25*$N$16)+($K25*$N$17))/100)))+N$35","v":0},{"$f":"'.45 Power'!E8","v":false},{"$f":"'.45 Power'!F8","v":false},null,null,null,null,null,null,null,null,null,null,null,null,null,null,null,null,null,null,null,null,null,null,null,null,null,null,null,null,null,null,null,null,null,null,null,null,null,null,null,null,null,null,null,null,null,null,null,null,null,null,null,{"$f":"ROWS(BO$6:BO25)","v":20},{"$f":"IF(ROWS(BQ$6:BQ25)>COUNTA($BO$6:$BO$36),\"\",INDEX($BO$6:$BO$36,SMALL(IF($BO$6:$BO$36<>\"\",ROW($BO$6:$BO$36)-ROW($BO$6)+1),ROWS(BQ$6:BQ25))))","v":""},null,{"$f":"ROWS(BR$6:BR25)","v":20},{"$f":"IF(ROWS(BT$6:BT25)>COUNTA($BR$6:$BR$36),\"\",INDEX($BR$6:$BR$36,SMALL(IF($BR$6:$BR$36<>\"\",ROW($BR$6:$BR$36)-ROW($BR$6)+1),ROWS(BT$6:BT25))))","v":""},null,{"$f":"ROWS(BU$6:BU25)","v":20},{"$f":"IF(ROWS(BW$6:BW25)>COUNTA($BU$6:$BU$36),\"\",INDEX($BU$6:$BU$36,SMALL(IF($BU$6:$BU$36<>\"\",ROW($BU$6:$BU$36)-ROW($BU$6)+1),ROWS(BW$6:BW25))))","v":""}]
[null,"9.5mm","3/8\"",{"$f":"$BW$81","v":0},{"$f":"$BW$82","v":0},{"$f":"$BW$83","v":0},{"$f":"$BW$84","v":0},{"$f":"$BW$85","v":0},{"$f":"$BW$86","v":0},{"$f":"$BW$87","v":0},{"$f":"$BW$88","v":0},{"$f":"IF(ISTEXT(L18),\"\",(((($D26*$L$9)+($E26*$L$10)+($F26*$L$11)+($G26*$L$12)+($H26*$L$13)+($I26*$L$14)+($J26*$L$16)+($K26*$L$17))/100)))+L$35","v":0},{"$f":"IF(ISTEXT(M18),\"\",(((($D26*$M$9)+($E26*$M$10)+($F26*$M$11)+($G26*$M$12)+($H26*$M$13)+($I26*$M$14)+($J26*$M$16)+($K26*$M$17))/100)))+M$35","v":0},{"$f":"IF(ISTEXT(N18),\"\",(((($D26*$N$9)+($E26*$N$10)+($F26*$N$11)+($G26*$N$12)+($H26*$N$13)+($I26*$N$14)+($J26*$N$16)+($K26*$N$17))/100)))+N$35","v":0},{"$f":"'.45 Power'!E9","v":false},{"$f":"'.45 Power'!F9","v":false},null,null,null,null,null,null,null,null,null,null,null,null,null,null,null,null,null,null,null,null,null,null,null,null,null,null,null,null,null,null,null,null,null,null,null,null,null,null,null,null,null,null,null,null,null,null,null,null,null,null,null,{"$f":"ROWS(BO$6:BO26)","v":21},{"$f":"IF(ROWS(BQ$6:BQ26)>COUNTA($BO$6:$BO$36),\"\",INDEX($BO$6:$BO$36,SMALL(IF($BO$6:$BO$36<>\"\",ROW($BO$6:$BO$36)-ROW($BO$6)+1),ROWS(BQ$6:BQ26))))","v":""},null,{"$f":"ROWS(BR$6:BR26)","v":21},{"$f":"IF(ROWS(BT$6:BT26)>COUNTA($BR$6:$BR$36),\"\",INDEX($BR$6:$BR$36,SMALL(IF($BR$6:$BR$36<>\"\",ROW($BR$6:$BR$36)-ROW($BR$6)+1),ROWS(BT$6:BT26))))","v":""},null,{"$f":"ROWS(BU$6:BU26)","v":21},{"$f":"IF(ROWS(BW$6:BW26)>COUNTA($BU$6:$BU$36),\"\",INDEX($BU$6:$BU$36,SMALL(IF($BU$6:$BU$36<>\"\",ROW($BU$6:$BU$36)-ROW($BU$6)+1),ROWS(BW$6:BW26))))","v":""}]
[null,"6.33mm","1/4\"",{"$f":"$BX$81","v":0},{"$f":"$BX$82","v":0},{"$f":"$BX$83","v":0},{"$f":"$BX$84","v":0},{"$f":"$BX$85","v":0},{"$f":"$BX$86","v":0},{"$f":"$BX$87","v":0},{"$f":"$BX$88","v":0},{"$f":"IF(ISTEXT(L18),\"\",(((($D27*$L$9)+($E27*$L$10)+($F27*$L$11)+($G27*$L$12)+($H27*$L$13)+($I27*$L$14)+($J27*$L$16)+($K27*$L$17))/100)))+L$35","v":0},{"$f":"IF(ISTEXT(M18),\"\",(((($D27*$M$9)+($E27*$M$10)+($F27*$M$11)+($G27*$M$12)+($H27*$M$13)+($I27*$M$14)+($J27*$M$16)+($K27*$M$17))/100)))+M$35","v":0},{"$f":"IF(ISTEXT(N18),\"\",(((($D27*$N$9)+($E27*$N$10)+($F27*$N$11)+($G27*$N$12)+($H27*$N$13)+($I27*$N$14)+($J27*$N$16)+($K27*$N$17))/100)))+N$35","v":0},{"$f":"'.45 Power'!E10","v":false},{"$f":"'.45 Power'!F10","v":false},null,null,null,null,null,null,null,null,null,null,null,null,null,null,null,null,null,null,null,null,null,null,null,null,null,null,null,null,null,null,null,null,null,null,null,null,null,null,null,null,null,null,null,null,null,null,null,null,null,null,null,{"$f":"ROWS(BO$6:BO27)","v":22},{"$f":"IF(ROWS(BQ$6:BQ27)>COUNTA($BO$6:$BO$36),\"\",INDEX($BO$6:$BO$36,SMALL(IF($BO$6:$BO$36<>\"\",ROW($BO$6:$BO$36)-ROW($BO$6)+1),ROWS(BQ$6:BQ27))))","v":""},null,{"$f":"ROWS(BR$6:BR27)","v":22},{"$f":"IF(ROWS(BT$6:BT27)>COUNTA($BR$6:$BR$36),\"\",INDEX($BR$6:$BR$36,SMALL(IF($BR$6:$BR$36<>\"\",ROW($BR$6:$BR$36)-ROW($BR$6)+1),ROWS(BT$6:BT27))))","v":""},null,{"$f":"ROWS(BU$6:BU27)","v":22},{"$f":"IF(ROWS(BW$6:BW27)>COUNTA($BU$6:$BU$36),\"\",INDEX($BU$6:$BU$36,SMALL(IF($BU$6:$BU$36<>\"\",ROW($BU$6:$BU$36)-ROW($BU$6)+1),ROWS(BW$6:BW27))))","v":""}]
[null,"4.75mm","#4",{"$f":"$BY$81","v":0},{"$f":"$BY$82","v":0},{"$f":"$BY$83","v":0},{"$f":"$BY$84","v":0},{"$f":"$BY$85","v":0},{"$f":"$BY$86","v":0},{"$f":"$BY$87","v":0},{"$f":"$BY$88","v":0},{"$f":"IF(ISTEXT(L18),\"\",(((($D28*$L$9)+($E28*$L$10)+($F28*$L$11)+($G28*$L$12)+($H28*$L$13)+($I28*$L$14)+($J28*$L$16)+($K28*$L$17))/100)))+L$35","v":0},{"$f":"IF(ISTEXT(M18),\"\",(((($D28*$M$9)+($E28*$M$10)+($F28*$M$11)+($G28*$M$12)+($H28*$M$13)+($I28*$M$14)+($J28*$M$16)+($K28*$M$17))/100)))+M$35","v":0},{"$f":"IF(ISTEXT(N18),\"\",(((($D28*$N$9)+($E28*$N$10)+($F28*$N$11)+($G28*$N$12)+($H28*$N$13)+($I28*$N$14)+($J28*$N$16)+($K28*$N$17))/100)))+N$35","v":0},{"$f":"'.45 Power'!E11","v":false},{"$f":"'.45 Power'!F11","v":false},null,null,null,null,null,null,null,null,null,null,null,null,null,null,null,null,null,null,null,null,null,null,null,null,null,null,null,null,null,null,null,null,null,null,null,null,null,null,null,null,null,null,null,null,null,null,null,null,null,null,null,{"$f":"ROWS(BO$6:BO28)","v":23},{"$f":"IF(ROWS(BQ$6:BQ28)>COUNTA($BO$6:$BO$36),\"\",INDEX($BO$6:$BO$36,SMALL(IF($BO$6:$BO$36<>\"\",ROW($BO$6:$BO$36)-ROW($BO$6)+1),ROWS(BQ$6:BQ28))))","v":""},null,{"$f":"ROWS(BR$6:BR28)","v":23},{"$f":"IF(ROWS(BT$6:BT28)>COUNTA($BR$6:$BR$36),\"\",INDEX($BR$6:$BR$36,SMALL(IF($BR$6:$BR$36<>\"\",ROW($BR$6:$BR$36)-ROW($BR$6)+1),ROWS(BT$6:BT28))))","v":""},null,{"$f":"ROWS(BU$6:BU28)","v":23},{"$f":"IF(ROWS(BW$6:BW28)>COUNTA($BU$6:$BU$36),\"\",INDEX($BU$6:$BU$36,SMALL(IF($BU$6:$BU$36<>\"\",ROW($BU$6:$BU$36)-ROW($BU$6)+1),ROWS(BW$6:BW28))))","v":""}]
[null,"2.36mm","#8",{"$f":"$BZ$81","v":0},{"$f":"$BZ$82","v":0},{"$f":"$BZ$83","v":0},{"$f":"$BZ$84","v":0},{"$f":"$BZ$85","v":0},{"$f":"$BZ$86","v":0},{"$f":"$BZ$87","v":0},{"$f":"$BZ$88","v":0},{"$f":"IF(ISTEXT(L18),\"\",(((($D29*$L$9)+($E29*$L$10)+($F29*$L$11)+($G29*$L$12)+($H29*$L$13)+($I29*$L$14)+($J29*$L$16)+($K29*$L$17))/100)))+L$35","v":0},{"$f":"IF(ISTEXT(M18),\"\",(((($D29*$M$9)+($E29*$M$10)+($F29*$M$11)+($G29*$M$12)+($H29*$M$13)+($I29*$M$14)+($J29*$M$16)+($K29*$M$17))/100)))+M$35","v":0},{"$f":"IF(ISTEXT(N18),\"\",(((($D29*$N$9)+($E29*$N$10)+($F29*$N$11)+($G29*$N$12)+($H29*$N$13)+($I29*$N$14)+($J29*$N$16)+($K29*$N$17))/100)))+N$35","v":0},{"$f":"'.45 Power'!E12","v":false},{"$f":"'.45 Power'!F12","v":false},null,null,null,null,null,null,null,null,null,null,null,null,null,null,null,null,null,null,null,null,null,null,null,null,null,null,null,null,null,null,null,null,null,null,null,null,null,null,null,null,null,null,null,null,null,null,null,null,null,null,null,{"$f":"ROWS(BO$6:BO29)","v":24},{"$f":"IF(ROWS(BQ$6:BQ29)>COUNTA($BO$6:$BO$36),\"\",INDEX($BO$6:$BO$36,SMALL(IF($BO$6:$BO$36<>\"\",ROW($BO$6:$BO$36)-ROW($BO$6)+1),ROWS(BQ$6:BQ29))))","v":""},null,{"$f":"ROWS(BR$6:BR29)","v":24},{"$f":"IF(ROWS(BT$6:BT29)>COUNTA($BR$6:$BR$36),\"\",INDEX($BR$6:$BR$36,SMALL(IF($BR$6:$BR$36<>\"\",ROW($BR$6:$BR$36)-ROW($BR$6)+1),ROWS(BT$6:BT29))))","v":""},null,{"$f":"ROWS(BU$6:BU29)","v":24},{"$f":"IF(ROWS(BW$6:BW29)>COUNTA($BU$6:$BU$36),\"\",INDEX($BU$6:$BU$36,SMALL(IF($BU$6:$BU$36<>\"\",ROW($BU$6:$BU$36)-ROW($BU$6)+1),ROWS(BW$6:BW29))))","v":""}]
[null,"1.18mm","#16",{"$f":"$CA$81","v":0},{"$f":"$CA$82","v":0},{"$f":"$CA$83","v":0},{"$f":"$CA$84","v":0},{"$f":"$CA$85","v":0},{"$f":"$CA$86","v":0},{"$f":"$CA$87","v":0},{"$f":"$CA$88","v":0},{"$f":"IF(ISTEXT(L18),\"\",(((($D30*$L$9)+($E30*$L$10)+($F30*$L$11)+($G30*$L$12)+($H30*$L$13)+($I30*$L$14)+($J30*$L$16)+($K30*$L$17))/100)))+L$35","v":0},{"$f":"IF(ISTEXT(M18),\"\",(((($D30*$M$9)+($E30*$M$10)+($F30*$M$11)+($G30*$M$12)+($H30*$M$13)+($I30*$M$14)+($J30*$M$16)+($K30*$M$17))/100)))+M$35","v":0},{"$f":"IF(ISTEXT(N18),\"\",(((($D30*$N$9)+($E30*$N$10)+($F30*$N$11)+($G30*$N$12)+($H30*$N$13)+($I30*$N$14)+($J30*$N$16)+($K30*$N$17))/100)))+N$35","v":0},{"$f":"'.45 Power'!E13","v":false},{"$f":"'.45 Power'!F13","v":false},null,null,null,null,null,null,null,null,null,null,null,null,null,null,null,null,null,null,null,null,null,null,null,null,null,null,null,null,null,null,null,null,null,null,null,null,null,null,null,null,null,null,null,null,null,null,null,null,null,null,null,{"$f":"ROWS(BO$6:BO30)","v":25},{"$f":"IF(ROWS(BQ$6:BQ30)>COUNTA($BO$6:$BO$36),\"\",INDEX($BO$6:$BO$36,SMALL(IF($BO$6:$BO$36<>\"\",ROW($BO$6:$BO$36)-ROW($BO$6)+1),ROWS(BQ$6:BQ30))))","v":""},null,{"$f":"ROWS(BR$6:BR30)","v":25},{"$f":"IF(ROWS(BT$6:BT30)>COUNTA($BR$6:$BR$36),\"\",INDEX($BR$6:$BR$36,SMALL(IF($BR$6:$BR$36<>\"\",ROW($BR$6:$BR$36)-ROW($BR$6)+1),ROWS(BT$6:BT30))))","v":""},null,{"$f":"ROWS(BU$6:BU30)","v":25},{"$f":"IF(ROWS(BW$6:BW30)>COUNTA($BU$6:$BU$36),\"\",INDEX($BU$6:$BU$36,SMALL(IF($BU$6:$BU$36<>\"\",ROW($BU$6:$BU$36)-ROW($BU$6)+1),ROWS(BW$6:BW30))))","v":""}]
[null,"600µm","#30",{"$f":"$CB$81","v":0},{"$f":"$CB$82","v":0},{"$f":"$CB$83","v":0},{"$f":"$CB$84","v":0},{"$f":"$CB$85","v":0},{"$f":"$CB$86","v":0},{"$f":"$CB$87","v":0},{"$f":"$CB$88","v":0},{"$f":"IF(ISTEXT(L18),\"\",(((($D31*$L$9)+($E31*$L$10)+($F31*$L$11)+($G31*$L$12)+($H31*$L$13)+($I31*$L$14)+($J31*$L$16)+($K31*$L$17))/100)))+L$35","v":0},{"$f":"IF(ISTEXT(M18),\"\",(((($D31*$M$9)+($E31*$M$10)+($F31*$M$11)+($G31*$M$12)+($H31*$M$13)+($I31*$M$14)+($J31*$M$16)+($K31*$M$17))/100)))+M$35","v":0},{"$f":"IF(ISTEXT(N18),\"\",(((($D31*$N$9)+($E31*$N$10)+($F31*$N$11)+($G31*$N$12)+($H31*$N$13)+($I31*$N$14)+($J31*$N$16)+($K31*$N$17))/100)))+N$35","v":0},{"$f":"'.45 Power'!E14","v":false},{"$f":"'.45 Power'!F14","v":false},null,null,null,null,null,"Gsb Blend 1",null,null,"Gsb Blend 2",null,null,"Gsb Blend 3",null,null,null,null,null,null,null,null,null,null,null,null,null,null,null,null,null,null,null,null,null,null,null,null,null,null,null,null,null,null,null,null,null,null,null,null,null,null,null,{"$f":"ROWS(BO$6:BO31)","v":26},{"$f":"IF(ROWS(BQ$6:BQ31)>COUNTA($BO$6:$BO$36),\"\",INDEX($BO$6:$BO$36,SMALL(IF($BO$6:$BO$36<>\"\",ROW($BO$6:$BO$36)-ROW($BO$6)+1),ROWS(BQ$6:BQ31))))","v":""},null,{"$f":"ROWS(BR$6:BR31)","v":26},{"$f":"IF(ROWS(BT$6:BT31)>COUNTA($BR$6:$BR$36),\"\",INDEX($BR$6:$BR$36,SMALL(IF($BR$6:$BR$36<>\"\",ROW($BR$6:$BR$36)-ROW($BR$6)+1),ROWS(BT$6:BT31))))","v":""},null,{"$f":"ROWS(BU$6:BU31)","v":26},{"$f":"IF(ROWS(BW$6:BW31)>COUNTA($BU$6:$BU$36),\"\",INDEX($BU$6:$BU$36,SMALL(IF($BU$6:$BU$36<>\"\",ROW($BU$6:$BU$36)-ROW($BU$6)+1),ROWS(BW$6:BW31))))","v":""}]
[null,"300µm","#50",{"$f":"$CC$81","v":0},{"$f":"$CC$82","v":0},{"$f":"$CC$83","v":0},{"$f":"$CC$84","v":0},{"$f":"$CC$85","v":0},{"$f":"$CC$86","v":0},{"$f":"$CC$87","v":0},{"$f":"$CC$88","v":0},{"$f":"IF(ISTEXT(L18),\"\",(((($D32*$L$9)+($E32*$L$10)+($F32*$L$11)+($G32*$L$12)+($H32*$L$13)+($I32*$L$14)+($J32*$L$16)+($K32*$L$17))/100)))+L$35","v":0},{"$f":"IF(ISTEXT(M18),\"\",(((($D32*$M$9)+($E32*$M$10)+($F32*$M$11)+($G32*$M$12)+($H32*$M$13)+($I32*$M$14)+($J32*$M$16)+($K32*$M$17))/100)))+M$35","v":0},{"$f":"IF(ISTEXT(N18),\"\",(((($D32*$N$9)+($E32*$N$10)+($F32*$N$11)+($G32*$N$12)+($H32*$N$13)+($I32*$N$14)+($J32*$N$16)+($K32*$N$17))/100)))+N$35","v":0},{"$f":"'.45 Power'!E15","v":false},{"$f":"'.45 Power'!F15","v":false},null,null,null,null,null,{"$f":"L9","v":0},{"$f":"D36","v":0},{"$f":"IF(V32=0,0,V32/W32)","v":0},{"$f":"M9","v":0},{"$f":"D36","v":0},{"$f":"IF(Y32=0,0,Y32/Z32)","v":0},{"$f":"N9","v":0},{"$f":"D36","v":0},{"$f":"IF(AB32=0,0,AB32/AC32)","v":0},null,null,null,null,null,null,null,null,null,null,null,null,null,null,null,null,null,null,null,null,null,null,null,null,null,null,null,null,null,null,null,null,null,null,null,null,null,{"$f":"ROWS(BO$6:BO32)","v":27},{"$f":"IF(ROWS(BQ$6:BQ32)>COUNTA($BO$6:$BO$36),\"\",INDEX($BO$6:$BO$36,SMALL(IF($BO$6:$BO$36<>\"\",ROW($BO$6:$BO$36)-ROW($BO$6)+1),ROWS(BQ$6:BQ32))))","v":""},null,{"$f":"ROWS(BR$6:BR32)","v":27},{"$f":"IF(ROWS(BT$6:BT32)>COUNTA($BR$6:$BR$36),\"\",INDEX($BR$6:$BR$36,SMALL(IF($BR$6:$BR$36<>\"\",ROW($BR$6:$BR$36)-ROW($BR$6)+1),ROWS(BT$6:BT32))))","v":""},null,{"$f":"ROWS(BU$6:BU32)","v":27},{"$f":"IF(ROWS(BW$6:BW32)>COUNTA($BU$6:$BU$36),\"\",INDEX($BU$6:$BU$36,SMALL(IF($BU$6:$BU$36<>\"\",ROW($BU$6:$BU$36)-ROW($BU$6)+1),ROWS(BW$6:BW32))))","v":""}]
[null,"150µm","#100",{"$f":"$CD$81","v":0},{"$f":"$CD$82","v":0},{"$f":"$CD$83","v":0},{"$f":"$CD$84","v":0},{"$f":"$CD$85","v":0},{"$f":"$CD$86","v":0},{"$f":"$CD$87","v":0},{"$f":"$CD$88","v":0},{"$f":"IF(ISTEXT(L18),\"\",(((($D33*$L$9)+($E33*$L$10)+($F33*$L$11)+($G33*$L$12)+($H33*$L$13)+($I33*$L$14)+($J33*$L$16)+($K33*$L$17))/100)))+L$35","v":0},{"$f":"IF(ISTEXT(M18),\"\",(((($D33*$M$9)+($E33*$M$10)+($F33*$M$11)+($G33*$M$12)+($H33*$M$13)+($I33*$M$14)+($J33*$M$16)+($K33*$M$17))/100)))+M$35","v":0},{"$f":"IF(ISTEXT(N18),\"\",(((($D33*$N$9)+($E33*$N$10)+($F33*$N$11)+($G33*$N$12)+($H33*$N$13)+($I33*$N$14)+($J33*$N$16)+($K33*$N$17))/100)))+N$35","v":0},{"$f":"'.45 Power'!E16","v":false},{"$f":"'.45 Power'!F16","v":false},null,null,null,null,null,0,{"$f":"E36","v":0},0,0,{"$f":"E36","v":0},{"$f":"IF(Y33=0,0,Y33/Z33)","v":0},0,{"$f":"E36","v":0},0,null,null,null,null,null,null,null,null,null,null,null,null,null,null,null,null,null,null,null,null,null,null,null,null,null,null,null,null,null,null,null,null,null,null,null,null,null,{"$f":"ROWS(BO$6:BO33)","v":28},{"$f":"IF(ROWS(BQ$6:BQ33)>COUNTA($BO$6:$BO$36),\"\",INDEX($BO$6:$BO$36,SMALL(IF($BO$6:$BO$36<>\"\",ROW($BO$6:$BO$36)-ROW($BO$6)+1),ROWS(BQ$6:BQ33))))","v":""},null,{"$f":"ROWS(BR$6:BR33)","v":28},{"$f":"IF(ROWS(BT$6:BT33)>COUNTA($BR$6:$BR$36),\"\",INDEX($BR$6:$BR$36,SMALL(IF($BR$6:$BR$36<>\"\",ROW($BR$6:$BR$36)-ROW($BR$6)+1),ROWS(BT$6:BT33))))","v":""},null,{"$f":"ROWS(BU$6:BU33)","v":28},{"$f":"IF(ROWS(BW$6:BW33)>COUNTA($BU$6:$BU$36),\"\",INDEX($BU$6:$BU$36,SMALL(IF($BU$6:$BU$36<>\"\",ROW($BU$6:$BU$36)-ROW($BU$6)+1),ROWS(BW$6:BW33))))","v":""}]
[null,"75µm","#200",{"$f":"$CE$81","v":0},{"$f":"$CE$82","v":0},{"$f":"$CE$83","v":0},{"$f":"$CE$84","v":0},{"$f":"$CE$85","v":0},{"$f":"$CE$86","v":0},{"$f":"$CE$87","v":0},{"$f":"$CE$88","v":0},{"$f":"IF(ISTEXT(L18),\"\",(((($D34*$L$9)+($E34*$L$10)+($F34*$L$11)+($G34*$L$12)+($H34*$L$13)+($I34*$L$14)+($J34*$L$16)+($K34*$L$17))/100)))+L$35","v":0},{"$f":"IF(ISTEXT(M18),\"\",(((($D34*$M$9)+($E34*$M$10)+($F34*$M$11)+($G34*$M$12)+($H34*$M$13)+($I34*$M$14)+($J34*$M$16)+($K34*$M$17))/100)))+M$35","v":0},{"$f":"IF(ISTEXT(N18),\"\",(((($D34*$N$9)+($E34*$N$10)+($F34*$N$11)+($G34*$N$12)+($H34*$N$13)+($I34*$N$14)+($J34*$N$16)+($K34*$N$17))/100)))+N$35","v":0},{"$f":"'.45 Power'!E17","v":false},{"$f":"'.45 Power'!F17","v":false},null,null,null,null,null,0,{"$f":"F36","v":0},0,0,{"$f":"F36","v":0},0,0,{"$f":"F36","v":0},0,null,null,null,null,null,null,null,null,null,null,null,null,null,null,null,null,null,null,null,null,null,null,null,null,null,null,null,null,null,null,null,null,null,null,null,null,null,{"$f":"ROWS(BO$6:BO34)","v":29},{"$f":"IF(ROWS(BQ$6:BQ34)>COUNTA($BO$6:$BO$36),\"\",INDEX($BO$6:$BO$36,SMALL(IF($BO$6:$BO$36<>\"\",ROW($BO$6:$BO$36)-ROW($BO$6)+1),ROWS(BQ$6:BQ34))))","v":""},null,{"$f":"ROWS(BR$6:BR34)","v":29},{"$f":"IF(ROWS(BT$6:BT34)>COUNTA($BR$6:$BR$36),\"\",INDEX($BR$6:$BR$36,SMALL(IF($BR$6:$BR$36<>\"\",ROW($BR$6:$BR$36)-ROW($BR$6)+1),ROWS(BT$6:BT34))))","v":""},null,{"$f":"ROWS(BU$6:BU34)","v":29},{"$f":"IF(ROWS(BW$6:BW34)>COUNTA($BU$6:$BU$36),\"\",INDEX($BU$6:$BU$36,SMALL(IF($BU$6:$BU$36<>\"\",ROW($BU$6:$BU$36)-ROW($BU$6)+1),ROWS(BW$6:BW34))))","v":""}]
[null,"If needed, enter the % fines that will be removed through ther bag house ( - )",null,null,null,null,null,null,null,null,null,null,null,null,null,null,null,null,null,null,null,0,{"$f":"G36","v":0},0,0,{"$f":"G36","v":0},0,0,{"$f":"G36","v":0},0,null,null,null,null,null,null,null,null,null,null,null,null,null,null,null,null,null,null,null,null,null,null,null,null,null,null,null,null,null,null,null,null,null,null,null,null,null,{"$f":"ROWS(BO$6:BO35)","v":30},{"$f":"IF(ROWS(BQ$6:BQ35)>COUNTA($BO$6:$BO$36),\"\",INDEX($BO$6:$BO$36,SMALL(IF($BO$6:$BO$36<>\"\",ROW($BO$6:$BO$36)-ROW($BO$6)+1),ROWS(BQ$6:BQ35))))","v":""},null,{"$f":"ROWS(BR$6:BR35)","v":30},{"$f":"IF(ROWS(BT$6:BT35)>COUNTA($BR$6:$BR$36),\"\",INDEX($BR$6:$BR$36,SMALL(IF($BR$6:$BR$36<>\"\",ROW($BR$6:$BR$36)-ROW($BR$6)+1),ROWS(BT$6:BT35))))","v":""},null,{"$f":"ROWS(BU$6:BU35)","v":30},{"$f":"IF(ROWS(BW$6:BW35)>COUNTA($BU$6:$BU$36),\"\",INDEX($BU$6:$BU$36,SMALL(IF($BU$6:$BU$36<>\"\",ROW($BU$6:$BU$36)-ROW($BU$6)+1),ROWS(BW$6:BW35))))","v":""}]
[null,"Bulk SpGr (Gsb)",null,{"$f":"$CF81","v":0},{"$f":"$CF82","v":0},{"$f":"$CF83","v":0},{"$f":"$CF84","v":0},{"$f":"$CF85","v":0},{"$f":"$CF86","v":0},{"$f":"$CF87","v":0},{"$f":"$CF88","v":0},{"$f":"IF(ISTEXT($L$18),\"\",X41)","v":{"$error":"#DIV/0!"}},{"$f":"IF(ISTEXT($L$18),\"\",AA41)","v":{"$error":"#DIV/0!"}},{"$f":"IF(ISTEXT($N$18),\"\",AD41)","v":{"$error":"#DIV/0!"}},null,null,null,null,null,null,null,0,{"$f":"H36","v":0},0,0,{"$f":"H36","v":0},0,0,{"$f":"H36","v":0},0,null,null,null,null,null,null,null,null,null,null,null,null,{"$f":"M3","v":0},null,null,null,null,null,null,null,null,null,"1 Face","2 Faces","1 Face","2 Faces","UCV",null,"SE","F&L",null,null,null,null,null,null,null,{"$f":"ROWS(BO$6:BO36)","v":31},{"$f":"IF(ROWS(BQ$6:BQ36)>COUNTA($BO$6:$BO$36),\"\",INDEX($BO$6:$BO$36,SMALL(IF($BO$6:$BO$36<>\"\",ROW($BO$6:$BO$36)-ROW($BO$6)+1),ROWS(BQ$6:BQ36))))","v":""},null,{"$f":"ROWS(BR$6:BR36)","v":31},{"$f":"IF(ROWS(BT$6:BT36)>COUNTA($BR$6:$BR$36),\"\",INDEX($BR$6:$BR$36,SMALL(IF($BR$6:$BR$36<>\"\",ROW($BR$6:$BR$36)-ROW($BR$6)+1),ROWS(BT$6:BT36))))","v":""},null,{"$f":"ROWS(BU$6:BU36)","v":31},{"$f":"IF(ROWS(BW$6:BW36)>COUNTA($BU$6:$BU$36),\"\",INDEX($BU$6:$BU$36,SMALL(IF($BU$6:$BU$36<>\"\",ROW($BU$6:$BU$36)-ROW($BU$6)+1),ROWS(BW$6:BW36))))","v":""}]
[null,"Absorption",null,{"$f":"$CG81","v":0},{"$f":"$CG82","v":0},{"$f":"$CG83","v":0},{"$f":"$CG84","v":0},{"$f":"$CG85","v":0},{"$f":"$CG86","v":0},{"$f":"$CG87","v":0},{"$f":"$CG88","v":0},{"$f":"IF(ISTEXT(L18),\"\",(($D$37*L$9)+($E$37*L$10)+($F$37*L$11)+($G$37*L$12)+($H$37*L$13)+($I$37*L$14)+($J$37*L$16)+($K$37*L$17))/100)","v":0},{"$f":"IF(ISTEXT(M18),\"\",(($D$37*M$9)+($E$37*M$10)+($F$37*M$11)+($G$37*M$12)+($H$37*M$13)+($I$37*M$14)+($J$37*M$16)+($K$37*M$17))/100)","v":0},{"$f":"IF(ISTEXT(N18),\"\",(($D$37*N$9)+($E$37*N$10)+($F$37*N$11)+($G$37*N$12)+($H$37*N$13)+($I$37*N$14)+($J$37*N$16)+($K$37*N$17))/100)","v":0},null,null,null,null,null,null,null,0,{"$f":"I36","v":0},0,0,{"$f":"I36","v":0},0,0,{"$f":"I36","v":0},0,null,null,null,null,null,null,null,null,null,null,null,null,{"$f":"H4","v":0},null,null,null,null,null,null,null,null,null,"<100","<100",">100",">100","<100",">100"]
[null,"App. SpGr (Gsa)",null,{"$f":"$CH81","v":0},{"$f":"$CH82","v":0},{"$f":"$CH83","v":0},{"$f":"$CH84","v":0},{"$f":"$CH85","v":0},{"$f":"CF86","v":0},{"$f":"$CH87","v":0},{"$f":"$CH88","v":0},{"$f":"IF(ISTEXT($L$18),\"\",X52)","v":{"$error":"#DIV/0!"}},{"$f":"IF(ISTEXT($L$18),\"\",AA52)","v":{"$error":"#DIV/0!"}},{"$f":"IF(ISTEXT($N$18),\"\",AD52)","v":{"$error":"#DIV/0!"}},"Min","Max",null,null,null,null,null,{"$f":"L16","v":0},{"$f":"J36","v":0},0,{"$f":"M16","v":0},{"$f":"J36","v":0},0,{"$f":"N16","v":0},{"$f":"J36","v":0},0,null,null,null,null,null,null,null,null,null,null,null,null,{"$f":"INDEX($BG$38:$BG$43,MATCH(1,(AQ36=$AY$38:$AY$43)*(AQ37=$AZ$38:$AZ$43),0))","v":{"$error":"#N/A"}},{"$f":"INDEX($BH$38:$BH$43,MATCH(1,(AQ36=$AY$38:$AY$43)*(AQ37=$AZ$38:$AZ$43),0))","v":{"$error":"#N/A"}},{"$f":"INDEX($BE$38:$BE$43,MATCH(1,(AQ36=$AY$38:$AY$43)*(AQ37=$AZ$38:$AZ$43),0))","v":{"$error":"#N/A"}},{"$f":"INDEX($BF$38:$BF$43,MATCH(1,(AQ36=$AY$38:$AY$43)*(AQ37=$AZ$38:$AZ$43),0))","v":{"$error":"#N/A"}},{"$f":"INDEX($BA$38:$BA$43,MATCH(1,(AQ36=$AY$38:$AY$43)*(AQ37=$AZ$38:$AZ$43),0))","v":{"$error":"#N/A"}},{"$f":"INDEX($BB$38:$BB$43,MATCH(1,(AQ36=$AY$38:$AY$43)*(AQ37=$AZ$38:$AZ$43),0))","v":{"$error":"#N/A"}},{"$f":"INDEX($BC$38:$BC$43,MATCH(1,(AQ36=$AY$38:$AY$43)*(AQ37=$AZ$38:$AZ$43),0))","v":{"$error":"#N/A"}},{"$f":"INDEX($BD$38:$BD$43,MATCH(1,(AQ36=$AY$38:$AY$43)*(AQ37=$AZ$38:$AZ$43),0))","v":{"$error":"#N/A"}},{"$f":"$AQ$36","v":0},"<.3",55,"-","-","-","-","-","Min 40","-"]
[null,"Sand Equivalency",null,{"$f":"$CM81","v":0},{"$f":"$CM82","v":0},{"$f":"$CM83","v":0},{"$f":"$CM84","v":0},{"$f":"$CM85","v":0},{"$f":"$CM86","v":0},{"$f":"$CM87","v":0},{"$f":"$CM88","v":0},{"$f":"IF(ISTEXT($L$18),\"\",IF(L18>0,(($D39*L$9)+($E39*L$10)+($F39*L$11)+($G39*L$12)+($H39*L$13)+($I39*$L$14)+($J39*L$16)+($K39*L$17))/R39,\"\"))","v":""},{"$f":"IF(ISTEXT(M18),\"\",IF(M18>0,(($D39*M$9)+($E39*M$10)+($F39*M$11)+($G39*M$12)+($H39*M$13)+($I39*M$14)+($J39*M$16)+($K39*M$17))/S39,\"\"))","v":""},{"$f":"IF(ISTEXT(N18),\"\",IF(N18>0,(($D39*N$9)+($E39*N$10)+($F39*N$11)+($G39*N$12)+($H39*N$13)+($I39*N$14)+($J39*N$16)+($K39*N$17))/T39,\"\"))","v":""},{"$f":"AQ38","v":{"$error":"#N/A"}},null,null,{"$f":"IF($D39,L$9)+IF($E39,L$10)+IF($F39,L$11)+IF($G39,L$12)+IF($H39,L$13)+IF($I39,L$14)+IF(J39,L$16)+IF($K39,L$17)","v":0},{"$f":"IF($D39,M$9)+IF($E39,M$10)+IF($F39,M$11)+IF($G39,M$12)+IF($H39,M$13)+IF($I39,M$14)+IF($J39,M$16)+IF($K39,M$17)","v":0},0,null,{"$f":"L17","v":0},{"$f":"K36","v":0},0,{"$f":"M17","v":0},{"$f":"K36","v":0},0,{"$f":"N17","v":0},{"$f":"K36","v":0},0,null,null,null,null,null,null,null,null,null,null,null,null,"UCV","F&L","SE <100","SE >100","1F <100","2F <100","1F >100","2F >100",0,".3 to <3",85,"-",50,"-","Min 40","Min 40","Min 40",10]
[null,"Flat & Elongated 3:1",null,{"$f":"$CI81","v":0},{"$f":"$CI82","v":0},{"$f":"$CI83","v":0},{"$f":"$CI84","v":0},{"$f":"$CI85","v":0},{"$f":"$CI86","v":0},{"$f":"$CI87","v":0},{"$f":"$CI88","v":0},{"$f":"IF(ISTEXT(L18),\"\",IF(R40=0,0,IF(L18>0,(($D40*L$9)+($E40*L$10)+($F40*L$11)+($G40*L$12)+($H40*L$13)+($I40*L$14)+($J40*L$16)+($K40*L$17))/R40,\"\")))","v":0},{"$f":"IF(ISTEXT(M18),\"\",IF(S40=0,0,IF(M18>0,(($D40*M$9)+($E40*M$10)+($F40*M$11)+($G40*M$12)+($H40*M$13)+($I40*M$14)+($J40*M$16)+($K40*M$17))/S40,\"\")))","v":0},{"$f":"IF(ISTEXT(N18),\"\",IF(T40=0,0,IF(N18>0,(($D40*N$9)+($E40*N$10)+($F40*N$11)+($G40*N$12)+($H40*N$13)+($I40*N$14)+($J40*N$16)+($K40*N$17))/T40,\"\")))","v":0},null,{"$f":"IF(OR(H3=\"SMA95\",H3=\"SMA125\"),20,\" \")","v":" "},null,{"$f":"IF($D40,L$9)+IF($E40,L$10)+IF($F40,L$11)+IF($G40,L$12)+IF($H40,L$13)+IF($I40,L$14)+IF(J40,L$16)+IF($K40,L$17)","v":0},0,0,null,{"$f":"SUM(V32:V39)","v":0},null,{"$f":"SUM(X32:X39)","v":0},{"$f":"SUM(Y32:Y39)","v":0},null,{"$f":"SUM(AA32:AA39)","v":0},{"$f":"SUM(AB32:AB39)","v":0},null,{"$f":"SUM(AD32:AD39)","v":0},null,null,null,null,null,null,null,null,null,null,null,null,null,null,null,null,null,null,null,null,0,"3 to <10",95,80,60,"-","Min 45","Min 40","Min 45",10,null,null,null,null,null,null,null,null,null,null,null,null,null,null,null,null,"Rap"]
[null,"Flat & Elongated 5:1",null,{"$f":"$CJ81","v":0},{"$f":"$CJ82","v":0},{"$f":"$CJ83","v":0},{"$f":"$CJ84","v":0},{"$f":"$CJ85","v":0},{"$f":"$CJ86","v":0},{"$f":"$CJ87","v":0},{"$f":"$CJ88","v":0},{"$f":"IF(ISTEXT(L18),\"\",IF(L18>0,IF(R41=0,0,(($D41*L$9)+($E41*L$10)+($F41*L$11)+($G41*L$12)+($H41*L$13)+($I41*$L$14)+($J41*L$16)+($K41*L$17))/R41)))","v":false},{"$f":"IF(ISTEXT(M18),\"\",IF(M18>0,IF(S41=0,0,(($D41*M$9)+($E41*M$10)+($F41*M$11)+($G41*M$12)+($H41*M$13)+($I41*M$14)+($J41*M$16)+($K41*M$17))/S41)))","v":false},{"$f":"IF(ISTEXT(N18),\"\",IF(N18>0,IF(T41=0,0,(($D41*N$9)+($E41*N$10)+($F41*N$11)+($G41*N$12)+($H41*N$13)+($I41*N$14)+($J41*N$16)+($K41*N$17))/T41)))","v":false},null,{"$f":"IF(OR(H3=\"SMA95\",H3=\"SMA125\"),5,AR38)","v":{"$error":"#N/A"}},null,{"$f":"IF($D41,L$9)+IF($E41,L$10)+IF($F41,L$11)+IF($G41,L$12)+IF($H41,L$13)+IF($I41,L$14)+IF(J41,L$16)+IF($K41,L$17)","v":0},0,0,null,null,null,{"$f":"V40/X40","v":{"$error":"#DIV/0!"}},null,null,{"$f":"Y40/AA40","v":{"$error":"#DIV/0!"}},null,null,{"$f":"AB40/AD40","v":{"$error":"#DIV/0!"}},null,null,null,null,null,null,null,null,null,null,null,null,null,null,null,null,null,null,null,null,0,"10 to <30",95,90,80,75,"Min 45","Min 40","Min 45",10,null,null,null,null,null,null,null,null,null,null,null,null,null,null,null,null,"Ras"]
[null,"Depth from Surface",null,null,null,null,null,null,null,null,null,null,null,null,"<100mm",">100mm",null,null,null,null,null,"Gsa Blend 1",null,null,"Gsa Blend 2",null,null,"Gsa Blend  3",null,null,null,null,null,null,null,null,null,null,null,null,null,null,null,null,null,null,null,null,null,null,0,"3 to <30",95,90,80,75,"Min 45","Min 40","Min 45",10,null,null,null,null,null,null,null,null,{"$f":"$BQ$6:INDEX($BQ$6:$BQ$36,COUNTIF($BQ$6:$BQ$36,\"?*\"))","v":""},null,null,{"$f":"$BT$6:INDEX($BT$6:$BT$36,COUNTIF($BT$6:$BT$36,\"?*\"))","v":""},null,null,{"$f":"$BW$6:INDEX($BW$6:$BW$36,COUNTIF($BW$6:$BW$36,\"?*\"))","v":""}]
[null,"Uncompacted Voids",null,{"$f":"$CN81","v":0},{"$f":"$CN82","v":0},{"$f":"$CN83","v":0},{"$f":"$CN84","v":0},{"$f":"$CN85","v":0},{"$f":"$CN86","v":0},{"$f":"$CN87","v":0},{"$f":"$CN88","v":0},{"$f":"IF(ISTEXT(L18),\"\",IF(L18>0,(($D43*L$9)+($E43*L$10)+($F43*L$11)+($G43*L$12)+($H43*L$13)+($I43*L$14)+($J43*L$16)+($K43*L$17))/R43,\"\"))","v":""},{"$f":"IF(ISTEXT(M18),\"\",IF(M18>0,(($D43*M$9)+($E43*M$10)+($F43*M$11)+($G43*M$12)+($H43*M$13)+($I43*M$14)+($J43*M$16)+($K43*M$17))/S43,\"\"))","v":""},{"$f":"IF(ISTEXT(N18),\"\",IF(N18>0,(($D43*N$9)+($E43*N$10)+($F43*N$11)+($G43*N$12)+($H43*N$13)+($I43*N$14)+($J43*N$16)+($K43*N$17))/T43,\"\"))","v":""},{"$f":"AS38","v":{"$error":"#N/A"}},{"$f":"AT38","v":{"$error":"#N/A"}},null,{"$f":"IF($D43,L$9)+IF($E43,L$10)+IF($F43,L$11)+IF($G43,L$12)+IF($H43,L$13)+IF($I43,L$14)+IF(J43,L$16)+IF($K43,L$17)","v":0},{"$f":"IF($D43,M$9)+IF($E43,M$10)+IF($F43,M$11)+IF($G43,M$12)+IF($H43,M$13)+IF($I43,M$14)+IF($J43,M$16)+IF($K43,M$17)","v":0},0,null,{"$f":"L9","v":0},{"$f":"D38","v":0},{"$f":"IF(V43=0,0,V43/W43)","v":0},{"$f":"M9","v":0},{"$f":"D38","v":0},{"$f":"IF(Y43=0,0,Y43/Z43)","v":0},{"$f":"N9","v":0},{"$f":"D38","v":0},{"$f":"IF(AB43=0,0,AB43/AC43)","v":0},null,null,null,null,null,null,null,null,null,null,null,null,null,null,null,null,null,null,null,null,0,">30",95,90,95,90,"Min 45","Min 45","Min 50",10]
[null,"CA Angularity (1)",null,{"$f":"$CK81","v":0},{"$f":"$CK82","v":0},{"$f":"$CK83","v":0},{"$f":"$CK84","v":0},{"$f":"$CK85","v":0},{"$f":"$CK86","v":0},{"$f":"$CK87","v":0},{"$f":"$CK88","v":0},{"$f":"IF(ISTEXT(L18),\"\",IF(L18>0,(($D44*L$9)+($E44*L$10)+($F44*L$11)+($G44*L$12)+($H44*L$13)+($I44*L$14)+($J44*L$16)+($K44*L$17))/R44,\"\"))","v":""},{"$f":"IF(ISTEXT(M18),\"\",IF(M18>0,(($D44*M$9)+($E44*M$10)+($F44*M$11)+($G44*M$12)+($H44*M$13)+($I44*M$14)+($J44*M$16)+($K44*M$17))/S44,\"\"))","v":""},{"$f":"IF(ISTEXT(N18),\"\",IF(N18>0,(($D44*N$9)+($E44*N$10)+($F44*N$11)+($G44*N$12)+($H44*N$13)+($I44*N$14)+($J44*N$16)+($K44*N$17))/T44,\"\"))","v":""},{"$f":"AU38","v":{"$error":"#N/A"}},{"$f":"AW38","v":{"$error":"#N/A"}},null,{"$f":"IF($D44,L$9)+IF($E44,L$10)+IF($F44,L$11)+IF($G44,L$12)+IF($H44,L$13)+IF($I44,L$14)+IF(J44,L$16)+IF($K44,L$17)","v":0},0,0,null,0,{"$f":"E38","v":0},0,0,{"$f":"E38","v":0},0,0,{"$f":"E38","v":0},0]
[null,"CA Angularity (2)",null,{"$f":"$CL81","v":0},{"$f":"$CL82","v":0},{"$f":"$CL83","v":0},{"$f":"$CL84","v":0},{"$f":"$CL85","v":0},{"$f":"$CL86","v":0},{"$f":"$CL87","v":0},{"$f":"$CL88","v":0},{"$f":"IF(ISTEXT(L18),\"\",IF(L18>0,(($D45*L$9)+($E45*L$10)+($F45*L$11)+($G45*L$12)+($H45*L$13)+($I45*L$14)+($J45*L$16)+($K45*L$17))/R45,\"\"))","v":""},{"$f":"IF(ISTEXT(M18),\"\",IF(M18>0,(($D45*M$9)+($E45*M$10)+($F45*M$11)+($G45*M$12)+($H45*M$13)+($I45*M$14)+($J45*M$16)+($K45*M$17))/S45,\"\"))","v":""},{"$f":"IF(ISTEXT(N18),\"\",IF(N18>0,(($D45*N$9)+($E45*N$10)+($F45*N$11)+($G45*N$12)+($H45*N$13)+($I45*N$14)+($J45*N$16)+($K45*N$17))/T45,\"\"))","v":""},{"$f":"AV38","v":{"$error":"#N/A"}},{"$f":"AX38","v":{"$error":"#N/A"}},null,{"$f":"IF($D45,L$9)+IF($E45,L$10)+IF($F45,L$11)+IF($G45,L$12)+IF($H45,L$13)+IF($I45,L$14)+IF(J45,L$16)+IF($K45,L$17)","v":0},0,0,null,0,{"$f":"F38","v":0},0,0,{"$f":"F38","v":0},{"$f":"IF(Y45=0,0,Y45/Z45)","v":0},0,{"$f":"F38","v":0},0]
[null,null,null,null,null,null,null,null,null,null,null,null,null,null,null,null,null,null,null,null,null,0,{"$f":"G38","v":0},0,0,{"$f":"G38","v":0},0,0,{"$f":"G38","v":0},0,null,null,null,null,null,null,null,null,null,null,null,null,null,null,null,null,null,null,null,null,null,null,null,null,null,null,null,null,null,null,null,null,null,null,null,null,"Name","Code","Identifier",2,1.5,1,0.75,0.5,0.375,0.25,4,8,16,30,50,100,200,"Gsb","Absorp","Gsa","FL 3:1","FL 5:1","CA 1","CA 2","SE","Uncomp","Rap AC"]
[null,"Asphalt in the trial blends will be",null,null,null,null,null,null,null,null,null,null,null,null,null,null,null,null,null,null,null,0,{"$f":"H38","v":0},0,0,{"$f":"H38","v":0},0,0,{"$f":"H38","v":0},0,null,null,null,null,null,null,null,null,null,null,null,null,null,null,null,null,null,null,null,null,null,null,null,null,null,null,null,null,null,null,null,null,null,null,null,1,{"$f":"Agg!F14","v":0},{"$f":"Agg!F15","v":0},{"$f":"Agg!F16","v":0},100,100,100,100,{"$f":"Agg!H$19","v":0},{"$f":"Agg!H$20","v":0},null,{"$f":"Agg!H$21","v":0},{"$f":"Agg!H$22","v":0},{"$f":"Agg!H$23","v":0},{"$f":"Agg!H$24","v":0},{"$f":"Agg!H$25","v":0},{"$f":"Agg!H$26","v":0},{"$f":"Agg!H$27","v":0},{"$f":"Agg!F$28","v":0},{"$f":"Agg!F$29","v":0},{"$f":"Agg!F$30","v":0},null,null,null,null,{"$f":"Agg!F$31","v":0},{"$f":"Agg!F$32","v":0},0]
[null,null,null,null,null,null,null,null,null,null,null,null,null,null,null,null,null,null,null,null,null,0,{"$f":"I38","v":0},0,0,{"$f":"I38","v":0},0,0,{"$f":"I38","v":0},0,null,null,null,null,null,null,null,null,null,null,null,null,null,null,null,null,null,null,null,null,null,null,null,null,null,null,null,null,null,null,null,null,null,null,null,2,{"$f":"Agg!J14","v":0},{"$f":"Agg!J15","v":0},{"$f":"Agg!J16","v":0},100,100,100,100,{"$f":"Agg!L$19","v":0},{"$f":"Agg!L$20","v":0},null,{"$f":"Agg!L$21","v":0},{"$f":"Agg!L$22","v":0},{"$f":"Agg!L$23","v":0},{"$f":"Agg!L$24","v":0},{"$f":"Agg!L$25","v":0},{"$f":"Agg!L$26","v":0},{"$f":"Agg!L$27","v":0},{"$f":"Agg!J$28","v":0},{"$f":"Agg!J$29","v":0},{"$f":"Agg!J$30","v":0},null,null,null,null,{"$f":"Agg!J$31","v":0},{"$f":"Agg!J$32","v":0},0]
[null,null,null,null,null,null,null,null,null,null,null,null,null,null,null,null,null,null,null,null,null,{"$f":"L16","v":0},{"$f":"J38","v":0},0,{"$f":"M16","v":0},{"$f":"J38","v":0},{"$f":"IF(Y49=0,0,Y49/Z49)","v":0},{"$f":"N16","v":0},{"$f":"J38","v":0},0,null,null,null,null,null,null,null,null,null,null,null,null,null,null,null,null,null,null,null,null,null,null,null,null,null,null,null,null,null,null,null,null,null,null,null,3,{"$f":"Agg!N14","v":0},{"$f":"Agg!N15","v":0},{"$f":"Agg!N16","v":0},100,100,100,100,{"$f":"Agg!P$19","v":0},{"$f":"Agg!P$20","v":0},null,{"$f":"Agg!P$21","v":0},{"$f":"Agg!P$22","v":0},{"$f":"Agg!P$23","v":0},{"$f":"Agg!P$24","v":0},{"$f":"Agg!P$25","v":0},{"$f":"Agg!P$26","v":0},{"$f":"Agg!P$27","v":0},{"$f":"Agg!N$28","v":0},{"$f":"Agg!N$29","v":0},{"$f":"Agg!N$30","v":0},null,null,null,null,{"$f":"Agg!N$31","v":0},{"$f":"Agg!N$32","v":0},0]
[null,null,null,null,null,null,null,null,null,null,null,null,null,null,null,null,null,null,null,null,null,{"$f":"L17","v":0},{"$f":"K38","v":0},0,{"$f":"M17","v":0},{"$f":"K38","v":0},0,{"$f":"N17","v":0},{"$f":"K38","v":0},0,null,null,null,null,null,null,null,null,null,null,null,null,null,null,null,null,null,null,null,null,null,null,null,null,null,null,null,null,null,null,null,null,null,null,null,4,{"$f":"Agg!R14","v":0},{"$f":"Agg!R15","v":0},{"$f":"Agg!R16","v":0},100,100,100,100,{"$f":"Agg!T$19","v":0},{"$f":"Agg!T$20","v":0},null,{"$f":"Agg!T$21","v":0},{"$f":"Agg!T$22","v":0},{"$f":"Agg!T$23","v":0},{"$f":"Agg!T$24","v":0},{"$f":"Agg!T$25","v":0},{"$f":"Agg!T$26","v":0},{"$f":"Agg!T$27","v":0},{"$f":"Agg!R$28","v":0},{"$f":"Agg!R$29","v":0},{"$f":"Agg!R$30","v":0},null,null,null,null,{"$f":"Agg!R$31","v":0},{"$f":"Agg!R$32","v":0},0]
[null,null,null,null,null,null,null,null,null,null,null,null,null,null,null,null,null,null,null,null,null,{"$f":"SUM(V43:V50)","v":0},null,{"$f":"SUM(X43:X50)","v":0},{"$f":"SUM(Y43:Y50)","v":0},null,{"$f":"SUM(AA43:AA50)","v":0},{"$f":"SUM(AB43:AB50)","v":0},null,{"$f":"SUM(AD43:AD50)","v":0},null,null,null,null,null,null,null,null,null,null,null,null,null,null,null,null,null,null,null,null,null,null,null,null,null,null,null,null,null,null,null,null,null,null,null,5,{"$f":"Agg!V14","v":0},{"$f":"Agg!V15","v":0},{"$f":"Agg!V16","v":0},100,100,100,100,{"$f":"Agg!X$19","v":0},{"$f":"Agg!X$20","v":0},null,{"$f":"Agg!X$21","v":0},{"$f":"Agg!X$22","v":0},{"$f":"Agg!X$23","v":0},{"$f":"Agg!X$24","v":0},{"$f":"Agg!X$25","v":0},{"$f":"Agg!X$26","v":0},{"$f":"Agg!X$27","v":0},{"$f":"Agg!V$28","v":0},{"$f":"Agg!V$29","v":0},{"$f":"Agg!V$30","v":0},null,null,null,null,{"$f":"Agg!V$31","v":0},{"$f":"Agg!V$32","v":0},0]
[null,null,null,null,null,null,null,null,null,null,null,null,null,null,null,null,null,null,null,null,null,null,null,{"$f":"V51/X51","v":{"$error":"#DIV/0!"}},null,null,{"$f":"Y51/AA51","v":{"$error":"#DIV/0!"}},null,null,{"$f":"AB51/AD51","v":{"$error":"#DIV/0!"}},null,null,null,null,null,null,null,null,null,null,null,null,null,null,null,null,null,null,null,null,null,null,null,null,null,null,null,null,null,null,null,null,null,null,null,6,{"$f":"Agg!F36","v":0},{"$f":"Agg!F37","v":0},{"$f":"Agg!F38","v":0},100,100,100,100,{"$f":"Agg!H$41","v":0},{"$f":"Agg!H$42","v":0},{"$f":"Agg!H$43","v":0},{"$f":"Agg!H$44","v":0},{"$f":"Agg!H$45","v":0},{"$f":"Agg!H$46","v":0},{"$f":"Agg!H$47","v":0},{"$f":"Agg!H$48","v":0},{"$f":"Agg!H$49","v":0},{"$f":"Agg!H$50","v":0},{"$f":"Agg!F$51","v":0},{"$f":"Agg!F$52","v":0},{"$f":"Agg!F$53","v":" "},{"$f":"Agg!F$54","v":0},{"$f":"Agg!F$55","v":0},{"$f":"Agg!F$56","v":0},{"$f":"Agg!F$57","v":0},null,null,0]
[null,null,null,null,null,null,null,null,null,null,null,null,null,null,null,null,null,null,null,null,null,null,null,null,null,null,null,null,null,null,null,null,null,null,null,null,null,null,null,null,null,null,null,null,null,null,null,null,null,null,null,null,null,null,null,null,null,null,null,null,null,null,null,null,null,7,{"$f":"Agg!J36","v":0},{"$f":"Agg!J37","v":0},{"$f":"Agg!J38","v":0},100,100,100,100,{"$f":"Agg!L$41","v":0},{"$f":"Agg!L$42","v":0},{"$f":"Agg!L$43","v":0},{"$f":"Agg!L$44","v":0},{"$f":"Agg!L$45","v":0},{"$f":"Agg!L$46","v":0},{"$f":"Agg!L$47","v":0},{"$f":"Agg!L$48","v":0},{"$f":"Agg!L$49","v":0},{"$f":"Agg!L$50","v":0},{"$f":"Agg!J$51","v":0},{"$f":"Agg!J$52","v":0},{"$f":"Agg!J$53","v":" "},{"$f":"Agg!J$54","v":0},{"$f":"Agg!J$55","v":0},{"$f":"Agg!J$56","v":0},{"$f":"Agg!J$57","v":0},null,null,0]
[null,null,null,null,null,null,null,null,null,null,null,null,null,null,null,null,null,null,null,null,null,null,null,null,null,null,null,null,null,null,null,null,null,null,null,null,null,null,null,null,null,null,null,null,null,null,null,null,null,null,null,null,null,null,null,null,null,null,null,null,null,null,null,null,null,8,{"$f":"Agg!N36","v":0},{"$f":"Agg!N37","v":0},{"$f":"Agg!N38","v":0},100,100,100,100,{"$f":"Agg!P$41","v":0},{"$f":"Agg!P$42","v":0},{"$f":"Agg!P$43","v":0},{"$f":"Agg!P$44","v":0},{"$f":"Agg!P$45","v":0},{"$f":"Agg!P$46","v":0},{"$f":"Agg!P$47","v":0},{"$f":"Agg!P$48","v":0},{"$f":"Agg!P$49","v":0},{"$f":"Agg!P$50","v":0},{"$f":"Agg!N$51","v":0},{"$f":"Agg!N$52","v":0},{"$f":"Agg!N$53","v":" "},{"$f":"Agg!N$54","v":0},{"$f":"Agg!N$55","v":0},{"$f":"Agg!N$56","v":0},{"$f":"Agg!N$57","v":0},null,null,0]
[null,null,null,null,null,null,null,null,null,null,null,null,null,null,null,null,null,null,null,null,null,null,null,null,null,null,null,null,null,null,null,null,null,null,null,null,null,null,null,null,null,null,null,null,null,null,null,null,null,null,null,null,null,null,null,null,null,null,null,null,null,null,null,null,null,9,{"$f":"Agg!R36","v":0},{"$f":"Agg!R37","v":0},{"$f":"Agg!N38","v":0},100,100,100,100,{"$f":"Agg!T$41","v":0},{"$f":"Agg!T$42","v":0},{"$f":"Agg!T$43","v":0},{"$f":"Agg!T$44","v":0},{"$f":"Agg!T$45","v":0},{"$f":"Agg!T$46","v":0},{"$f":"Agg!T$47","v":0},{"$f":"Agg!T$48","v":0},{"$f":"Agg!T$49","v":0},{"$f":"Agg!T$50","v":0},{"$f":"Agg!R$51","v":0},{"$f":"Agg!R$52","v":0},{"$f":"Agg!R$53","v":" "},{"$f":"Agg!R$54","v":0},{"$f":"Agg!R$55","v":0},{"$f":"Agg!R$56","v":0},{"$f":"Agg!R$57","v":0},null,null,0]
[null,null,null,null,null,null,null,null,null,null,null,null,null,null,null,null,null,null,null,null,null,null,null,null,null,null,null,null,null,null,null,null,null,null,null,null,null,null,null,null,null,null,null,null,null,null,null,null,null,null,null,null,null,null,null,null,null,null,null,null,null,null,null,null,null,10,{"$f":"Agg!V36","v":0},{"$f":"Agg!V37","v":0},{"$f":"Agg!V38","v":0},100,100,100,100,{"$f":"Agg!X$41","v":0},{"$f":"Agg!X$42","v":0},{"$f":"Agg!X$43","v":0},{"$f":"Agg!X$44","v":0},{"$f":"Agg!X$45","v":0},{"$f":"Agg!X$46","v":0},{"$f":"Agg!X$47","v":0},{"$f":"Agg!X$48","v":0},{"$f":"Agg!X$49","v":0},{"$f":"Agg!X$50","v":0},{"$f":"Agg!V$51","v":0},{"$f":"Agg!V$52","v":0},{"$f":"Agg!V$53","v":" "},{"$f":"Agg!V$54","v":0},{"$f":"Agg!V$55","v":0},{"$f":"Agg!V$56","v":0},{"$f":"Agg!V$57","v":0},null,null,0]
[null,null,null,null,null,null,null,null,null,null,null,null,null,null,null,null,null,null,null,null,null,null,null,null,null,null,null,null,null,null,null,null,null,null,null,null,null,null,null,null,null,null,null,null,null,null,null,null,null,null,null,null,null,null,null,null,null,null,null,null,null,null,null,null,null,11,{"$f":"Agg!F$61","v":0},{"$f":"Agg!F$62","v":0},{"$f":"Agg!F$63","v":0},100,100,100,{"$f":"Agg!H$66","v":0},{"$f":"Agg!H$67","v":0},{"$f":"Agg!H$68","v":0},null,{"$f":"Agg!H$69","v":0},{"$f":"Agg!H$70","v":0},{"$f":"Agg!H$71","v":0},{"$f":"Agg!H$72","v":0},{"$f":"Agg!H$73","v":0},{"$f":"Agg!H$74","v":0},{"$f":"Agg!H$75","v":0},{"$f":"Agg!F$76","v":0},{"$f":"Agg!F$77","v":0},{"$f":"Agg!F$78","v":" "},{"$f":"Agg!F$79","v":0},{"$f":"Agg!F$80","v":0},{"$f":"Agg!F$81","v":0},{"$f":"Agg!F$82","v":0},null,null,0]
[null,null,null,null,null,null,null,null,null,null,null,null,null,null,null,null,null,null,null,null,null,null,null,null,null,null,null,null,null,null,null,null,null,null,null,null,null,null,null,null,null,null,null,null,null,null,null,null,null,null,null,null,null,null,null,null,null,null,null,null,null,null,null,null,null,12,{"$f":"Agg!J$61","v":0},{"$f":"Agg!J$62","v":0},{"$f":"Agg!J$63","v":0},100,100,100,{"$f":"Agg!L$66","v":0},{"$f":"Agg!L$67","v":0},{"$f":"Agg!L$68","v":0},null,{"$f":"Agg!L$69","v":0},{"$f":"Agg!L$70","v":0},{"$f":"Agg!L$71","v":0},{"$f":"Agg!L$72","v":0},{"$f":"Agg!L$73","v":0},{"$f":"Agg!L$74","v":0},{"$f":"Agg!L$75","v":0},{"$f":"Agg!J$76","v":0},{"$f":"Agg!J$77","v":0},{"$f":"Agg!J$78","v":" "},{"$f":"Agg!J$79","v":0},{"$f":"Agg!J$80","v":0},{"$f":"Agg!J$81","v":0},{"$f":"Agg!J$82","v":0},null,null,0]
[null,null,null,null,null,null,null,null,null,null,null,null,null,null,null,null,null,null,null,null,null,null,null,null,null,null,null,null,null,null,null,null,null,null,null,null,null,null,null,null,null,null,null,null,null,null,null,null,null,null,null,null,null,null,null,null,null,null,null,null,null,null,null,null,null,13,{"$f":"Agg!N$61","v":0},{"$f":"Agg!N$62","v":0},{"$f":"Agg!N$63","v":0},100,100,100,{"$f":"Agg!P$66","v":0},{"$f":"Agg!P$67","v":0},{"$f":"Agg!P$68","v":0},null,{"$f":"Agg!P$69","v":0},{"$f":"Agg!P$70","v":0},{"$f":"Agg!P$71","v":0},{"$f":"Agg!P$72","v":0},{"$f":"Agg!P$73","v":0},{"$f":"Agg!P$74","v":0},{"$f":"Agg!P$75","v":0},{"$f":"Agg!N$76","v":0},{"$f":"Agg!N$77","v":0},{"$f":"Agg!N$78","v":" "},{"$f":"Agg!N$79","v":0},{"$f":"Agg!N$80","v":0},{"$f":"Agg!N$81","v":0},{"$f":"Agg!N$82","v":0},null,null,0]
[null,null,null,null,null,null,null,null,null,null,null,null,null,null,null,null,null,null,null,null,null,null,null,null,null,null,null,null,null,null,null,null,null,null,null,null,null,null,null,null,null,null,null,null,null,null,null,null,null,null,null,null,null,null,null,null,null,null,null,null,null,null,null,null,null,14,{"$f":"Agg!R$61","v":0},{"$f":"Agg!R$62","v":0},{"$f":"Agg!R$63","v":0},100,100,100,{"$f":"Agg!T$66","v":0},{"$f":"Agg!T$67","v":0},{"$f":"Agg!T$68","v":0},null,{"$f":"Agg!T$69","v":0},{"$f":"Agg!T$70","v":0},{"$f":"Agg!T$71","v":0},{"$f":"Agg!T$72","v":0},{"$f":"Agg!T$73","v":0},{"$f":"Agg!T$74","v":0},{"$f":"Agg!T$75","v":0},{"$f":"Agg!R$76","v":0},{"$f":"Agg!R$77","v":0},{"$f":"Agg!R$78","v":" "},{"$f":"Agg!R$79","v":0},{"$f":"Agg!R$80","v":0},{"$f":"Agg!R$81","v":0},{"$f":"Agg!R$82","v":0},null,null,0]
[null,null,null,null,null,null,null,null,null,null,null,null,null,null,null,null,null,null,null,null,null,null,null,null,null,null,null,null,null,null,null,null,null,null,null,null,null,null,null,null,null,null,null,null,null,null,null,null,null,null,null,null,null,null,null,null,null,null,null,null,null,null,null,null,null,15,{"$f":"Agg!V$61","v":0},{"$f":"Agg!V$62","v":0},{"$f":"Agg!V$63","v":0},100,100,100,{"$f":"Agg!X$66","v":0},{"$f":"Agg!X$67","v":0},{"$f":"Agg!X$68","v":0},null,{"$f":"Agg!X$69","v":0},{"$f":"Agg!X$70","v":0},{"$f":"Agg!X$71","v":0},{"$f":"Agg!X$72","v":0},{"$f":"Agg!X$73","v":0},{"$f":"Agg!X$74","v":0},{"$f":"Agg!X$75","v":0},{"$f":"Agg!V$76","v":0},{"$f":"Agg!V$77","v":0},{"$f":"Agg!V$78","v":" "},{"$f":"Agg!V$79","v":0},{"$f":"Agg!V$80","v":0},{"$f":"Agg!V$81","v":0},{"$f":"Agg!V$82","v":0},null,null,0]
[null,null,null,null,null,null,null,null,null,null,null,null,null,null,null,null,null,null,null,null,null,null,null,null,null,null,null,null,null,null,null,null,null,null,null,null,null,null,null,null,null,null,null,null,null,null,null,null,null,null,null,null,null,null,null,null,null,null,null,null,null,null,null,null,null,16,{"$f":"Agg!F$86","v":0},{"$f":"Agg!F$87","v":0},{"$f":"Agg!F$88","v":0},100,100,{"$f":"Agg!H$91","v":0},{"$f":"Agg!H$92","v":0},{"$f":"Agg!H$93","v":0},{"$f":"Agg!H$94","v":0},null,{"$f":"Agg!H$95","v":0},{"$f":"Agg!H$96","v":0},{"$f":"Agg!H$97","v":0},{"$f":"Agg!H$98","v":0},{"$f":"Agg!H$99","v":0},{"$f":"Agg!H$100","v":0},{"$f":"Agg!H$101","v":0},{"$f":"Agg!F$102","v":0},{"$f":"Agg!F$103","v":0},{"$f":"Agg!F$104","v":" "},{"$f":"Agg!F$105","v":0},{"$f":"Agg!F$106","v":0},{"$f":"Agg!F$107","v":0},{"$f":"Agg!F$108","v":0},null,null,0]
[null,null,null,null,null,null,null,null,null,null,null,null,null,null,null,null,null,null,null,null,null,null,null,null,null,null,null,null,null,null,null,null,null,null,null,null,null,null,null,null,null,null,null,null,null,null,null,null,null,null,null,null,null,null,null,null,null,null,null,null,null,null,null,null,null,17,{"$f":"Agg!J$86","v":0},{"$f":"Agg!J$87","v":0},{"$f":"Agg!J$88","v":0},100,100,{"$f":"Agg!L$91","v":0},{"$f":"Agg!L$92","v":0},{"$f":"Agg!L$93","v":0},{"$f":"Agg!L$94","v":0},null,{"$f":"Agg!L$95","v":0},{"$f":"Agg!L$96","v":0},{"$f":"Agg!L$97","v":0},{"$f":"Agg!L$98","v":0},{"$f":"Agg!L$99","v":0},{"$f":"Agg!L$100","v":0},{"$f":"Agg!L$101","v":0},{"$f":"Agg!J$102","v":0},{"$f":"Agg!J$103","v":0},{"$f":"Agg!J$104","v":" "},{"$f":"Agg!J$105","v":0},{"$f":"Agg!J$106","v":0},{"$f":"Agg!J$107","v":0},{"$f":"Agg!J$108","v":0},null,null,0]
[null,null,null,null,null,null,null,null,null,null,null,null,null,null,null,null,null,null,null,null,null,null,null,null,null,null,null,null,null,null,null,null,null,null,null,null,null,null,null,null,null,null,null,null,null,null,null,null,null,null,null,null,null,null,null,null,null,null,null,null,null,null,null,null,null,18,{"$f":"Agg!N$86","v":0},{"$f":"Agg!N$87","v":0},{"$f":"Agg!N$88","v":0},100,100,{"$f":"Agg!P$91","v":0},{"$f":"Agg!P$92","v":0},{"$f":"Agg!P$93","v":0},{"$f":"Agg!P$94","v":0},null,{"$f":"Agg!P$95","v":0},{"$f":"Agg!P$96","v":0},{"$f":"Agg!P$97","v":0},{"$f":"Agg!P$98","v":0},{"$f":"Agg!P$99","v":0},{"$f":"Agg!P$100","v":0},{"$f":"Agg!P$101","v":0},{"$f":"Agg!N$102","v":0},{"$f":"Agg!N$103","v":0},{"$f":"Agg!N$104","v":" "},{"$f":"Agg!N$105","v":0},{"$f":"Agg!N$106","v":0},{"$f":"Agg!N$107","v":0},{"$f":"Agg!N$108","v":0},null,null,0]
[null,null,null,null,null,null,null,null,null,null,null,null,null,null,null,null,null,null,null,null,null,null,null,null,null,null,null,null,null,null,null,null,null,null,null,null,null,null,null,null,null,null,null,null,null,null,null,null,null,null,null,null,null,null,null,null,null,null,null,null,null,null,null,null,null,19,{"$f":"Agg!R$86","v":0},{"$f":"Agg!R$87","v":0},{"$f":"Agg!R$88","v":0},100,100,{"$f":"Agg!T$91","v":0},{"$f":"Agg!T$92","v":0},{"$f":"Agg!T$93","v":0},{"$f":"Agg!T$94","v":0},null,{"$f":"Agg!T$95","v":0},{"$f":"Agg!T$96","v":0},{"$f":"Agg!T$97","v":0},{"$f":"Agg!T$98","v":0},{"$f":"Agg!T$99","v":0},{"$f":"Agg!T$100","v":0},{"$f":"Agg!T$101","v":0},{"$f":"Agg!R$102","v":0},{"$f":"Agg!R$103","v":0},{"$f":"Agg!R$104","v":" "},{"$f":"Agg!R$105","v":0},{"$f":"Agg!R$106","v":0},{"$f":"Agg!R$107","v":0},{"$f":"Agg!R$108","v":0},null,null,0]
[null,null,null,null,null,null,null,null,null,null,null,null,null,null,null,null,null,null,null,null,null,null,null,null,null,null,null,null,null,null,null,null,null,null,null,null,null,null,null,null,null,null,null,null,null,null,null,null,null,null,null,null,null,null,null,null,null,null,null,null,null,null,null,null,null,20,{"$f":"Agg!V$86","v":0},{"$f":"Agg!V$87","v":0},{"$f":"Agg!V$88","v":0},100,100,{"$f":"Agg!X$91","v":0},{"$f":"Agg!X$92","v":0},{"$f":"Agg!X$93","v":0},{"$f":"Agg!X$94","v":0},null,{"$f":"Agg!X$95","v":0},{"$f":"Agg!X$96","v":0},{"$f":"Agg!X$97","v":0},{"$f":"Agg!X$98","v":0},{"$f":"Agg!X$99","v":0},{"$f":"Agg!X$100","v":0},{"$f":"Agg!X$101","v":0},{"$f":"Agg!V$102","v":0},{"$f":"Agg!V$103","v":0},{"$f":"Agg!V$104","v":" "},{"$f":"Agg!V$105","v":0},{"$f":"Agg!V$106","v":0},{"$f":"Agg!V$107","v":0},{"$f":"Agg!V$108","v":0},null,null,0]
[null,null,null,null,null,null,null,null,null,null,null,null,null,null,null,null,null,null,null,null,null,null,null,null,null,null,null,null,null,null,null,null,null,null,null,null,null,null,null,null,null,null,null,null,null,null,null,null,null,null,null,null,null,null,null,null,null,null,null,null,null,null,null,null,null,21,{"$f":"Agg!F$112","v":0},{"$f":"Agg!F$113","v":0},{"$f":"Agg!F$114","v":0},100,{"$f":"Agg!H$117","v":0},{"$f":"Agg!H$118","v":0},{"$f":"Agg!H$119","v":0},{"$f":"Agg!H$120","v":0},{"$f":"Agg!H$121","v":0},null,{"$f":"Agg!H$122","v":0},{"$f":"Agg!H$123","v":0},{"$f":"Agg!H$124","v":0},{"$f":"Agg!H$125","v":0},{"$f":"Agg!H$126","v":0},{"$f":"Agg!H$127","v":0},{"$f":"Agg!H$128","v":0},{"$f":"Agg!F$129","v":0},{"$f":"Agg!F$130","v":0},{"$f":"Agg!F$131","v":" "},{"$f":"Agg!F$132","v":0},{"$f":"Agg!F$133","v":0},{"$f":"Agg!F$134","v":0},{"$f":"Agg!F$135","v":0},null,null,0]
[null,null,null,null,null,null,null,null,null,null,null,null,null,null,null,null,null,null,null,null,null,null,null,null,null,null,null,null,null,null,null,null,null,null,null,null,null,null,null,null,null,null,null,null,null,null,null,null,null,null,null,null,null,null,null,null,null,null,null,null,null,null,null,null,null,22,{"$f":"Agg!J$112","v":0},{"$f":"Agg!J$113","v":0},{"$f":"Agg!J$114","v":0},100,{"$f":"Agg!L$117","v":0},{"$f":"Agg!L$118","v":0},{"$f":"Agg!L$119","v":0},{"$f":"Agg!L$120","v":0},{"$f":"Agg!L$121","v":0},null,{"$f":"Agg!L$122","v":0},{"$f":"Agg!L$123","v":0},{"$f":"Agg!L$124","v":0},{"$f":"Agg!L$125","v":0},{"$f":"Agg!L$126","v":0},{"$f":"Agg!L$127","v":0},{"$f":"Agg!L$128","v":0},{"$f":"Agg!J$129","v":0},{"$f":"Agg!J$130","v":0},{"$f":"Agg!J$131","v":" "},{"$f":"Agg!J$132","v":0},{"$f":"Agg!J$133","v":0},{"$f":"Agg!J$134","v":0},{"$f":"Agg!J$135","v":0},null,null,0]
[null,null,null,null,null,null,null,null,null,null,null,null,null,null,null,null,null,null,null,null,null,null,null,null,null,null,null,null,null,null,null,null,null,null,null,null,null,null,null,null,null,null,null,null,null,null,null,null,null,null,null,null,null,null,null,null,null,null,null,null,null,null,null,null,null,23,{"$f":"Agg!N$112","v":0},{"$f":"Agg!N$113","v":0},{"$f":"Agg!N$114","v":0},100,{"$f":"Agg!P$117","v":0},{"$f":"Agg!P$118","v":0},{"$f":"Agg!P$119","v":0},{"$f":"Agg!P$120","v":0},{"$f":"Agg!P$121","v":0},null,{"$f":"Agg!P$122","v":0},{"$f":"Agg!P$123","v":0},{"$f":"Agg!P$124","v":0},{"$f":"Agg!P$125","v":0},{"$f":"Agg!P$126","v":0},{"$f":"Agg!P$127","v":0},{"$f":"Agg!P$128","v":0},{"$f":"Agg!N$129","v":0},{"$f":"Agg!N$130","v":0},{"$f":"Agg!N$131","v":" "},{"$f":"Agg!N$132","v":0},{"$f":"Agg!N$133","v":0},{"$f":"Agg!N$134","v":0},{"$f":"Agg!N$135","v":0},null,null,0]
[null,null,null,null,null,null,null,null,null,null,null,null,null,null,null,null,null,null,null,null,null,null,null,null,null,null,null,null,null,null,null,null,null,null,null,null,null,null,null,null,null,null,null,null,null,null,null,null,null,null,null,null,null,null,null,null,null,null,null,null,null,null,null,null,null,24,{"$f":"Agg!R$112","v":0},{"$f":"Agg!R$113","v":0},{"$f":"Agg!R$114","v":0},100,{"$f":"Agg!T$117","v":0},{"$f":"Agg!T$118","v":0},{"$f":"Agg!T$119","v":0},{"$f":"Agg!T$120","v":0},{"$f":"Agg!T$121","v":0},null,{"$f":"Agg!T$122","v":0},{"$f":"Agg!T$123","v":0},{"$f":"Agg!T$124","v":0},{"$f":"Agg!T$125","v":0},{"$f":"Agg!T$126","v":0},{"$f":"Agg!T$127","v":0},{"$f":"Agg!T$128","v":0},{"$f":"Agg!R$129","v":0},{"$f":"Agg!R$130","v":0},{"$f":"Agg!R$131","v":" "},{"$f":"Agg!R$132","v":0},{"$f":"Agg!R$133","v":0},{"$f":"Agg!R$134","v":0},{"$f":"Agg!R$135","v":0},null,null,0]
[null,null,null,null,null,null,null,null,null,null,null,null,null,null,null,null,null,null,null,null,null,null,null,null,null,null,null,null,null,null,null,null,null,null,null,null,null,null,null,null,null,null,null,null,null,null,null,null,null,null,null,null,null,null,null,null,null,null,null,null,null,null,null,null,null,25,{"$f":"Agg!V$112","v":0},{"$f":"Agg!V$113","v":0},{"$f":"Agg!V$114","v":0},100,{"$f":"Agg!X$117","v":0},{"$f":"Agg!X$118","v":0},{"$f":"Agg!X$119","v":0},{"$f":"Agg!X$120","v":0},{"$f":"Agg!X$121","v":0},null,{"$f":"Agg!X$122","v":0},{"$f":"Agg!X$123","v":0},{"$f":"Agg!X$124","v":0},{"$f":"Agg!X$125","v":0},{"$f":"Agg!X$126","v":0},{"$f":"Agg!X$127","v":0},{"$f":"Agg!X$128","v":0},{"$f":"Agg!V$129","v":0},{"$f":"Agg!V$130","v":0},{"$f":"Agg!V$131","v":" "},{"$f":"Agg!V$132","v":0},{"$f":"Agg!V$133","v":0},{"$f":"Agg!V$134","v":0},{"$f":"Agg!V$135","v":0},null,null,0]
[null,null,null,null,null,null,null,null,null,null,null,null,null,null,null,null,null,null,null,null,null,null,null,null,null,null,null,null,null,null,null,null,null,null,null,null,null,null,null,null,null,null,null,null,null,null,null,null,null,null,null,null,null,null,null,null,null,null,null,null,null,null,null,null,null,26,{"$f":"Agg!F$139","v":0},{"$f":"Agg!F$140","v":0},{"$f":"Agg!F$141","v":0},{"$f":"Agg!H$144","v":0},{"$f":"Agg!H$145","v":0},{"$f":"Agg!H$146","v":0},{"$f":"Agg!H$147","v":0},{"$f":"Agg!H$148","v":0},{"$f":"Agg!H$149","v":0},null,{"$f":"Agg!H$150","v":0},{"$f":"Agg!H$151","v":0},{"$f":"Agg!H$152","v":0},{"$f":"Agg!H$153","v":0},{"$f":"Agg!H$154","v":0},{"$f":"Agg!H$155","v":0},{"$f":"Agg!H$156","v":0},{"$f":"Agg!F$157","v":0},{"$f":"Agg!F$158","v":0},{"$f":"Agg!F$159","v":" "},{"$f":"Agg!F$160","v":0},{"$f":"Agg!F$161","v":0},{"$f":"Agg!F$162","v":0},{"$f":"Agg!F$163","v":0},null,null,0]
[null,null,null,null,null,null,null,null,null,null,null,null,null,null,null,null,null,null,null,null,null,null,null,null,null,null,null,null,null,null,null,null,null,null,null,null,null,null,null,null,null,null,null,null,null,null,null,null,null,null,null,null,null,null,null,null,null,null,null,null,null,null,null,null,null,27,{"$f":"Agg!J$139","v":0},{"$f":"Agg!J$140","v":0},{"$f":"Agg!J$141","v":0},{"$f":"Agg!L$144","v":0},{"$f":"Agg!L$145","v":0},{"$f":"Agg!L$146","v":0},{"$f":"Agg!L$147","v":0},{"$f":"Agg!L$148","v":0},{"$f":"Agg!L$149","v":0},null,{"$f":"Agg!L$150","v":0},{"$f":"Agg!L$151","v":0},{"$f":"Agg!L$152","v":0},{"$f":"Agg!L$153","v":0},{"$f":"Agg!L$154","v":0},{"$f":"Agg!L$155","v":0},{"$f":"Agg!L$156","v":0},{"$f":"Agg!J$157","v":0},{"$f":"Agg!J$158","v":0},{"$f":"Agg!J$159","v":" "},{"$f":"Agg!J$160","v":0},{"$f":"Agg!J$161","v":0},{"$f":"Agg!J$162","v":0},{"$f":"Agg!J$163","v":0},null,null,0]
[null,null,null,null,null,null,null,null,null,null,null,null,null,null,null,null,null,null,null,null,null,null,null,null,null,null,null,null,null,null,null,null,null,null,null,null,null,null,null,null,null,null,null,null,null,null,null,null,null,null,null,null,null,null,null,null,null,null,null,null,null,null,null,null,null,28,{"$f":"Agg!N$139","v":0},{"$f":"Agg!N$140","v":0},{"$f":"Agg!N$141","v":0},{"$f":"Agg!P$144","v":0},{"$f":"Agg!P$145","v":0},{"$f":"Agg!P$146","v":0},{"$f":"Agg!P$147","v":0},{"$f":"Agg!P$148","v":0},{"$f":"Agg!P$149","v":0},null,{"$f":"Agg!P$150","v":0},{"$f":"Agg!P$151","v":0},{"$f":"Agg!P$152","v":0},{"$f":"Agg!P$153","v":0},{"$f":"Agg!P$154","v":0},{"$f":"Agg!P$155","v":0},{"$f":"Agg!P$156","v":0},{"$f":"Agg!N$157","v":0},{"$f":"Agg!N$158","v":0},{"$f":"Agg!N$159","v":" "},{"$f":"Agg!N$160","v":0},{"$f":"Agg!N$161","v":0},{"$f":"Agg!N$162","v":0},{"$f":"Agg!N$163","v":0},null,null,0]
[null,null,null,null,null,null,null,null,null,null,null,null,null,null,null,null,null,null,null,null,null,null,null,null,null,null,null,null,null,null,null,null,null,null,null,null,null,null,null,null,null,null,null,null,null,null,null,null,null,null,null,null,null,null,null,null,null,null,null,null,null,null,null,null,null,29,{"$f":"Agg!R$139","v":0},{"$f":"Agg!R$140","v":0},{"$f":"Agg!R$141","v":0},{"$f":"Agg!T$144","v":0},{"$f":"Agg!T$145","v":0},{"$f":"Agg!T$146","v":0},{"$f":"Agg!T$147","v":0},{"$f":"Agg!T$148","v":0},{"$f":"Agg!T$149","v":0},null,{"$f":"Agg!T$150","v":0},{"$f":"Agg!T$151","v":0},{"$f":"Agg!T$152","v":0},{"$f":"Agg!T$153","v":0},{"$f":"Agg!T$154","v":0},{"$f":"Agg!T$155","v":0},{"$f":"Agg!T$156","v":0},{"$f":"Agg!R$157","v":0},{"$f":"Agg!R$158","v":0},{"$f":"Agg!R$159","v":" "},{"$f":"Agg!R$160","v":0},{"$f":"Agg!R$161","v":0},{"$f":"Agg!R$162","v":0},{"$f":"Agg!R$163","v":0},null,null,0]
[null,null,null,null,null,null,null,null,null,null,null,null,null,null,null,null,null,null,null,null,null,null,null,null,null,null,null,null,null,null,null,null,null,null,null,null,null,null,null,null,null,null,null,null,null,null,null,null,null,null,null,null,null,null,null,null,null,null,null,null,null,null,null,null,null,30,{"$f":"Agg!V$139","v":0},{"$f":"Agg!V$140","v":0},{"$f":"Agg!V$141","v":0},{"$f":"Agg!X$144","v":0},{"$f":"Agg!X$145","v":0},{"$f":"Agg!X$146","v":0},{"$f":"Agg!X$147","v":0},{"$f":"Agg!X$148","v":0},{"$f":"Agg!X$149","v":0},null,{"$f":"Agg!X$150","v":0},{"$f":"Agg!X$151","v":0},{"$f":"Agg!X$152","v":0},{"$f":"Agg!X$153","v":0},{"$f":"Agg!X$154","v":0},{"$f":"Agg!X$155","v":0},{"$f":"Agg!X$156","v":0},{"$f":"Agg!V$157","v":0},{"$f":"Agg!V$158","v":0},{"$f":"Agg!V$159","v":" "},{"$f":"Agg!V$160","v":0},{"$f":"Agg!V$161","v":0},{"$f":"Agg!V$162","v":0},{"$f":"Agg!V$163","v":0},null,null,0]
[null,null,null,null,null,null,null,null,null,null,null,null,null,null,null,null,null,null,null,null,null,null,null,null,null,null,null,null,null,null,null,null,null,null,null,null,null,null,null,null,null,null,null,null,null,null,null,null,null,null,null,null,null,null,null,null,null,null,null,null,null,null,null,null,null,31,{"$f":"Rap!I13","v":0},{"$f":"Rap!I14","v":0},{"$f":"Rap!I15","v":0},{"$f":"Rap!N37","v":" "},{"$f":"Rap!N38","v":" "},{"$f":"Rap!N39","v":" "},{"$f":"Rap!N40","v":" "},{"$f":"Rap!N41","v":" "},{"$f":"Rap!N42","v":" "},null,{"$f":"Rap!N43","v":" "},{"$f":"Rap!N44","v":" "},{"$f":"Rap!N45","v":" "},{"$f":"Rap!N46","v":" "},{"$f":"Rap!N47","v":" "},{"$f":"Rap!N48","v":" "},{"$f":"Rap!N49","v":" "},{"$f":"Rap!$AF$31","v":""},{"$f":"Rap!$AF$32","v":0},{"$f":"Rap!$AF$33","v":""},{"$f":"Rap!N30","v":0},{"$f":"Rap!N31","v":0},{"$f":"Rap!N32","v":0},{"$f":"Rap!N33","v":0},{"$f":"Rap!N28","v":0},{"$f":"Rap!N29","v":0},{"$f":"Rap!N50","v":" "}]
[null,null,null,null,null,null,null,null,null,null,null,null,null,null,null,null,null,null,null,null,null,null,null,null,null,null,null,null,null,null,null,null,null,null,null,null,null,null,null,null,null,null,null,null,null,null,null,null,null,null,null,null,null,null,null,null,null,null,null,null,null,null,null,null,null,32,{"$f":"Rap!W13","v":0},{"$f":"Rap!W14","v":0},{"$f":"Rap!W15","v":0},{"$f":"Rap!AB37","v":" "},{"$f":"Rap!AB38","v":" "},{"$f":"Rap!AB39","v":" "},{"$f":"Rap!AB40","v":" "},{"$f":"Rap!AB41","v":" "},{"$f":"Rap!AB42","v":" "},null,{"$f":"Rap!AB43","v":" "},{"$f":"Rap!AB44","v":" "},{"$f":"Rap!AB45","v":" "},{"$f":"Rap!AB46","v":" "},{"$f":"Rap!AB47","v":" "},{"$f":"Rap!AB48","v":" "},{"$f":"Rap!AB49","v":" "},{"$f":"Rap!$AJ$31","v":""},{"$f":"Rap!$AJ$32","v":0},{"$f":"Rap!$AJ33","v":""},{"$f":"Rap!AB30","v":0},{"$f":"Rap!AB31","v":0},{"$f":"Rap!AB32","v":0},{"$f":"Rap!AB33","v":0},{"$f":"Rap!AB28","v":0},{"$f":"Rap!AB29","v":0},{"$f":"Rap!AB50","v":" "}]
[null,null,null,null,null,null,null,null,null,null,null,null,null,null,null,null,null,null,null,null,null,null,null,null,null,null,null,null,null,null,null,null,null,null,null,null,null,null,null,null,null,null,null,null,null,null,null,null,null,null,null,null,null,null,null,null,null,null,null,null,null,null,null,null,null,null,null,null,null,2,1.5,1,0.75,0.5,0.375,0.25,4,8,16,30,50,100,200,"Gsb","Absorp","Gsa","FL 3:1","FL 5:1","CA 1","CA 2","SE","Uncomp","Rap AC"]
[]
[null,null,null,null,null,null,null,null,null,null,null,null,null,null,null,null,null,null,null,null,null,null,null,null,null,null,null,null,null,null,null,null,null,null,null,null,null,null,null,null,null,null,null,null,null,null,null,null,null,null,null,null,null,null,null,null,null,null,null,null,null,null,null,null,null,"Agg 1",{"$f":"C9","v":0},{"$f":"F9","v":0},{"$f":"I9","v":0},{"$f":"INDEX($BR$47:$BR$78,MATCH(1,(BO81=$BO$47:$BO$78)*(BP81=$BP$47:$BP$78)*(BQ81=$BQ$47:$BQ$78),0))","v":100},{"$f":"INDEX($BS$47:$BS$78,MATCH(1,(BO81=$BO$47:$BO$78)*(BP81=$BP$47:$BP$78)*(BQ81=$BQ$47:$BQ$78),0))","v":100},{"$f":"INDEX($BT$47:$BT$78,MATCH(1,(BO81=$BO$47:$BO$78)*(BP81=$BP$47:$BP$78)*(BQ81=$BQ$47:$BQ$78),0))","v":100},{"$f":"INDEX($BU$47:$BU$78,MATCH(1,(BO81=$BO$47:$BO$78)*(BP81=$BP$47:$BP$78)*(BQ81=$BQ$47:$BQ$78),0))","v":100},{"$f":"INDEX($BV$47:$BV$78,MATCH(1,(BO81=$BO$47:$BO$78)*(BP81=$BP$47:$BP$78)*(BQ81=$BQ$47:$BQ$78),0))","v":0},{"$f":"INDEX($BW$47:$BW$78,MATCH(1,(BO81=$BO$47:$BO$78)*(BP81=$BP$47:$BP$78)*(BQ81=$BQ$47:$BQ$78),0))","v":0},{"$f":"INDEX($BX$47:$BX$78,MATCH(1,(BO81=$BO$47:$BO$78)*(BP81=$BP$47:$BP$78)*(BQ81=$BQ$47:$BQ$78),0))","v":0},{"$f":"INDEX($BY$47:$BY$78,MATCH(1,(BO81=$BO$47:$BO$78)*(BP81=$BP$47:$BP$78)*(BQ81=$BQ$47:$BQ$78),0))","v":0},{"$f":"INDEX($BZ$47:$BZ$78,MATCH(1,(BO81=$BO$47:$BO$78)*(BP81=$BP$47:$BP$78)*(BQ81=$BQ$47:$BQ$78),0))","v":0},{"$f":"INDEX($CA$47:$CA$78,MATCH(1,(BO81=$BO$47:$BO$78)*(BP81=$BP$47:$BP$78)*(BQ81=$BQ$47:$BQ$78),0))","v":0},{"$f":"INDEX($CB$47:$CB$78,MATCH(1,(BO81=$BO$47:$BO$78)*(BP81=$BP$47:$BP$78)*(BQ81=$BQ$47:$BQ$78),0))","v":0},{"$f":"INDEX($CC$47:$CC$78,MATCH(1,(BO81=$BO$47:$BO$78)*(BP81=$BP$47:$BP$78)*(BQ81=$BQ$47:$BQ$78),0))","v":0},{"$f":"INDEX($CD$47:$CD$78,MATCH(1,(BO81=$BO$47:$BO$78)*(BP81=$BP$47:$BP$78)*(BQ81=$BQ$47:$BQ$78),0))","v":0},{"$f":"INDEX($CE$47:$CE$78,MATCH(1,(BO81=$BO$47:$BO$78)*(BP81=$BP$47:$BP$78)*(BQ81=$BQ$47:$BQ$78),0))","v":0},{"$f":"INDEX($CF$47:$CF$78,MATCH(1,(BO81=$BO$47:$BO$78)*(BP81=$BP$47:$BP$78)*(BQ81=$BQ$47:$BQ$78),0))","v":0},{"$f":"INDEX($CG$47:$CG$78,MATCH(1,(BO81=$BO$47:$BO$78)*(BP81=$BP$47:$BP$78)*(BQ81=$BQ$47:$BQ$78),0))","v":0},{"$f":"INDEX($CH$47:$CH$78,MATCH(1,(BO81=$BO$47:$BO$78)*(BP81=$BP$47:$BP$78)*(BQ81=$BQ$47:$BQ$78),0))","v":0},{"$f":"INDEX($CI$47:$CI$78,MATCH(1,(BO81=$BO$47:$BO$78)*(BP81=$BP$47:$BP$78)*(BQ81=$BQ$47:$BQ$78),0))","v":0},{"$f":"INDEX($CJ$47:$CJ$78,MATCH(1,(BO81=$BO$47:$BO$78)*(BP81=$BP$47:$BP$78)*(BQ81=$BQ$47:$BQ$78),0))","v":0},{"$f":"INDEX($CK$47:$CK$78,MATCH(1,(BO81=$BO$47:$BO$78)*(BP81=$BP$47:$BP$78)*(BQ81=$BQ$47:$BQ$78),0))","v":0},{"$f":"INDEX($CL$47:$CL$78,MATCH(1,(BO81=$BO$47:$BO$78)*(BP81=$BP$47:$BP$78)*(BQ81=$BQ$47:$BQ$78),0))","v":0},{"$f":"INDEX($CM$47:$CM$78,MATCH(1,(BO81=$BO$47:$BO$78)*(BP81=$BP$47:$BP$78)*(BQ81=$BQ$47:$BQ$78),0))","v":0},{"$f":"INDEX($CN$47:$CN$78,MATCH(1,(BO81=$BO$47:$BO$78)*(BP81=$BP$47:$BP$78)*(BQ81=$BQ$47:$BQ$78),0))","v":0}]
[null,null,null,null,null,null,null,null,null,null,null,null,null,null,null,null,null,null,null,null,null,null,null,null,null,null,null,null,null,null,null,null,null,null,null,null,null,null,null,null,null,null,null,null,null,null,null,null,null,null,null,null,null,null,null,null,null,null,null,null,null,null,null,null,null,"Agg 2",0,0,0,{"$f":"INDEX($BR$47:$BR$78,MATCH(1,(BO82=$BO$47:$BO$78)*(BP82=$BP$47:$BP$78)*(BQ82=$BQ$47:$BQ$78),0))","v":100},{"$f":"INDEX($BS$47:$BS$78,MATCH(1,(BO82=$BO$47:$BO$78)*(BP82=$BP$47:$BP$78)*(BQ82=$BQ$47:$BQ$78),0))","v":100},{"$f":"INDEX($BT$47:$BT$78,MATCH(1,(BO82=$BO$47:$BO$78)*(BP82=$BP$47:$BP$78)*(BQ82=$BQ$47:$BQ$78),0))","v":100},{"$f":"INDEX($BU$47:$BU$78,MATCH(1,(BO82=$BO$47:$BO$78)*(BP82=$BP$47:$BP$78)*(BQ82=$BQ$47:$BQ$78),0))","v":100},{"$f":"INDEX($BV$47:$BV$78,MATCH(1,(BO82=$BO$47:$BO$78)*(BP82=$BP$47:$BP$78)*(BQ82=$BQ$47:$BQ$78),0))","v":0},{"$f":"INDEX($BW$47:$BW$78,MATCH(1,(BO82=$BO$47:$BO$78)*(BP82=$BP$47:$BP$78)*(BQ82=$BQ$47:$BQ$78),0))","v":0},{"$f":"INDEX($BX$47:$BX$78,MATCH(1,(BO82=$BO$47:$BO$78)*(BP82=$BP$47:$BP$78)*(BQ82=$BQ$47:$BQ$78),0))","v":0},{"$f":"INDEX($BY$47:$BY$78,MATCH(1,(BO82=$BO$47:$BO$78)*(BP82=$BP$47:$BP$78)*(BQ82=$BQ$47:$BQ$78),0))","v":0},{"$f":"INDEX($BZ$47:$BZ$78,MATCH(1,(BO82=$BO$47:$BO$78)*(BP82=$BP$47:$BP$78)*(BQ82=$BQ$47:$BQ$78),0))","v":0},{"$f":"INDEX($CA$47:$CA$78,MATCH(1,(BO82=$BO$47:$BO$78)*(BP82=$BP$47:$BP$78)*(BQ82=$BQ$47:$BQ$78),0))","v":0},{"$f":"INDEX($CB$47:$CB$78,MATCH(1,(BO82=$BO$47:$BO$78)*(BP82=$BP$47:$BP$78)*(BQ82=$BQ$47:$BQ$78),0))","v":0},{"$f":"INDEX($CC$47:$CC$78,MATCH(1,(BO82=$BO$47:$BO$78)*(BP82=$BP$47:$BP$78)*(BQ82=$BQ$47:$BQ$78),0))","v":0},{"$f":"INDEX($CD$47:$CD$78,MATCH(1,(BO82=$BO$47:$BO$78)*(BP82=$BP$47:$BP$78)*(BQ82=$BQ$47:$BQ$78),0))","v":0},{"$f":"INDEX($CE$47:$CE$78,MATCH(1,(BO82=$BO$47:$BO$78)*(BP82=$BP$47:$BP$78)*(BQ82=$BQ$47:$BQ$78),0))","v":0},{"$f":"INDEX($CF$47:$CF$78,MATCH(1,(BO82=$BO$47:$BO$78)*(BP82=$BP$47:$BP$78)*(BQ82=$BQ$47:$BQ$78),0))","v":0},{"$f":"INDEX($CG$47:$CG$78,MATCH(1,(BO82=$BO$47:$BO$78)*(BP82=$BP$47:$BP$78)*(BQ82=$BQ$47:$BQ$78),0))","v":0},{"$f":"INDEX($CH$47:$CH$78,MATCH(1,(BO82=$BO$47:$BO$78)*(BP82=$BP$47:$BP$78)*(BQ82=$BQ$47:$BQ$78),0))","v":0},{"$f":"INDEX($CI$47:$CI$78,MATCH(1,(BO82=$BO$47:$BO$78)*(BP82=$BP$47:$BP$78)*(BQ82=$BQ$47:$BQ$78),0))","v":0},{"$f":"INDEX($CJ$47:$CJ$78,MATCH(1,(BO82=$BO$47:$BO$78)*(BP82=$BP$47:$BP$78)*(BQ82=$BQ$47:$BQ$78),0))","v":0},{"$f":"INDEX($CK$47:$CK$78,MATCH(1,(BO82=$BO$47:$BO$78)*(BP82=$BP$47:$BP$78)*(BQ82=$BQ$47:$BQ$78),0))","v":0},{"$f":"INDEX($CL$47:$CL$78,MATCH(1,(BO82=$BO$47:$BO$78)*(BP82=$BP$47:$BP$78)*(BQ82=$BQ$47:$BQ$78),0))","v":0},{"$f":"INDEX($CM$47:$CM$78,MATCH(1,(BO82=$BO$47:$BO$78)*(BP82=$BP$47:$BP$78)*(BQ82=$BQ$47:$BQ$78),0))","v":0},{"$f":"INDEX($CN$47:$CN$78,MATCH(1,(BO82=$BO$47:$BO$78)*(BP82=$BP$47:$BP$78)*(BQ82=$BQ$47:$BQ$78),0))","v":0}]
[null,null,null,null,null,null,null,null,null,null,null,null,null,null,null,null,null,null,null,null,null,null,null,null,null,null,null,null,null,null,null,null,null,null,null,null,null,null,null,null,null,null,null,null,null,null,null,null,null,null,null,null,null,null,null,null,null,null,null,null,null,null,null,null,null,"Agg 3",0,0,0,{"$f":"INDEX($BR$47:$BR$78,MATCH(1,(BO83=$BO$47:$BO$78)*(BP83=$BP$47:$BP$78)*(BQ83=$BQ$47:$BQ$78),0))","v":100},{"$f":"INDEX($BS$47:$BS$78,MATCH(1,(BO83=$BO$47:$BO$78)*(BP83=$BP$47:$BP$78)*(BQ83=$BQ$47:$BQ$78),0))","v":100},{"$f":"INDEX($BT$47:$BT$78,MATCH(1,(BO83=$BO$47:$BO$78)*(BP83=$BP$47:$BP$78)*(BQ83=$BQ$47:$BQ$78),0))","v":100},{"$f":"INDEX($BU$47:$BU$78,MATCH(1,(BO83=$BO$47:$BO$78)*(BP83=$BP$47:$BP$78)*(BQ83=$BQ$47:$BQ$78),0))","v":100},{"$f":"INDEX($BV$47:$BV$78,MATCH(1,(BO83=$BO$47:$BO$78)*(BP83=$BP$47:$BP$78)*(BQ83=$BQ$47:$BQ$78),0))","v":0},{"$f":"INDEX($BW$47:$BW$78,MATCH(1,(BO83=$BO$47:$BO$78)*(BP83=$BP$47:$BP$78)*(BQ83=$BQ$47:$BQ$78),0))","v":0},{"$f":"INDEX($BX$47:$BX$78,MATCH(1,(BO83=$BO$47:$BO$78)*(BP83=$BP$47:$BP$78)*(BQ83=$BQ$47:$BQ$78),0))","v":0},{"$f":"INDEX($BY$47:$BY$78,MATCH(1,(BO83=$BO$47:$BO$78)*(BP83=$BP$47:$BP$78)*(BQ83=$BQ$47:$BQ$78),0))","v":0},{"$f":"INDEX($BZ$47:$BZ$78,MATCH(1,(BO83=$BO$47:$BO$78)*(BP83=$BP$47:$BP$78)*(BQ83=$BQ$47:$BQ$78),0))","v":0},{"$f":"INDEX($CA$47:$CA$78,MATCH(1,(BO83=$BO$47:$BO$78)*(BP83=$BP$47:$BP$78)*(BQ83=$BQ$47:$BQ$78),0))","v":0},{"$f":"INDEX($CB$47:$CB$78,MATCH(1,(BO83=$BO$47:$BO$78)*(BP83=$BP$47:$BP$78)*(BQ83=$BQ$47:$BQ$78),0))","v":0},{"$f":"INDEX($CC$47:$CC$78,MATCH(1,(BO83=$BO$47:$BO$78)*(BP83=$BP$47:$BP$78)*(BQ83=$BQ$47:$BQ$78),0))","v":0},{"$f":"INDEX($CD$47:$CD$78,MATCH(1,(BO83=$BO$47:$BO$78)*(BP83=$BP$47:$BP$78)*(BQ83=$BQ$47:$BQ$78),0))","v":0},{"$f":"INDEX($CE$47:$CE$78,MATCH(1,(BO83=$BO$47:$BO$78)*(BP83=$BP$47:$BP$78)*(BQ83=$BQ$47:$BQ$78),0))","v":0},{"$f":"INDEX($CF$47:$CF$78,MATCH(1,(BO83=$BO$47:$BO$78)*(BP83=$BP$47:$BP$78)*(BQ83=$BQ$47:$BQ$78),0))","v":0},{"$f":"INDEX($CG$47:$CG$78,MATCH(1,(BO83=$BO$47:$BO$78)*(BP83=$BP$47:$BP$78)*(BQ83=$BQ$47:$BQ$78),0))","v":0},{"$f":"INDEX($CH$47:$CH$78,MATCH(1,(BO83=$BO$47:$BO$78)*(BP83=$BP$47:$BP$78)*(BQ83=$BQ$47:$BQ$78),0))","v":0},{"$f":"INDEX($CI$47:$CI$78,MATCH(1,(BO83=$BO$47:$BO$78)*(BP83=$BP$47:$BP$78)*(BQ83=$BQ$47:$BQ$78),0))","v":0},{"$f":"INDEX($CJ$47:$CJ$78,MATCH(1,(BO83=$BO$47:$BO$78)*(BP83=$BP$47:$BP$78)*(BQ83=$BQ$47:$BQ$78),0))","v":0},{"$f":"INDEX($CK$47:$CK$78,MATCH(1,(BO83=$BO$47:$BO$78)*(BP83=$BP$47:$BP$78)*(BQ83=$BQ$47:$BQ$78),0))","v":0},{"$f":"INDEX($CL$47:$CL$78,MATCH(1,(BO83=$BO$47:$BO$78)*(BP83=$BP$47:$BP$78)*(BQ83=$BQ$47:$BQ$78),0))","v":0},{"$f":"INDEX($CM$47:$CM$78,MATCH(1,(BO83=$BO$47:$BO$78)*(BP83=$BP$47:$BP$78)*(BQ83=$BQ$47:$BQ$78),0))","v":0},{"$f":"INDEX($CN$47:$CN$78,MATCH(1,(BO83=$BO$47:$BO$78)*(BP83=$BP$47:$BP$78)*(BQ83=$BQ$47:$BQ$78),0))","v":0}]
[null,null,null,null,null,null,null,null,null,null,null,null,null,null,null,null,null,null,null,null,null,null,null,null,null,null,null,null,null,null,null,null,null,null,null,null,null,null,null,null,null,null,null,null,null,null,null,null,null,null,null,null,null,null,null,null,null,null,null,null,null,null,null,null,null,"Agg 4",0,0,0,{"$f":"INDEX($BR$47:$BR$78,MATCH(1,(BO84=$BO$47:$BO$78)*(BP84=$BP$47:$BP$78)*(BQ84=$BQ$47:$BQ$78),0))","v":100},{"$f":"INDEX($BS$47:$BS$78,MATCH(1,(BO84=$BO$47:$BO$78)*(BP84=$BP$47:$BP$78)*(BQ84=$BQ$47:$BQ$78),0))","v":100},{"$f":"INDEX($BT$47:$BT$78,MATCH(1,(BO84=$BO$47:$BO$78)*(BP84=$BP$47:$BP$78)*(BQ84=$BQ$47:$BQ$78),0))","v":100},{"$f":"INDEX($BU$47:$BU$78,MATCH(1,(BO84=$BO$47:$BO$78)*(BP84=$BP$47:$BP$78)*(BQ84=$BQ$47:$BQ$78),0))","v":100},{"$f":"INDEX($BV$47:$BV$78,MATCH(1,(BO84=$BO$47:$BO$78)*(BP84=$BP$47:$BP$78)*(BQ84=$BQ$47:$BQ$78),0))","v":0},{"$f":"INDEX($BW$47:$BW$78,MATCH(1,(BO84=$BO$47:$BO$78)*(BP84=$BP$47:$BP$78)*(BQ84=$BQ$47:$BQ$78),0))","v":0},{"$f":"INDEX($BX$47:$BX$78,MATCH(1,(BO84=$BO$47:$BO$78)*(BP84=$BP$47:$BP$78)*(BQ84=$BQ$47:$BQ$78),0))","v":0},{"$f":"INDEX($BY$47:$BY$78,MATCH(1,(BO84=$BO$47:$BO$78)*(BP84=$BP$47:$BP$78)*(BQ84=$BQ$47:$BQ$78),0))","v":0},{"$f":"INDEX($BZ$47:$BZ$78,MATCH(1,(BO84=$BO$47:$BO$78)*(BP84=$BP$47:$BP$78)*(BQ84=$BQ$47:$BQ$78),0))","v":0},{"$f":"INDEX($CA$47:$CA$78,MATCH(1,(BO84=$BO$47:$BO$78)*(BP84=$BP$47:$BP$78)*(BQ84=$BQ$47:$BQ$78),0))","v":0},{"$f":"INDEX($CB$47:$CB$78,MATCH(1,(BO84=$BO$47:$BO$78)*(BP84=$BP$47:$BP$78)*(BQ84=$BQ$47:$BQ$78),0))","v":0},{"$f":"INDEX($CC$47:$CC$78,MATCH(1,(BO84=$BO$47:$BO$78)*(BP84=$BP$47:$BP$78)*(BQ84=$BQ$47:$BQ$78),0))","v":0},{"$f":"INDEX($CD$47:$CD$78,MATCH(1,(BO84=$BO$47:$BO$78)*(BP84=$BP$47:$BP$78)*(BQ84=$BQ$47:$BQ$78),0))","v":0},{"$f":"INDEX($CE$47:$CE$78,MATCH(1,(BO84=$BO$47:$BO$78)*(BP84=$BP$47:$BP$78)*(BQ84=$BQ$47:$BQ$78),0))","v":0},{"$f":"INDEX($CF$47:$CF$78,MATCH(1,(BO84=$BO$47:$BO$78)*(BP84=$BP$47:$BP$78)*(BQ84=$BQ$47:$BQ$78),0))","v":0},{"$f":"INDEX($CG$47:$CG$78,MATCH(1,(BO84=$BO$47:$BO$78)*(BP84=$BP$47:$BP$78)*(BQ84=$BQ$47:$BQ$78),0))","v":0},{"$f":"INDEX($CH$47:$CH$78,MATCH(1,(BO84=$BO$47:$BO$78)*(BP84=$BP$47:$BP$78)*(BQ84=$BQ$47:$BQ$78),0))","v":0},{"$f":"INDEX($CI$47:$CI$78,MATCH(1,(BO84=$BO$47:$BO$78)*(BP84=$BP$47:$BP$78)*(BQ84=$BQ$47:$BQ$78),0))","v":0},{"$f":"INDEX($CJ$47:$CJ$78,MATCH(1,(BO84=$BO$47:$BO$78)*(BP84=$BP$47:$BP$78)*(BQ84=$BQ$47:$BQ$78),0))","v":0},{"$f":"INDEX($CK$47:$CK$78,MATCH(1,(BO84=$BO$47:$BO$78)*(BP84=$BP$47:$BP$78)*(BQ84=$BQ$47:$BQ$78),0))","v":0},{"$f":"INDEX($CL$47:$CL$78,MATCH(1,(BO84=$BO$47:$BO$78)*(BP84=$BP$47:$BP$78)*(BQ84=$BQ$47:$BQ$78),0))","v":0},{"$f":"INDEX($CM$47:$CM$78,MATCH(1,(BO84=$BO$47:$BO$78)*(BP84=$BP$47:$BP$78)*(BQ84=$BQ$47:$BQ$78),0))","v":0},{"$f":"INDEX($CN$47:$CN$78,MATCH(1,(BO84=$BO$47:$BO$78)*(BP84=$BP$47:$BP$78)*(BQ84=$BQ$47:$BQ$78),0))","v":0}]
[null,null,null,null,null,null,null,null,null,null,null,null,null,null,null,null,null,null,null,null,null,null,null,null,null,null,null,null,null,null,null,null,null,null,null,null,null,null,null,null,null,null,null,null,null,null,null,null,null,null,null,null,null,null,null,null,null,null,null,null,null,null,null,null,null,"Agg 5",0,0,0,{"$f":"INDEX($BR$47:$BR$78,MATCH(1,(BO85=$BO$47:$BO$78)*(BP85=$BP$47:$BP$78)*(BQ85=$BQ$47:$BQ$78),0))","v":100},{"$f":"INDEX($BS$47:$BS$78,MATCH(1,(BO85=$BO$47:$BO$78)*(BP85=$BP$47:$BP$78)*(BQ85=$BQ$47:$BQ$78),0))","v":100},{"$f":"INDEX($BT$47:$BT$78,MATCH(1,(BO85=$BO$47:$BO$78)*(BP85=$BP$47:$BP$78)*(BQ85=$BQ$47:$BQ$78),0))","v":100},{"$f":"INDEX($BU$47:$BU$78,MATCH(1,(BO85=$BO$47:$BO$78)*(BP85=$BP$47:$BP$78)*(BQ85=$BQ$47:$BQ$78),0))","v":100},{"$f":"INDEX($BV$47:$BV$78,MATCH(1,(BO85=$BO$47:$BO$78)*(BP85=$BP$47:$BP$78)*(BQ85=$BQ$47:$BQ$78),0))","v":0},{"$f":"INDEX($BW$47:$BW$78,MATCH(1,(BO85=$BO$47:$BO$78)*(BP85=$BP$47:$BP$78)*(BQ85=$BQ$47:$BQ$78),0))","v":0},{"$f":"INDEX($BX$47:$BX$78,MATCH(1,(BO85=$BO$47:$BO$78)*(BP85=$BP$47:$BP$78)*(BQ85=$BQ$47:$BQ$78),0))","v":0},{"$f":"INDEX($BY$47:$BY$78,MATCH(1,(BO85=$BO$47:$BO$78)*(BP85=$BP$47:$BP$78)*(BQ85=$BQ$47:$BQ$78),0))","v":0},{"$f":"INDEX($BZ$47:$BZ$78,MATCH(1,(BO85=$BO$47:$BO$78)*(BP85=$BP$47:$BP$78)*(BQ85=$BQ$47:$BQ$78),0))","v":0},{"$f":"INDEX($CA$47:$CA$78,MATCH(1,(BO85=$BO$47:$BO$78)*(BP85=$BP$47:$BP$78)*(BQ85=$BQ$47:$BQ$78),0))","v":0},{"$f":"INDEX($CB$47:$CB$78,MATCH(1,(BO85=$BO$47:$BO$78)*(BP85=$BP$47:$BP$78)*(BQ85=$BQ$47:$BQ$78),0))","v":0},{"$f":"INDEX($CC$47:$CC$78,MATCH(1,(BO85=$BO$47:$BO$78)*(BP85=$BP$47:$BP$78)*(BQ85=$BQ$47:$BQ$78),0))","v":0},{"$f":"INDEX($CD$47:$CD$78,MATCH(1,(BO85=$BO$47:$BO$78)*(BP85=$BP$47:$BP$78)*(BQ85=$BQ$47:$BQ$78),0))","v":0},{"$f":"INDEX($CE$47:$CE$78,MATCH(1,(BO85=$BO$47:$BO$78)*(BP85=$BP$47:$BP$78)*(BQ85=$BQ$47:$BQ$78),0))","v":0},{"$f":"INDEX($CF$47:$CF$78,MATCH(1,(BO85=$BO$47:$BO$78)*(BP85=$BP$47:$BP$78)*(BQ85=$BQ$47:$BQ$78),0))","v":0},{"$f":"INDEX($CG$47:$CG$78,MATCH(1,(BO85=$BO$47:$BO$78)*(BP85=$BP$47:$BP$78)*(BQ85=$BQ$47:$BQ$78),0))","v":0},{"$f":"INDEX($CH$47:$CH$78,MATCH(1,(BO85=$BO$47:$BO$78)*(BP85=$BP$47:$BP$78)*(BQ85=$BQ$47:$BQ$78),0))","v":0},{"$f":"INDEX($CI$47:$CI$78,MATCH(1,(BO85=$BO$47:$BO$78)*(BP85=$BP$47:$BP$78)*(BQ85=$BQ$47:$BQ$78),0))","v":0},{"$f":"INDEX($CJ$47:$CJ$78,MATCH(1,(BO85=$BO$47:$BO$78)*(BP85=$BP$47:$BP$78)*(BQ85=$BQ$47:$BQ$78),0))","v":0},{"$f":"INDEX($CK$47:$CK$78,MATCH(1,(BO85=$BO$47:$BO$78)*(BP85=$BP$47:$BP$78)*(BQ85=$BQ$47:$BQ$78),0))","v":0},{"$f":"INDEX($CL$47:$CL$78,MATCH(1,(BO85=$BO$47:$BO$78)*(BP85=$BP$47:$BP$78)*(BQ85=$BQ$47:$BQ$78),0))","v":0},{"$f":"INDEX($CM$47:$CM$78,MATCH(1,(BO85=$BO$47:$BO$78)*(BP85=$BP$47:$BP$78)*(BQ85=$BQ$47:$BQ$78),0))","v":0},{"$f":"INDEX($CN$47:$CN$78,MATCH(1,(BO85=$BO$47:$BO$78)*(BP85=$BP$47:$BP$78)*(BQ85=$BQ$47:$BQ$78),0))","v":0}]
[null,null,null,null,null,null,null,null,null,null,null,null,null,null,null,null,null,null,null,null,null,null,null,null,null,null,null,null,null,null,null,null,null,null,null,null,null,null,null,null,null,null,null,null,null,null,null,null,null,null,null,null,null,null,null,null,null,null,null,null,null,null,null,null,null,"Agg 6",0,0,0,{"$f":"INDEX($BR$47:$BR$78,MATCH(1,(BO86=$BO$47:$BO$78)*(BP86=$BP$47:$BP$78)*(BQ86=$BQ$47:$BQ$78),0))","v":100},{"$f":"INDEX($BS$47:$BS$78,MATCH(1,(BO86=$BO$47:$BO$78)*(BP86=$BP$47:$BP$78)*(BQ86=$BQ$47:$BQ$78),0))","v":100},{"$f":"INDEX($BT$47:$BT$78,MATCH(1,(BO86=$BO$47:$BO$78)*(BP86=$BP$47:$BP$78)*(BQ86=$BQ$47:$BQ$78),0))","v":100},{"$f":"INDEX($BU$47:$BU$78,MATCH(1,(BO86=$BO$47:$BO$78)*(BP86=$BP$47:$BP$78)*(BQ86=$BQ$47:$BQ$78),0))","v":100},{"$f":"INDEX($BV$47:$BV$78,MATCH(1,(BO86=$BO$47:$BO$78)*(BP86=$BP$47:$BP$78)*(BQ86=$BQ$47:$BQ$78),0))","v":0},{"$f":"INDEX($BW$47:$BW$78,MATCH(1,(BO86=$BO$47:$BO$78)*(BP86=$BP$47:$BP$78)*(BQ86=$BQ$47:$BQ$78),0))","v":0},{"$f":"INDEX($BX$47:$BX$78,MATCH(1,(BO86=$BO$47:$BO$78)*(BP86=$BP$47:$BP$78)*(BQ86=$BQ$47:$BQ$78),0))","v":0},{"$f":"INDEX($BY$47:$BY$78,MATCH(1,(BO86=$BO$47:$BO$78)*(BP86=$BP$47:$BP$78)*(BQ86=$BQ$47:$BQ$78),0))","v":0},{"$f":"INDEX($BZ$47:$BZ$78,MATCH(1,(BO86=$BO$47:$BO$78)*(BP86=$BP$47:$BP$78)*(BQ86=$BQ$47:$BQ$78),0))","v":0},{"$f":"INDEX($CA$47:$CA$78,MATCH(1,(BO86=$BO$47:$BO$78)*(BP86=$BP$47:$BP$78)*(BQ86=$BQ$47:$BQ$78),0))","v":0},{"$f":"INDEX($CB$47:$CB$78,MATCH(1,(BO86=$BO$47:$BO$78)*(BP86=$BP$47:$BP$78)*(BQ86=$BQ$47:$BQ$78),0))","v":0},{"$f":"INDEX($CC$47:$CC$78,MATCH(1,(BO86=$BO$47:$BO$78)*(BP86=$BP$47:$BP$78)*(BQ86=$BQ$47:$BQ$78),0))","v":0},{"$f":"INDEX($CD$47:$CD$78,MATCH(1,(BO86=$BO$47:$BO$78)*(BP86=$BP$47:$BP$78)*(BQ86=$BQ$47:$BQ$78),0))","v":0},{"$f":"INDEX($CE$47:$CE$78,MATCH(1,(BO86=$BO$47:$BO$78)*(BP86=$BP$47:$BP$78)*(BQ86=$BQ$47:$BQ$78),0))","v":0},{"$f":"INDEX($CF$47:$CF$78,MATCH(1,(BO86=$BO$47:$BO$78)*(BP86=$BP$47:$BP$78)*(BQ86=$BQ$47:$BQ$78),0))","v":0},{"$f":"INDEX($CG$47:$CG$78,MATCH(1,(BO86=$BO$47:$BO$78)*(BP86=$BP$47:$BP$78)*(BQ86=$BQ$47:$BQ$78),0))","v":0},{"$f":"INDEX($CH$47:$CH$78,MATCH(1,(BO86=$BO$47:$BO$78)*(BP86=$BP$47:$BP$78)*(BQ86=$BQ$47:$BQ$78),0))","v":0},{"$f":"INDEX($CI$47:$CI$78,MATCH(1,(BO86=$BO$47:$BO$78)*(BP86=$BP$47:$BP$78)*(BQ86=$BQ$47:$BQ$78),0))","v":0},{"$f":"INDEX($CJ$47:$CJ$78,MATCH(1,(BO86=$BO$47:$BO$78)*(BP86=$BP$47:$BP$78)*(BQ86=$BQ$47:$BQ$78),0))","v":0},{"$f":"INDEX($CK$47:$CK$78,MATCH(1,(BO86=$BO$47:$BO$78)*(BP86=$BP$47:$BP$78)*(BQ86=$BQ$47:$BQ$78),0))","v":0},{"$f":"INDEX($CL$47:$CL$78,MATCH(1,(BO86=$BO$47:$BO$78)*(BP86=$BP$47:$BP$78)*(BQ86=$BQ$47:$BQ$78),0))","v":0},{"$f":"INDEX($CM$47:$CM$78,MATCH(1,(BO86=$BO$47:$BO$78)*(BP86=$BP$47:$BP$78)*(BQ86=$BQ$47:$BQ$78),0))","v":0},{"$f":"INDEX($CN$47:$CN$78,MATCH(1,(BO86=$BO$47:$BO$78)*(BP86=$BP$47:$BP$78)*(BQ86=$BQ$47:$BQ$78),0))","v":0},"Rap AC"]
[null,null,null,null,null,null,null,null,null,null,null,null,null,null,null,null,null,null,null,null,null,null,null,null,null,null,null,null,null,null,null,null,null,null,null,null,null,null,null,null,null,null,null,null,null,null,null,null,null,null,null,null,null,null,null,null,null,null,null,null,null,null,null,null,null,"Rec 1",{"$f":"C16","v":0},{"$f":"F16","v":0},{"$f":"I16","v":0},{"$f":"INDEX($BR$47:$BR$78,MATCH(1,(BO87=$BO$47:$BO$78)*(BP87=$BP$47:$BP$78)*(BQ87=$BQ$47:$BQ$78),0))","v":100},{"$f":"INDEX($BS$47:$BS$78,MATCH(1,(BO87=$BO$47:$BO$78)*(BP87=$BP$47:$BP$78)*(BQ87=$BQ$47:$BQ$78),0))","v":100},{"$f":"INDEX($BT$47:$BT$78,MATCH(1,(BO87=$BO$47:$BO$78)*(BP87=$BP$47:$BP$78)*(BQ87=$BQ$47:$BQ$78),0))","v":100},{"$f":"INDEX($BU$47:$BU$78,MATCH(1,(BO87=$BO$47:$BO$78)*(BP87=$BP$47:$BP$78)*(BQ87=$BQ$47:$BQ$78),0))","v":100},{"$f":"INDEX($BV$47:$BV$78,MATCH(1,(BO87=$BO$47:$BO$78)*(BP87=$BP$47:$BP$78)*(BQ87=$BQ$47:$BQ$78),0))","v":0},{"$f":"INDEX($BW$47:$BW$78,MATCH(1,(BO87=$BO$47:$BO$78)*(BP87=$BP$47:$BP$78)*(BQ87=$BQ$47:$BQ$78),0))","v":0},{"$f":"INDEX($BX$47:$BX$78,MATCH(1,(BO87=$BO$47:$BO$78)*(BP87=$BP$47:$BP$78)*(BQ87=$BQ$47:$BQ$78),0))","v":0},{"$f":"INDEX($BY$47:$BY$78,MATCH(1,(BO87=$BO$47:$BO$78)*(BP87=$BP$47:$BP$78)*(BQ87=$BQ$47:$BQ$78),0))","v":0},{"$f":"INDEX($BZ$47:$BZ$78,MATCH(1,(BO87=$BO$47:$BO$78)*(BP87=$BP$47:$BP$78)*(BQ87=$BQ$47:$BQ$78),0))","v":0},{"$f":"INDEX($CA$47:$CA$78,MATCH(1,(BO87=$BO$47:$BO$78)*(BP87=$BP$47:$BP$78)*(BQ87=$BQ$47:$BQ$78),0))","v":0},{"$f":"INDEX($CB$47:$CB$78,MATCH(1,(BO87=$BO$47:$BO$78)*(BP87=$BP$47:$BP$78)*(BQ87=$BQ$47:$BQ$78),0))","v":0},{"$f":"INDEX($CC$47:$CC$78,MATCH(1,(BO87=$BO$47:$BO$78)*(BP87=$BP$47:$BP$78)*(BQ87=$BQ$47:$BQ$78),0))","v":0},{"$f":"INDEX($CD$47:$CD$78,MATCH(1,(BO87=$BO$47:$BO$78)*(BP87=$BP$47:$BP$78)*(BQ87=$BQ$47:$BQ$78),0))","v":0},{"$f":"INDEX($CE$47:$CE$78,MATCH(1,(BO87=$BO$47:$BO$78)*(BP87=$BP$47:$BP$78)*(BQ87=$BQ$47:$BQ$78),0))","v":0},{"$f":"INDEX($CF$47:$CF$78,MATCH(1,(BO87=$BO$47:$BO$78)*(BP87=$BP$47:$BP$78)*(BQ87=$BQ$47:$BQ$78),0))","v":0},{"$f":"INDEX($CG$47:$CG$78,MATCH(1,(BO87=$BO$47:$BO$78)*(BP87=$BP$47:$BP$78)*(BQ87=$BQ$47:$BQ$78),0))","v":0},{"$f":"INDEX($CH$47:$CH$78,MATCH(1,(BO87=$BO$47:$BO$78)*(BP87=$BP$47:$BP$78)*(BQ87=$BQ$47:$BQ$78),0))","v":0},{"$f":"INDEX($CI$47:$CI$78,MATCH(1,(BO87=$BO$47:$BO$78)*(BP87=$BP$47:$BP$78)*(BQ87=$BQ$47:$BQ$78),0))","v":0},{"$f":"INDEX($CJ$47:$CJ$78,MATCH(1,(BO87=$BO$47:$BO$78)*(BP87=$BP$47:$BP$78)*(BQ87=$BQ$47:$BQ$78),0))","v":0},{"$f":"INDEX($CK$47:$CK$78,MATCH(1,(BO87=$BO$47:$BO$78)*(BP87=$BP$47:$BP$78)*(BQ87=$BQ$47:$BQ$78),0))","v":0},{"$f":"INDEX($CL$47:$CL$78,MATCH(1,(BO87=$BO$47:$BO$78)*(BP87=$BP$47:$BP$78)*(BQ87=$BQ$47:$BQ$78),0))","v":0},{"$f":"INDEX($CM$47:$CM$78,MATCH(1,(BO87=$BO$47:$BO$78)*(BP87=$BP$47:$BP$78)*(BQ87=$BQ$47:$BQ$78),0))","v":0},{"$f":"INDEX($CN$47:$CN$78,MATCH(1,(BO87=$BO$47:$BO$78)*(BP87=$BP$47:$BP$78)*(BQ87=$BQ$47:$BQ$78),0))","v":0},{"$f":"IF(ISBLANK(I16),0,INDEX($CO$46:$CO$78,MATCH(1,(BO87=$BO$46:$BO$78)*(BP87=$BP$46:$BP$78)*(BQ87=$BQ$46:$BQ$78),0)))","v":0}]
[null,null,null,null,null,null,null,null,null,null,null,null,null,null,null,null,null,null,null,null,null,null,null,null,null,null,null,null,null,null,null,null,null,null,null,null,null,null,null,null,null,null,null,null,null,null,null,null,null,null,null,null,null,null,null,null,null,null,null,null,null,null,null,null,null,"Rec 2",{"$f":"C17","v":0},{"$f":"F17","v":0},{"$f":"I17","v":0},{"$f":"INDEX($BR$47:$BR$78,MATCH(1,(BO88=$BO$47:$BO$78)*(BP88=$BP$47:$BP$78)*(BQ88=$BQ$47:$BQ$78),0))","v":100},{"$f":"INDEX($BS$47:$BS$78,MATCH(1,(BO88=$BO$47:$BO$78)*(BP88=$BP$47:$BP$78)*(BQ88=$BQ$47:$BQ$78),0))","v":100},{"$f":"INDEX($BT$47:$BT$78,MATCH(1,(BO88=$BO$47:$BO$78)*(BP88=$BP$47:$BP$78)*(BQ88=$BQ$47:$BQ$78),0))","v":100},{"$f":"INDEX($BU$47:$BU$78,MATCH(1,(BO88=$BO$47:$BO$78)*(BP88=$BP$47:$BP$78)*(BQ88=$BQ$47:$BQ$78),0))","v":100},{"$f":"INDEX($BV$47:$BV$78,MATCH(1,(BO88=$BO$47:$BO$78)*(BP88=$BP$47:$BP$78)*(BQ88=$BQ$47:$BQ$78),0))","v":0},{"$f":"INDEX($BW$47:$BW$78,MATCH(1,(BO88=$BO$47:$BO$78)*(BP88=$BP$47:$BP$78)*(BQ88=$BQ$47:$BQ$78),0))","v":0},{"$f":"INDEX($BX$47:$BX$78,MATCH(1,(BO88=$BO$47:$BO$78)*(BP88=$BP$47:$BP$78)*(BQ88=$BQ$47:$BQ$78),0))","v":0},{"$f":"INDEX($BY$47:$BY$78,MATCH(1,(BO88=$BO$47:$BO$78)*(BP88=$BP$47:$BP$78)*(BQ88=$BQ$47:$BQ$78),0))","v":0},{"$f":"INDEX($BZ$47:$BZ$78,MATCH(1,(BO88=$BO$47:$BO$78)*(BP88=$BP$47:$BP$78)*(BQ88=$BQ$47:$BQ$78),0))","v":0},{"$f":"INDEX($CA$47:$CA$78,MATCH(1,(BO88=$BO$47:$BO$78)*(BP88=$BP$47:$BP$78)*(BQ88=$BQ$47:$BQ$78),0))","v":0},{"$f":"INDEX($CB$47:$CB$78,MATCH(1,(BO88=$BO$47:$BO$78)*(BP88=$BP$47:$BP$78)*(BQ88=$BQ$47:$BQ$78),0))","v":0},{"$f":"INDEX($CC$47:$CC$78,MATCH(1,(BO88=$BO$47:$BO$78)*(BP88=$BP$47:$BP$78)*(BQ88=$BQ$47:$BQ$78),0))","v":0},{"$f":"INDEX($CD$47:$CD$78,MATCH(1,(BO88=$BO$47:$BO$78)*(BP88=$BP$47:$BP$78)*(BQ88=$BQ$47:$BQ$78),0))","v":0},{"$f":"INDEX($CE$47:$CE$78,MATCH(1,(BO88=$BO$47:$BO$78)*(BP88=$BP$47:$BP$78)*(BQ88=$BQ$47:$BQ$78),0))","v":0},{"$f":"INDEX($CF$47:$CF$78,MATCH(1,(BO88=$BO$47:$BO$78)*(BP88=$BP$47:$BP$78)*(BQ88=$BQ$47:$BQ$78),0))","v":0},{"$f":"INDEX($CG$47:$CG$78,MATCH(1,(BO88=$BO$47:$BO$78)*(BP88=$BP$47:$BP$78)*(BQ88=$BQ$47:$BQ$78),0))","v":0},{"$f":"INDEX($CH$47:$CH$78,MATCH(1,(BO88=$BO$47:$BO$78)*(BP88=$BP$47:$BP$78)*(BQ88=$BQ$47:$BQ$78),0))","v":0},{"$f":"INDEX($CI$47:$CI$78,MATCH(1,(BO88=$BO$47:$BO$78)*(BP88=$BP$47:$BP$78)*(BQ88=$BQ$47:$BQ$78),0))","v":0},{"$f":"INDEX($CJ$47:$CJ$78,MATCH(1,(BO88=$BO$47:$BO$78)*(BP88=$BP$47:$BP$78)*(BQ88=$BQ$47:$BQ$78),0))","v":0},{"$f":"INDEX($CK$47:$CK$78,MATCH(1,(BO88=$BO$47:$BO$78)*(BP88=$BP$47:$BP$78)*(BQ88=$BQ$47:$BQ$78),0))","v":0},{"$f":"INDEX($CL$47:$CL$78,MATCH(1,(BO88=$BO$47:$BO$78)*(BP88=$BP$47:$BP$78)*(BQ88=$BQ$47:$BQ$78),0))","v":0},{"$f":"INDEX($CM$47:$CM$78,MATCH(1,(BO88=$BO$47:$BO$78)*(BP88=$BP$47:$BP$78)*(BQ88=$BQ$47:$BQ$78),0))","v":0},{"$f":"INDEX($CN$47:$CN$78,MATCH(1,(BO88=$BO$47:$BO$78)*(BP88=$BP$47:$BP$78)*(BQ88=$BQ$47:$BQ$78),0))","v":0},{"$f":"IF(ISBLANK(I17),0,INDEX($CO$46:$CO$78,MATCH(1,(BO88=$BO$46:$BO$78)*(BP88=$BP$46:$BP$78)*(BQ88=$BQ$46:$BQ$78),0)))","v":0}]
[]
[null,null,null,null,null,null,null,null,null,null,null,null,null,null,null,null,null,null,null,null,null,null,null,null,null,null,null,null,null,null,null,null,null,null,null,null,null,null,null,null,null,null,null,null,null,null,null,null,null,null,null,null,null,null,null,null,null,null,null,null,null,null,null,null,null,null,null,null,null,null,null,null,null,null,null,null,null,null,null,null,null,null,null,null,null,null,null,null,null,null,"Sum Recycled AC",null,{"$f":"SUM(CO87:CO88)","v":0}]

{"sheet":".45 Power","index":5,"n_rows":60,"n_cols":57,"rows_kept":60,"cut":false,"hidden":false,"merged":[[59,7,59,8],[57,9,57,10],[58,9,58,10],[59,9,59,10],[57,11,57,12],[58,11,58,12],[59,11,59,12],[58,7,58,8],[59,1,59,2],[57,3,57,4],[58,3,58,4],[59,3,59,4],[57,5,57,6],[58,5,58,6],[59,5,59,6],[58,1,58,2],[0,6,0,7],[1,4,1,5],[2,0,2,2],[17,0,17,1],[57,1,57,2],[57,7,57,8],[56,1,56,12]]}
[{"$f":"Setup!A2","v":"ESB-21"},null,null,null,null,null,null,null,null,null,null,null,null,null,null,null,null,null,null,null,null,null,null,null,null,null,null,{"$f":"Setup!E11","v":0}]
[null,null,null,null,"Control Points",null,"PCS",null,null,null,{"$f":"Setup!E10","v":0}]
["Size",null,null,".45 Power","Minimum","Maximum","Boundary","Boundary","Maximum Density Line",null,null,null,5.8150000000000004,{"$f":"IF($K$2=37.5,100,#N/A)","v":{"$error":"#N/A"}},null,null,"4.75mm",null,null,null,null,null,"9.5 mm",null,null,null,null,null,"12.5 mm",null,null,null,null,null,"19.0 mm",null,null,null,null,null,"25.0 mm",null,null,null,null,null,"37.5 mm",null,null,null,null,null,"6.33mm"]
["50mm","2\"",50,{"$f":"POWER(C4,0.45)","v":5.8148230317277987},{"$f":"IF($K$2=37.5,AU4,\" \")","v":" "},null,null,null,{"$f":"IF($K$2=37.5,AY4,IF($K$2=25,AS4,IF($K$2=19,AM4,IF($K$2=12.5,AG4,IF($K$2=9.5,AA4,IF($K$2=4.75,U4,IF($K$2=6.33,BE4)))))))","v":false},null,null,null,5.109,{"$f":"IF($K$2=25,100,#N/A)","v":{"$error":"#N/A"}},null,"2\"",null,null,null,null,null,"2\"",null,null,null,null,null,"2\"",null,null,null,null,null,"2\"",null,null,null,null,null,"2\"",null,null,null,null,null,"2\"",100,null,null,null,100,"2\""]
["37.5mm","1 1/2\"",37.5,{"$f":"POWER(C5,0.45)","v":5.1087431744234335},{"$f":"IF($K$2=37.5,AU5,IF($K$2=25,AO5,IF($K$2=19,AI5,IF($K$2=12.5,AC5,IF($K$2=9.5,W5,IF($K$2=4.75,Q5,IF($K$2=6.33,BA5)))))))","v":false},{"$f":"IF($K$2=37.5,AV5,IF($K$2=25,AP5,IF($K$2=19,AJ5,IF($K$2=12.5,AD5,IF($K$2=9.5,X5,IF($K$2=4.75,R5,IF($K$2=6.33,BB5)))))))","v":false},null,null,{"$f":"IF($K$2=37.5,AY5,IF($K$2=25,AS5,IF($K$2=19,AM5,IF($K$2=12.5,AG5,IF($K$2=9.5,AA5,IF($K$2=4.75,U5,IF($K$2=6.33,BE5)))))))","v":false},null,null,null,4.2569999999999997,{"$f":"IF($K$2=19,100,#N/A)","v":{"$error":"#N/A"}},null,"1 1/2\"",null,null,null,null,null,"1 1/2\"",null,null,null,null,null,"1 1/2\"",null,null,null,null,null,"1 1/2\"",null,null,null,null,null,"1 1/2\"",100,null,null,null,100,"1 1/2\"",90,100,null,null,null,"1 1/2\""]
["25.0mm","1\"",25,{"$f":"POWER(C6,0.45)","v":4.2566996126039234},{"$f":"IF($K$2=37.5,AU6,IF($K$2=25,AO6,IF($K$2=19,AI6,IF($K$2=12.5,AC6,IF($K$2=9.5,W6,IF($K$2=4.75,Q6,IF($K$2=6.33,BA6)))))))","v":false},{"$f":"IF($K$2=37.5,AV6,IF($K$2=25,AP6,IF($K$2=19,AJ6,IF($K$2=12.5,AD6,IF($K$2=9.5,X6,IF($K$2=4.75,R6,IF($K$2=6.33,BB6)))))))","v":false},null,null,false,null,null,null,3.762,{"$f":"IF($K$2=12.5,100,#N/A)","v":{"$error":"#N/A"}},null,"1\"",null,null,null,null,null,"1\"",null,null,null,null,null,"1\"",null,null,null,null,null,"1\"",100,null,null,null,100,"1\"",90,100,null,null,null,"1\"",null,89,null,null,null,"1\""]
["19.0mm","3/4\"",19,3.7621761023862978,{"$f":"IF($K$2=37.5,AU7,IF($K$2=25,AO7,IF($K$2=19,AI7,IF($K$2=12.5,AC7,IF($K$2=9.5,W7,IF($K$2=4.75,Q7,IF($K$2=6.33,BA7)))))))","v":false},false,null,null,false,null,null,null,3.1160000000000001,{"$f":"IF($K$2=9.5,100,IF($K$2=4.75,100,#N/A))","v":{"$error":"#N/A"}},null,"3/4\"",null,null,null,null,null,"3/4\"",null,null,null,null,null,"3/4\"",100,null,null,null,100,"3/4\"",90,100,null,null,null,"3/4\"",null,89,null,null,null,"3/4\"",null,null,null,null,null,"3/4\""]
["12.5mm","1/2\"",12.5,3.116086507375345,false,false,null,null,false,null,null,null,2.754,{"$f":"IF($K$2=6.33,100,#N/A)","v":{"$error":"#N/A"}},null,"1/2\"",100,null,null,null,100,"1/2\"",100,null,null,null,100,"1/2\"",90,{"$f":"IF($AB$1=\"SMA125\",99,100)","v":100},null,null,null,"1/2\"",null,89,null,null,null,"1/2\"",null,null,null,null,null,"1/2\"",null,null,null,null,null,"1/2\""]
["9.5mm","3/8\"",9.5,2.754074108566122,false,false,47,null,false,null,null,null,2.016,null,null,"3/8\"",95,100,null,null,null,"3/8\"",{"$f":"IF($AB$1=\"SMA95\",75,90)","v":90},{"$f":"IF($AB$1=\"SMA95\",95,100)","v":100},null,null,null,"3/8\"",{"$f":"IF($AB$1=\"SMA125\",70,\" \")","v":" "},{"$f":"IF($AB$1=\"SMA125\",85,89)","v":89},null,null,null,"3/8\"",null,null,null,null,null,"3/8\"",null,null,null,null,null,"3/8\"",null,null,47,null,null,"3/8\"",100,null,null,null,100]
["6.33mm","1/4",6.33,{"$f":"POWER(C10,0.45)","v":2.2942020817699724},false,false,null,null,false,null,null,null,2.294,null,null,"1/4",null,null,null,null,null,"1/4",null,null,null,null,null,"1/4",null,null,null,null,null,"1/4",null,null,null,null,null,"1/4",null,null,null,null,null,"1/4",null,null,null,null,null,"1/4",90,100]
["4.75mm","#4",4.75,2.0161002539629291,false,false,null,null,false,null,null,null,1.472,null,null,"#4",89,100,null,null,null,"#4",{"$f":"IF($AB$1=\"SMA95\",30,\" \")","v":" "},{"$f":"IF($AB$1=\"SMA95\",50,\" \")","v":" "},null,null,null,"#4",{"$f":"IF($AB$1=\"SMA125\",28,\" \")","v":" "},{"$f":"IF($AB$1=\"SMA125\",40,\" \")","v":" "},null,null,null,"#4",null,null,47,null,null,"#4",null,null,40,null,null,"#4",null,null,null,null,null,"#4",0,85]
["2.36mm","#8",2.36,1.4716698795820382,false,false,null,null,false,null,null,null,1.077,null,null,"#8",null,null,null,null,null,"#8",{"$f":"IF($AB$1=\"SMA95\",20,32)","v":32},{"$f":"IF($AB$1=\"SMA95\",30,67)","v":67},47,null,null,"#8",{"$f":"IF($AB$1=\"SMA125\",18,28)","v":28},{"$f":"IF($AB$1=\"SMA125\",30,58)","v":58},39,null,null,"#8",23,49,null,null,null,"#8",19,45,null,null,null,"#8",15,41,null,null,null,"#8",37,55]
["1.18mm","#16",1.18,1.0773254099250416,false,false,null,null,false,null,null,null,0.79500000000000004,null,null,"#16",30,60,null,null,null,"#16",null,null,null,null,null,"#16",null,null,null,null,null,"#16",null,null,null,null,null,"#16",null,null,null,null,null,"#16",null,null,null,null,null,"#16"]
["600µm","#30",0.6,0.79463568224020453,false,false,null,null,false,null,null,null,0.58199999999999996,null,null,"#30",null,null,null,null,null,"#30",null,null,null,null,null,"#30",null,null,null,null,null,"#30",null,null,null,null,null,"#30",null,null,null,null,null,"#30",null,null,null,null,null,"#30"]
["300µm","#50",0.3,0.58170736792793831,false,false,null,null,false,null,null,null,0.42599999999999999,null,null,"#50",null,null,null,null,null,"#50",null,null,null,null,null,"#50",null,null,null,null,null,"#50",null,null,null,null,null,"#50",null,null,null,null,null,"#50",null,null,null,null,null,"#50",8,25]
["150µm","#100",0.15,0.42583471830473674,false,false,null,null,false,null,null,null,0.312,null,null,"#100",null,null,null,null,null,"#100",null,null,null,null,null,"#100",null,null,null,null,null,"#100",null,null,null,null,null,"#100",null,null,null,null,null,"#100",null,null,null,null,null,"#100"]
["75µm","#200",7.4999999999999997E-2,{"$f":"POWER(C17,0.45)","v":0.31172925995349998},false,false,null,null,false,null,null,null,0,0,null,"#200",6,12,null,null,null,"#200",{"$f":"IF($AB$1=\"SMA95\",8,2)","v":2},{"$f":"IF($AB$1=\"SMA95\",11,10)","v":10},null,null,null,"#200",{"$f":"IF($AB$1=\"SMA125\",8,2)","v":2},{"$f":"IF($AB$1=\"SMA125\",11,10)","v":10},null,null,null,"#200",2,8,null,null,null,"#200",1,7,null,null,null,"#200",0,6,null,null,null,"#200",3,10]
["Pan",null,0,0,null,null,null,null,false,null,null,null,null,null,null,null,null,null,null,null,0,null,null,null,null,null,0,null,null,null,null,null,0,null,null,null,null,null,0,null,null,null,null,null,0,null,null,null,null,null,0]
[]
[]
[]
[null,null,null,null,null,null,null,null,null,null,null,null,null,null,null,null,null,null,null,null,null,null,null,"Blend 1","Blend 2","Blend 3"]
[null,null,null,null,null,null,null,null,null,null,null,null,null,null,null,null,null,null,null,null,null,null,1.5,{"$f":"IF(ISBLANK('Agg Blends'!L22),#N/A,'Agg Blends'!L22)","v":{"$error":"#N/A"}},{"$f":"IF(ISBLANK('Agg Blends'!M22),#N/A,'Agg Blends'!M22)","v":{"$error":"#N/A"}},{"$f":"IF(ISBLANK('Agg Blends'!N22),#N/A,'Agg Blends'!N22)","v":{"$error":"#N/A"}}]
[null,null,null,null,null,null,null,null,null,null,null,null,null,null,null,null,null,null,null,null,null,null,1,{"$f":"IF(ISBLANK('Agg Blends'!L23),#N/A,'Agg Blends'!L23)","v":{"$error":"#N/A"}},{"$f":"IF(ISBLANK('Agg Blends'!M23),#N/A,'Agg Blends'!M23)","v":{"$error":"#N/A"}},{"$f":"IF(ISBLANK('Agg Blends'!N23),#N/A,'Agg Blends'!N23)","v":{"$error":"#N/A"}}]
[null,null,null,null,null,null,null,null,null,null,null,null,null,null,null,null,null,null,null,null,null,null,0.75,{"$f":"IF(ISBLANK('Agg Blends'!L24),#N/A,'Agg Blends'!L24)","v":100},{"$f":"IF(ISBLANK('Agg Blends'!M24),#N/A,'Agg Blends'!M24)","v":100},{"$f":"IF(ISBLANK('Agg Blends'!N24),#N/A,'Agg Blends'!N24)","v":100}]
[null,null,null,null,null,null,null,null,null,null,null,null,null,null,null,null,null,null,null,null,null,null,0.5,{"$f":"IF(ISBLANK('Agg Blends'!L25),#N/A,'Agg Blends'!L25)","v":0},{"$f":"IF(ISBLANK('Agg Blends'!M25),#N/A,'Agg Blends'!M25)","v":0},{"$f":"IF(ISBLANK('Agg Blends'!N25),#N/A,'Agg Blends'!N25)","v":0}]
[null,null,null,null,null,null,null,null,null,null,null,null,null,null,null,null,null,null,null,null,null,null,0.375,{"$f":"'Agg Blends'!L26","v":0},{"$f":"'Agg Blends'!M26","v":0},{"$f":"'Agg Blends'!N26","v":0}]
[null,null,null,null,null,null,null,null,null,null,null,null,null,null,null,null,null,null,null,null,null,null,0.25,{"$f":"IF(K2=6.33,'Agg Blends'!L27,#N/A)","v":{"$error":"#N/A"}},{"$f":"IF(L2=6.33,'Agg Blends'!M27,#N/A)","v":{"$error":"#N/A"}},{"$f":"IF(M2=6.33,'Agg Blends'!N27,#N/A)","v":{"$error":"#N/A"}}]
[null,null,null,null,null,null,null,null,null,null,null,null,null,null,null,null,null,null,null,null,null,null,4,{"$f":"'Agg Blends'!L28","v":0},{"$f":"'Agg Blends'!M28","v":0},{"$f":"'Agg Blends'!N28","v":0}]
[null,null,null,null,null,null,null,null,null,null,null,null,null,null,null,null,null,null,null,null,null,null,8,{"$f":"'Agg Blends'!L29","v":0},{"$f":"'Agg Blends'!M29","v":0},{"$f":"'Agg Blends'!N29","v":0}]
[null,null,null,null,null,null,null,null,null,null,null,null,null,null,null,null,null,null,null,null,null,null,16,{"$f":"'Agg Blends'!L30","v":0},{"$f":"'Agg Blends'!M30","v":0},{"$f":"'Agg Blends'!N30","v":0}]
[null,null,null,null,null,null,null,null,null,null,null,null,null,null,null,null,null,null,null,null,null,null,30,{"$f":"'Agg Blends'!L31","v":0},{"$f":"'Agg Blends'!M31","v":0},{"$f":"'Agg Blends'!N31","v":0}]
[null,null,null,null,null,null,null,null,null,null,null,null,null,null,null,null,null,null,null,null,null,null,50,{"$f":"'Agg Blends'!L32","v":0},{"$f":"'Agg Blends'!M32","v":0},{"$f":"'Agg Blends'!N32","v":0}]
[null,null,null,null,null,null,null,null,null,null,null,null,null,null,null,null,null,null,null,null,null,null,100,{"$f":"'Agg Blends'!L33","v":0},{"$f":"'Agg Blends'!M33","v":0},{"$f":"'Agg Blends'!N33","v":0}]
[null,null,null,null,null,null,null,null,null,null,null,null,null,null,null,null,null,null,null,null,null,null,200,{"$f":"'Agg Blends'!L34","v":0},{"$f":"'Agg Blends'!M34","v":0},{"$f":"'Agg Blends'!N34","v":0}]
[]
[]
[]
[]
[]
[]
[]
[]
[]
[]
[]
[]
[]
[]
[]
[]
[]
[]
[]
[]
[]
[null,".45 Power Chart"]
[null,"Producer:",null,{"$f":"Setup!E7","v":0},null,"Material Class:",null,{"$f":"Setup!E11","v":0},null,"JMF",null,{"$f":"Setup!E5","v":0}]
[null,"Designed By:",null,{"$f":"Setup!E9","v":0},null,"Esals:",null,{"$f":"Setup!E13","v":0},null,"SRL:",null,{"$f":"Setup!E12","v":0}]
[null,"Date:",null,{"$f":"Setup!E6","v":"00:00:00"},null,"Rap:",null,{"$f":"Setup!E18","v":0},null,"PG Grade:",null,{"$f":"Setup!E15","v":0}]

{"sheet":"Gmm","index":6,"n_rows":37,"n_cols":22,"rows_kept":37,"cut":false,"hidden":false,"merged":[[3,13,3,16],[36,9,36,16],[0,1,0,2],[2,1,2,22],[3,2,3,4],[3,5,3,8],[3,17,3,19],[3,20,3,21],[4,2,4,4],[4,18,4,19],[4,20,4,21],[5,2,5,4],[5,17,5,19],[5,20,5,21],[4,13,4,15],[5,13,5,15],[7,1,7,22],[8,5,8,10],[8,11,8,16],[8,17,8,22],[9,21,9,22],[10,1,10,4],[10,5,10,6],[10,7,10,8],[10,9,10,10],[10,11,10,12],[10,13,10,14],[10,15,10,16],[10,17,10,18],[10,19,10,20],[10,21,10,22],[9,1,9,4],[9,5,9,6],[9,7,9,8],[9,9,9,10],[9,11,9,12],[9,13,9,14],[9,15,9,16],[9,17,9,18],[9,19,9,20],[11,21,11,22],[12,1,12,4],[12,5,12,6],[12,7,12,8],[12,9,12,10],[12,11,12,12],[12,13,12,14],[12,15,12,16],[12,17,12,18],[12,19,12,20],[12,21,12,22],[11,1,11,4],[11,5,11,6],[11,7,11,8],[11,9,11,10],[11,11,11,12],[11,13,11,14],[11,15,11,16],[11,17,11,18],[11,19,11,20],[13,21,13,22],[14,1,14,4],[14,5,14,6],[14,7,14,8],[14,9,14,10],[14,11,14,12],[14,13,14,14],[14,15,14,16],[14,17,14,18],[14,19,14,20],[14,21,14,22],[13,1,13,4],[13,5,13,6],[13,7,13,8],[13,9,13,10],[13,11,13,12],[13,13,13,14],[13,15,13,16],[13,17,13,18],[13,19,13,20],[15,9,15,10],[15,15,15,16],[15,21,15,22],[17,1,17,22],[18,1,18,4],[18,9,18,10],[18,15,18,16],[18,21,18,22],[19,1,19,4],[19,9,19,10],[19,15,19,16],[19,21,19,22],[20,1,20,4],[20,9,20,10],[20,15,20,16],[20,21,20,22],[21,1,21,4],[21,9,21,10],[21,15,21,16],[21,21,21,22],[22,1,22,4],[22,9,22,10],[22,15,22,16],[22,21,22,22],[27,21,27,22],[28,1,28,4],[28,9,28,10],[28,15,28,16],[28,21,28,22],[30,1,30,22],[24,1,24,22],[25,1,25,4],[25,9,25,10],[25,15,25,16],[25,21,25,22],[26,1,26,4],[26,9,26,10],[26,15,26,16],[26,21,26,22],[34,1,34,4],[34,9,34,10],[34,15,34,16],[34,21,34,22],[4,5,4,8],[3,9,3,12],[4,9,4,12],[5,9,5,12],[5,5,5,8],[31,1,31,4],[31,9,31,10],[31,15,31,16],[31,21,31,22],[32,1,32,4],[32,9,32,10],[32,15,32,16],[32,21,32,22],[33,1,33,4],[33,9,33,10],[33,15,33,16],[33,21,33,22],[27,1,27,4],[27,9,27,10],[27,15,27,16]]}
[null,{"$f":"Setup!A2","v":"ESB-21"}]
[]
[null,"Maximum Specific Gravity anf Effective Asphalt"]
[null,null,"Producer;",null,null,{"$f":"Setup!E7","v":0},null,null,null,"Material Class:",null,null,null,{"$f":"Setup!E11","v":0},null,null,null,"JMF",null,null,{"$f":"Setup!E5","v":0}]
[null,null,"Designed By:",null,null,{"$f":"Setup!E9","v":0},null,null,null,"Esals:",null,null,null,{"$f":"Setup!E13","v":0},null,null,null,null,"SRL:",null,{"$f":"Setup!E12","v":0}]
[null,null,"Date:",null,null,{"$f":"Setup!E6","v":"00:00:00"},null,null,null,"Rap:",null,null,null,{"$f":"Setup!E18","v":0},null,null,null,"PG Grade:",null,null,{"$f":"Setup!E15","v":0}]
[]
[null,"Maximum Specific Gravity (Gmm)"]
[null,null,null,null,null,"Blend 1",null,null,null,null,null,"Blend 2",null,null,null,null,null,"Blend 3"]
[null,"Sample No",null,null,null,1,null,2,null,3,null,1,null,2,null,3,null,1,null,2,null,3]
[null,"Dry Wt. of Sample"]
[null,{"$f":"IF(Setup!$F$20=\"Suspension\",\"Mass of Pyc in Water\",\"Mass of Pyc + Water\")","v":"Mass of Pyc + Water"},null,null,null,{"$f":"IF(F11,Setup!$F$21,\"\")","v":""},null,{"$f":"IF(H11,Setup!$F$21,\"\")","v":""},null,{"$f":"IF(J11,Setup!$F$21,\"\")","v":""},null,{"$f":"IF(L11,Setup!$F$21,\"\")","v":""},null,{"$f":"IF(N11,Setup!$F$21,\"\")","v":""},null,{"$f":"IF(P11,Setup!$F$21,\"\")","v":""},null,{"$f":"IF(R11,Setup!$F$21,\"\")","v":""},null,{"$f":"IF(T11,Setup!$F$21,\"\")","v":""},null,{"$f":"IF(V11,Setup!$F$21,\"\")","v":""}]
[null,{"$f":"IF(Setup!F20=\"Suspension\",\"Mass samp+Pyc in H2O\",\"Mass Pyc + Mix + Water\")","v":"Mass Pyc + Mix + Water"}]
[null,"Vol Voidless Mix",null,null,null,{"$f":"IF(F13,ROUND(F11+F12-F13,1),\" \")","v":" "},null,{"$f":"IF(H13,ROUND(H11+H12-H13,1),\" \")","v":" "},null,{"$f":"IF(J13,ROUND(J11+J12-J13,1),\" \")","v":" "},null,{"$f":"IF(L13,ROUND(L11+L12-L13,1),\" \")","v":" "},null,{"$f":"IF(N13,ROUND(N11+N12-N13,1),\" \")","v":" "},null,{"$f":"IF(P13,ROUND(P11+P12-P13,1),\" \")","v":" "},null,{"$f":"IF(R13,ROUND(R11+R12-R13,1),\" \")","v":" "},null,{"$f":"IF(T13,ROUND(T11+T12-T13,1),\" \")","v":" "},null,{"$f":"IF(V13,ROUND(V11+V12-V13,1),\" \")","v":" "}]
[null,"Max Sp Gr of Mix",null,null,null,{"$f":"IF(F13,ROUND(F11/F14,3),\" \")","v":" "},null,{"$f":"IF(H13,ROUND(H11/H14,3),\" \")","v":" "},null,{"$f":"IF(J13,ROUND(J11/J14,3),\" \")","v":" "},null,{"$f":"IF(L13,ROUND(L11/L14,3),\" \")","v":" "},null,{"$f":"IF(N13,ROUND(N11/N14,3),\" \")","v":" "},null,{"$f":"IF(P13,ROUND(P11/P14,3),\" \")","v":" "},null,{"$f":"IF(R13,ROUND(R11/R14,3),\" \")","v":" "},null,{"$f":"IF(T13,ROUND(T11/T14,3),\" \")","v":" "},null,{"$f":"IF(V13,ROUND(V11/V14,3),\" \")","v":" "}]
[null,null,null,null,null,null,null,null,null,{"$f":"IF(F13,ROUND(AVERAGE(F15:J15),3),\" \")","v":" "},null,null,null,null,null,{"$f":"IF(L13,ROUND(AVERAGE(L15:P15),3),\" \")","v":" "},null,null,null,null,null,{"$f":"IF(R13,ROUND(AVERAGE(R15:V15),3),\" \")","v":" "}]
[]
[null,"Effective Specific Gravity of Aggregate (Gse)"]
[null,"Max Sp Gr of Mix",null,null,null,null,null,null,null,{"$f":"J16","v":" "},null,null,null,null,null,{"$f":"P16","v":" "},null,null,null,null,null,{"$f":"V16","v":" "}]
[null,"% AC in Test Mix",null,null,null,null,null,null,null,{"$f":"IF(F13,'Agg Blends'!L47,\"\")","v":""},null,null,null,null,null,{"$f":"IF(L13,'Agg Blends'!M47,\"\")","v":""},null,null,null,null,null,{"$f":"IF(R13,'Agg Blends'!N47,\"\")","v":""}]
[null,"Gb of Binder",null,null,null,null,null,null,null,{"$f":"IF($F$13,Setup!$E$16,\"\")","v":""},null,null,null,null,null,{"$f":"IF($L$13,Setup!$E$16,\"\")","v":""},null,null,null,null,null,{"$f":"IF($R$13,Setup!$E$16,\"\")","v":""}]
[null,"% of Total Mixture",null,null,null,null,null,null,null,{"$f":"IF(F11,100,\" \")","v":" "},null,null,null,null,null,{"$f":"IF(L11,100,\" \")","v":" "},null,null,null,null,null,{"$f":"IF(R11,100,\" \")","v":" "}]
[null,"Eff. Gravity of Agg",null,null,null,null,null,null,null,{"$f":"IF(F11,(J22-J20)/(J22/J16-J20/J21),\" \")","v":" "},null,null,null,null,null,{"$f":"IF(L11,(P22-P20)/(P22/P16-P20/P21),\" \")","v":" "},null,null,null,null,null,{"$f":"IF(R11,(V22-V20)/(V22/V16-V20/V21),\" \")","v":" "}]
[]
[null,"Asphalt Absorption of Mix (Pba)"]
[null,"Eff. Gravity of Agg",null,null,null,null,null,null,null,{"$f":"J23","v":" "},null,null,null,null,null,{"$f":"P23","v":" "},null,null,null,null,null,{"$f":"V23","v":" "}]
[null,"Bulk Gravity of Agg",null,null,null,null,null,null,null,{"$f":"IF(F13,'Agg Blends'!L36,\"\")","v":""},null,null,null,null,null,{"$f":"IF(L13,'Agg Blends'!M36,\"\")","v":""},null,null,null,null,null,{"$f":"IF(R13,'Agg Blends'!N36,\"\")","v":""}]
[null,"Gb of Binder",null,null,null,null,null,null,null,{"$f":"IF($F$13,Setup!$E$16,\"\")","v":""},null,null,null,null,null,{"$f":"IF($L$13,Setup!$E$16,\"\")","v":""},null,null,null,null,null,{"$f":"IF($R$13,Setup!$E$16,\"\")","v":""}]
[null,"Absorbed Asphalt",null,null,null,null,null,null,null,{"$f":"IF(F11,100*((J26-J27)/(J27*J26))*J28,\" \")","v":" "},null,null,null,null,null,{"$f":"IF(L11,100*((P26-P27)/(P27*P26))*P28,\" \")","v":" "},null,null,null,null,null,{"$f":"IF(R11,100*((V26-V27)/(V27*V26))*V28,\" \")","v":" "}]
[]
[null,"Effective Asphalt Content in mix (Pbe)"]
[null,"Absorber Asphalt",null,null,null,null,null,null,null,{"$f":"J29","v":" "},null,null,null,null,null,{"$f":"P29","v":" "},null,null,null,null,null,{"$f":"V29","v":" "}]
[null,"% AC in Test Mix",null,null,null,null,null,null,null,{"$f":"J20","v":""},null,null,null,null,null,{"$f":"P20","v":""},null,null,null,null,null,{"$f":"V20","v":""}]
[null,"% Agg in Test Mix",null,null,null,null,null,null,null,{"$f":"IF(F11,100-J20,\" \")","v":" "},null,null,null,null,null,{"$f":"IF(L11,100-P20,\" \")","v":" "},null,null,null,null,null,{"$f":"IF(R11,100-V20,\" \")","v":" "}]
[null,"Effective Asphalt",null,null,null,null,null,null,null,{"$f":"IF(F11,ROUND(J33-(J29/100)*J34,1),\" \")","v":" "},null,null,null,null,null,{"$f":"IF(L11,ROUND(P33-(P29/100)*P34,1),\" \")","v":" "},null,null,null,null,null,{"$f":"IF(R11,ROUND(V33-(V29/100)*V34,1),\" \")","v":" "}]
[]
[null,null,null,null,null,null,null,null,null,{"$f":"Setup!$F$20&\" Method of Testing\"","v":" Method of Testing"}]

{"sheet":"Trial Blends","index":7,"n_rows":45,"n_cols":33,"rows_kept":45,"cut":false,"hidden":false,"merged":[[3,15,3,18],[22,9,23,10],[22,11,23,12],[44,0,44,25],[0,1,0,2],[2,1,2,24],[3,2,3,4],[3,5,3,8],[3,19,3,21],[3,22,3,23],[3,9,3,14],[4,2,4,4],[4,20,4,21],[4,22,4,23],[5,2,5,4],[5,5,5,7],[5,19,5,21],[5,22,5,23],[4,5,4,8],[4,9,4,14],[4,15,4,17],[7,15,7,22],[7,23,7,24],[8,21,9,22],[7,11,7,14],[15,9,16,10],[8,23,9,24],[10,1,10,2],[10,3,10,4],[10,13,10,14],[10,15,10,16],[10,17,10,18],[10,19,10,20],[10,21,10,22],[10,23,10,24],[8,1,9,2],[8,3,9,4],[8,13,9,14],[8,15,9,16],[8,17,9,18],[8,19,9,20],[8,5,9,8],[10,5,10,8],[10,9,10,10],[8,9,9,10],[8,11,9,12],[10,11,10,12],[11,21,11,22],[11,23,11,24],[12,19,12,20],[12,21,12,22],[12,23,12,24],[14,15,14,22],[14,23,14,24],[11,1,11,2],[11,3,11,4],[11,13,11,14],[11,15,11,16],[11,17,11,18],[11,19,11,20],[11,9,11,10],[11,11,11,12],[11,5,11,8],[12,5,13,8],[14,11,14,14],[15,21,16,22],[15,23,16,24],[17,1,17,2],[17,3,17,4],[17,13,17,14],[17,15,17,16],[17,17,17,18],[17,19,17,20],[17,21,17,22],[17,23,17,24],[15,1,16,2],[15,3,16,4],[15,13,16,14],[15,15,16,16],[15,17,16,18],[15,19,16,20],[15,5,16,8],[17,5,17,8],[17,9,17,10],[15,11,16,12],[17,11,17,12],[18,21,18,22],[18,23,18,24],[19,19,19,20],[19,21,19,22],[19,23,19,24],[21,15,21,22],[21,23,21,24],[18,1,18,2],[18,3,18,4],[18,13,18,14],[18,15,18,16],[18,17,18,18],[18,19,18,20],[18,5,18,8],[21,11,21,14],[18,9,18,10],[18,11,18,12],[25,1,25,2],[25,3,25,4],[25,13,25,14],[25,15,25,16],[25,17,25,18],[25,19,25,20],[22,21,23,22],[22,23,23,24],[24,1,24,2],[24,3,24,4],[24,13,24,14],[24,15,24,16],[24,17,24,18],[24,19,24,20],[24,21,24,22],[24,23,24,24],[22,1,23,2],[22,3,23,4],[22,13,23,14],[22,15,23,16],[22,17,23,18],[22,5,23,8],[24,5,24,8],[22,19,23,20],[25,21,25,22],[25,23,25,24],[26,19,26,20],[26,21,26,22],[26,23,26,24],[28,6,28,18],[29,13,29,14],[29,15,29,16],[29,17,29,18],[25,5,25,8],[25,9,25,10],[25,11,25,12],[5,9,5,14],[5,15,5,17],[41,13,41,14],[38,13,38,14],[38,15,38,16],[38,17,38,18],[39,13,39,14],[39,15,39,16],[39,17,39,18],[33,13,33,14],[33,15,33,16],[33,17,33,18],[34,13,34,14],[34,15,34,16],[34,17,34,18],[35,13,35,14],[35,15,35,16],[35,17,35,18],[30,13,30,14],[30,15,30,16],[30,17,30,18],[31,13,31,14],[31,15,31,16],[31,17,31,18],[41,6,41,12],[42,6,42,12],[24,9,24,10],[37,13,37,14],[37,15,37,16],[37,17,37,18],[42,13,42,14],[36,13,36,14],[36,15,36,16],[36,17,36,18],[32,13,32,14],[32,15,32,16],[32,17,32,18],[24,11,24,12]]}
[null,{"$f":"Setup!A2","v":"ESB-21"},null,null,null,null,null,null,null,null,null,null,null,null,null,null,null,null,null,null,null,null,null,null,null,null,null,null,null,null,null,null,{"$f":"Setup!F25","v":0}]
[null,null,null,null,null,null,null,null,null,null,null,null,null,null,null,null,null,null,null,null,null,null,null,null,null,null,null,null,null,null,null,null,{"$f":"Setup!F24","v":0}]
[null,"INITIAL TRIAL BLEND RESULTS",null,null,null,null,null,null,null,null,null,null,null,null,null,null,null,null,null,null,null,null,null,null,null,null,null,null,null,null,null,null,1]
[null,null,"Producer;",null,null,{"$f":"Setup!E7","v":0},null,null,null,"Material Class:",null,null,null,null,null,{"$f":"Setup!E11","v":0},null,null,null,"JMF",null,null,{"$f":"Setup!E5","v":0},null,null,null,null,null,null,null,null,null,2]
[null,null,"Designed By:",null,null,{"$f":"Setup!E9","v":0},null,null,null,"Esals:",null,null,null,null,null,{"$f":"Setup!E13","v":0},null,null,null,null,"SRL:",null,{"$f":"Setup!E12","v":0},null,null,null,null,null,null,null,null,null,3]
[null,null,"Date:",null,null,{"$f":"Setup!E6","v":"00:00:00"},null,null,null,"Rap:",null,null,null,null,null,{"$f":"Setup!E18","v":0},null,null,null,"PG Grade:",null,null,{"$f":"Setup!E15","v":0}]
[]
[null,"Blend 1",null,null,null,null,null,null,null,null,null,"Samp Ht.",null,null,null,"Maximum Theoretical Gravity (Gmm) =",null,null,null,null,null,null,null,{"$f":"Gmm!J16","v":" "}]
[null,null,null,"Dry Weight",null,{"$f":"IF(Setup!$F$24=\"Suspension\",\"Mass Spec. in H2O\",\"Mass Pyc + Specimen + Water\")","v":"Mass Pyc + Specimen + Water"},null,null,null,"SSD Weight",null,"Height @ Nini",null,"Height @ Ndes",null,"Gmb",null,"% Gmm",null,"Voids",null,"VMA",null,"VFA"]
[null,null,null,null,null,{"$f":"IF(Setup!I17=\"Suspension\",\"Mass samp+Pyc in H2O\",\"Mass Pyc + Mix + Water\")","v":"Mass Pyc + Mix + Water"}]
[null,"Spec. 1",null,null,null,null,null,null,null,null,null,null,null,null,null,{"$f":"IF($AG$2=\"Suspension\",ROUND(D11/(J11-F11),3),IF($AG$2=\"Volumeter\",ROUND(D11/(J11-(F11-$AG$1)),3),\" \"))","v":" "},null,{"$f":"IF(J11,ROUND(P11/X8*100,1),\"\")","v":""},null,{"$f":"IF(J11,ROUND(100*(1-(P11/$X$8)),1),\"\")","v":""},null,{"$f":"IF(J11,ROUND(100-(P11/'Agg Blends'!L36)*Gmm!J34,1),\"\")","v":""},null,{"$f":"IF(J11,100*(V11-T11)/V11,\"\")","v":""}]
[null,"Spec. 2",null,null,null,null,null,null,null,null,null,null,null,null,null,{"$f":"IF($AG$2=\"Suspension\",ROUND(D12/(J12-F12),3),IF($AG$2=\"Volumeter\",ROUND(D12/(J12-(F12-$AG$1)),3),\" \"))","v":" "},null,{"$f":"IF(J12,ROUND(P12/X8*100,1),\"\")","v":""},null,{"$f":"IF(J12,ROUND(100*(1-(P12/$X$8)),1),\"\")","v":""},null,{"$f":"IF(J12,ROUND(100-(P12/'Agg Blends'!L36)*Gmm!J34,1),\"\")","v":""},null,{"$f":"IF(J12,100*(V12-T12)/V12,\"\")","v":""}]
[null,null,null,null,null,null,null,null,null,null,null,null,null,null,null,null,null,null,null,{"$f":"IF(J11,ROUND(AVERAGE(T11:T12),2),\"\")","v":""},null,{"$f":"IF(J11,ROUND(AVERAGE(V11:V12),2),\"\")","v":""},null,{"$f":"IF(J11,ROUND(AVERAGE(X11:X12),2),\"\")","v":""}]
[]
[null,"Blend 2",null,null,null,null,null,null,null,null,null,"Samp Ht.",null,null,null,"Maximum Theoretical Gravity (Gmm) =",null,null,null,null,null,null,null,{"$f":"Gmm!P16","v":" "}]
[null,null,null,"Dry Weight",null,{"$f":"IF(Setup!$F$24=\"Suspension\",\"Mass Spec. in H2O\",\"Mass Pyc + Specimen + Water\")","v":"Mass Pyc + Specimen + Water"},null,null,null,"SSD Weight",null,"Height @ Nini",null,"Height @ Ndes",null,"Gmb",null,"% Gmm",null,"Voids",null,"VMA",null,"VFA"]
[null,null,null,null,null,{"$f":"IF(Setup!I23=\"Suspension\",\"Mass samp+Pyc in H2O\",\"Mass Pyc + Mix + Water\")","v":"Mass Pyc + Mix + Water"}]
[null,"Spec. 1",null,null,null,null,null,null,null,null,null,null,null,null,null,{"$f":"IF($AG$2=\"Suspension\",ROUND(D18/(J18-F18),3),IF($AG$2=\"Volumeter\",ROUND(D18/(J18-(F18-$AG$1)),3),\" \"))","v":" "},null,{"$f":"IF(J18,ROUND(P18/X15*100,1),\"\")","v":""},null,{"$f":"IF(J18,ROUND(100*(1-(P18/$X$15)),1),\"\")","v":""},null,{"$f":"IF(J18,ROUND(100-(P18/'Agg Blends'!M36)*Gmm!P34,1),\"\")","v":""},null,{"$f":"IF(J18,100*(V18-T18)/V18,\"\")","v":""}]
[null,"Spec. 2",null,null,null,null,null,null,null,null,null,null,null,null,null,{"$f":"IF($AG$2=\"Suspension\",ROUND(D19/(J19-F19),3),IF($AG$2=\"Volumeter\",ROUND(D19/(J19-(F19-$AG$1)),3),\" \"))","v":" "},null,{"$f":"IF(J19,ROUND(P19/X15*100,1),\"\")","v":""},null,{"$f":"IF(J19,ROUND(100*(1-(P19/$X$15)),1),\"\")","v":""},null,{"$f":"IF(J19,ROUND(100-(P19/'Agg Blends'!M36)*Gmm!P34,1),\"\")","v":""},null,{"$f":"IF(J19,100*(V19-T19)/V19,\"\")","v":""}]
[null,null,null,null,null,null,null,null,null,null,null,null,null,null,null,null,null,null,null,{"$f":"IF(J18,ROUND(AVERAGE(T18:T19),2),\"\")","v":""},null,{"$f":"IF(J18,ROUND(AVERAGE(V18:V19),2),\"\")","v":""},null,{"$f":"IF(J18,ROUND(AVERAGE(X18:X19),2),\"\")","v":""}]
[]
[null,"Blend 3",null,null,null,null,null,null,null,null,null,"Samp Ht.",null,null,null,"Maximum Theoretical Gravity (Gmm) =",null,null,null,null,null,null,null,{"$f":"Gmm!V16","v":" "}]
[null,null,null,"Dry Weight",null,{"$f":"IF(Setup!$F$24=\"Suspension\",\"Mass Spec. in H2O\",\"Mass Pyc + Specimen + Water\")","v":"Mass Pyc + Specimen + Water"},null,null,null,"SSD Weight",null,"Height @ Nini",null,"Height @ Ndes",null,"Gmb",null,"% Gmm",null,"Voids",null,"VMA",null,"VFA"]
[null,null,null,null,null,{"$f":"IF(Setup!I30=\"Suspension\",\"Mass samp+Pyc in H2O\",\"Mass Pyc + Mix + Water\")","v":"Mass Pyc + Mix + Water"}]
[null,"Spec. 1",null,null,null,null,null,null,null,null,null,null,null,null,null,{"$f":"IF($AG$2=\"Suspension\",ROUND(D25/(J25-F25),3),IF($AG$2=\"Volumeter\",ROUND(D25/(J25-(F25-$AG$1)),3),\" \"))","v":" "},null,{"$f":"IF(J25,ROUND(P25/X22*100,1),\"\")","v":""},null,{"$f":"IF(J25,ROUND(100*(1-(P25/$X$22)),1),\"\")","v":""},null,{"$f":"IF(J25,ROUND(100-(P25/'Agg Blends'!N36)*Gmm!V34,1),\"\")","v":""},null,{"$f":"IF(J25,100*(V25-T25)/V25,\"\")","v":""}]
[null,"Spec. 2",null,null,null,null,null,null,null,null,null,null,null,null,null,{"$f":"IF($AG$2=\"Suspension\",ROUND(D26/(J26-F26),3),IF($AG$2=\"Volumeter\",ROUND(D26/(J26-(F26-$AG$1)),3),\" \"))","v":" "},null,{"$f":"IF(J26,ROUND(P26/X22*100,1),\"\")","v":""},null,{"$f":"IF(J26,ROUND(100*(1-(P26/$X$22)),1),\"\")","v":""},null,{"$f":"IF(J26,ROUND(100-(P26/'Agg Blends'!N36)*Gmm!V34,1),\"\")","v":""},null,{"$f":"IF(J26,100*(V26-T26)/V26,\"\")","v":""}]
[null,null,null,null,null,null,null,null,null,null,null,null,null,null,null,null,null,null,null,{"$f":"IF(J25,ROUND(AVERAGE(T25:T26),2),\"\")","v":""},null,{"$f":"IF(J25,ROUND(AVERAGE(V25:V26),2),\"\")","v":""},null,{"$f":"IF(J25,ROUND(AVERAGE(X25:X26),2),\"\")","v":""}]
[]
[null,null,null,null,null,null,"Trial Blend Summary"]
[null,null,null,null,null,null,null,null,null,null,null,null,"Blend",1,null,2,null,3]
[null,null,null,null,null,null,null,null,null,null,null,null,"Asphalt Content",{"$f":"IF(D11,'Agg Blends'!L47,\" \")","v":" "},null,{"$f":"IF(D18,'Agg Blends'!M47,\" \")","v":" "},null,{"$f":"IF(D25,'Agg Blends'!N47,\" \")","v":" "}]
[null,null,null,null,null,null,null,null,null,null,null,null,"Max Theo SpGr (Gmm)",{"$f":"X8","v":" "},null,{"$f":"X15","v":" "},null,{"$f":"X22","v":" "}]
[null,null,null,null,null,null,null,null,null,null,null,null,"Gmb",{"$f":"IF(J12,ROUND(AVERAGE(P11:P12),3),\"\")","v":""},null,{"$f":"IF(J19,ROUND(AVERAGE(P18:P19),3),\"\")","v":""},null,{"$f":"IF(J26,ROUND(AVERAGE(P25:P26),3),\"\")","v":""}]
[null,null,null,null,null,null,null,null,null,null,null,null,"%Gmm (Density ) Ndes ",{"$f":"IF(J12,ROUND(AVERAGE(R11:R12),1),\"\")","v":""},null,{"$f":"IF(J19,ROUND(AVERAGE(R18:R19),1),\"\")","v":""},null,{"$f":"IF(J26,ROUND(AVERAGE(R25:R26),1),\"\")","v":""}]
[null,null,null,null,null,null,null,null,null,null,null,null,"Air Voids ",{"$f":"T13","v":""},null,{"$f":"T20","v":""},null,{"$f":"T27","v":""}]
[null,null,null,null,null,null,null,null,null,null,null,null,"VMA ",{"$f":"V13","v":""},null,{"$f":"V20","v":""},null,{"$f":"V27","v":""}]
[null,null,null,null,null,null,null,null,null,null,null,null,"VFA ",{"$f":"X13","v":""},null,{"$f":"X20","v":""},null,{"$f":"X27","v":""}]
[null,null,null,null,null,null,null,null,null,null,null,null,"%Gmm (Density ) Nini",{"$f":"IF(N12,N33*((AVERAGE(N11:O12)/AVERAGE(L11:M12))/X8)*100,\"\")","v":""},null,{"$f":"IF(N19,P33*((AVERAGE(N18:O19)/AVERAGE(L18:M19))/X15)*100,\"\")","v":""},null,{"$f":"IF(N26,R33*((AVERAGE(N25:O26)/AVERAGE(L25:M26))/X22)*100,\"\")","v":""}]
[null,null,null,null,null,null,null,null,null,null,null,null,"Effective Asphalt (Pbe)",{"$f":"Gmm!J35","v":" "},null,{"$f":"Gmm!P35","v":" "},null,{"$f":"Gmm!V35","v":" "}]
[null,null,null,null,null,null,null,null,null,null,null,null,"Dust to Asphalt Ratio",{"$f":"IF(D11,ROUND('Agg Blends'!L34/Gmm!J35,1),\" \")","v":" "},null,{"$f":"IF(D18,ROUND('Agg Blends'!M34/Gmm!P35,1),\" \")","v":" "},null,{"$f":"IF(D25,ROUND('Agg Blends'!N34/Gmm!V35,1),\" \")","v":" "}]
[]
[null,null,null,null,null,null,"Selected Trial Blend"]
[null,null,null,null,null,null,"Estimated Optium AC"]
[]
[{"$f":"Setup!$F$24&\" Method of Testing\"","v":" Method of Testing"}]

{"sheet":"VCA","index":8,"n_rows":30,"n_cols":21,"rows_kept":30,"cut":false,"hidden":false,"merged":[[29,13,29,14],[27,0,27,12],[28,0,28,12],[29,10,29,12],[8,1,11,22],[23,13,23,14],[23,10,23,12],[19,0,19,23],[25,0,25,23],[27,13,27,14],[28,13,28,14],[22,0,22,12],[21,0,21,12],[21,13,21,14],[22,13,22,14],[17,13,17,14],[17,8,17,12],[5,2,5,4],[5,5,5,7],[5,9,5,12],[5,13,5,15],[5,17,5,19],[5,20,5,21],[4,2,4,4],[4,5,4,8],[4,9,4,12],[4,13,4,15],[4,18,4,19],[4,20,4,21],[0,1,0,2],[2,1,2,22],[3,2,3,4],[3,5,3,8],[3,9,3,12],[3,17,3,19],[3,20,3,21],[3,13,3,16]]}
[null,{"$f":"Setup!A2","v":"ESB-21"}]
[]
[null,"Voids in Coarse Aggregate"]
[null,null,"Producer;",null,null,{"$f":"Setup!E7","v":0},null,null,null,"Material Class:",null,null,null,{"$f":"Setup!E11","v":0},null,null,null,"JMF",null,null,{"$f":"Setup!E5","v":0}]
[null,null,"Designed By:",null,null,{"$f":"Setup!E9","v":0},null,null,null,"Esals:",null,null,null,{"$f":"Setup!E13","v":0},null,null,null,null,"SRL:",null,{"$f":"Setup!E12","v":0}]
[null,null,"Date:",null,null,{"$f":"Setup!E6","v":"00:00:00"},null,null,null,"Rap:",null,null,null,{"$f":"Setup!E18","v":0},null,null,null,"PG Grade:",null,null,{"$f":"Setup!E15","v":0}]
[]
[]
[null,"If the mix being designed is an SMA mix, then the voids in the coarse aggregate fraction in the dry rodded condition and voids in the coarse aggregate fraction of the compacted mix needs to be determined in accordance with procedures outlined in AASHTO R46. "]
[]
[]
[]
[]
[null,"VCADRC = Voids in the coarse aggregate fraction in the dry rodded condition"]
[]
[null,"VCAMIX = Voids in the coarse aggregate fraction of the compacted mix"]
[]
[null,null,null,null,null,null,null,null,"Trial Blend selected",null,null,null,null,{"$f":"'Trial Blends'!N42","v":0}]
[]
["Determination of VCADRC"]
[]
["Bulk specific gravity of the coarse aggregate fraction(Gsb)"]
["Unit weight of coarse aggregate fraction in dry rodded condition"]
[null,null,null,null,null,null,null,null,null,null,"VCADRC",null,null,{"$f":"IF(N23,ROUND(((N22*62.4)-N23)/(N22*62.4)*100,1),\"\")","v":""}]
[]
["Determination of VCAMIX"]
[]
["Bulk specific gravity of compacted mixture(Gmb)"]
["Percent of coarse aggregate in mixture"]
[null,null,null,null,null,null,null,null,null,null,"VCAMIX",null,null,{"$f":"IF(N29,ROUND(100-(N28/N22)*N29,1),\"\")","v":""}]

{"sheet":"Design Agg","index":9,"n_rows":41,"n_cols":75,"rows_kept":41,"cut":false,"hidden":false,"merged":[[40,11,40,12],[39,11,39,12],[38,11,38,12],[37,11,37,12],[40,5,40,6],[39,5,39,6],[38,5,38,6],[37,5,37,6],[21,21,21,23],[31,21,31,23],[30,21,30,23],[29,21,29,23],[27,21,27,23],[26,21,26,23],[25,21,25,23],[24,21,24,23],[23,21,23,23],[22,21,22,23],[28,21,28,23],[17,24,17,25],[5,6,5,7],[3,8,3,9],[4,8,4,9],[5,8,5,9],[5,10,5,11],[5,12,5,13],[7,2,8,12],[5,2,5,3],[5,4,5,5],[0,31,0,32],[2,21,2,22],[2,1,2,13],[3,10,3,11],[4,10,4,11],[3,12,3,13],[4,12,4,13],[3,2,3,3],[4,2,4,3],[1,28,1,29],[2,24,2,26],[3,4,3,5],[4,4,4,5],[3,6,3,7],[4,6,4,7],[35,11,35,12],[36,11,36,12],[35,2,35,4],[32,21,32,23],[33,21,33,23],[36,5,36,6]]}
[null,{"$f":"'Trial Blends'!B1:C1","v":"ESB-21"},null,null,null,null,null,null,null,null,null,null,null,null,null,null,null,null,null,null,"Trial Blend Selected",null,{"$f":"'Trial Blends'!$N$42","v":0},null,null,null,null,null,null,null,null,null,null,null,"Nom. Size",null,null,null,null,null,null,null,null,null,null,null,null,null,null,null,null,null,{"$f":"Setup!AD11","v":0}]
[null,null,null,null,null,null,null,null,null,null,null,null,null,null,null,null,null,null,null,null,null,null,null,null,null,null,null,null,"Control Points",null,"PCS",null,null,null,{"$f":"Setup!E10","v":0}]
[null,"Design Aggregate Structure",null,null,null,null,null,null,null,null,null,null,null,null,null,null,null,null,null,null,null,"TB Selected",null,null,"AI2",null,null,".45 Power","Minimum","Maximum","Boundary","Boundary","Maximum Density Line",null,null,null,5.8150000000000004,{"$f":"IF(AI2=37.5,100,#N/A)","v":{"$error":"#N/A"}},null,null,"4.75mm",null,null,null,null,null,"9.5 mm",null,null,null,null,null,"12.5 mm",null,null,null,null,null,"19.0 mm",null,null,null,null,null,"25.0 mm",null,null,null,null,null,"37.5 mm"]
[null,null,"Producer:",null,{"$f":"Setup!E7","v":0},null,"Material Class;",null,{"$f":"Setup!E11","v":0},null,"JMF",null,{"$f":"Setup!E5","v":0},null,null,null,null,null,null,null,null,"2\"",{"$f":"IF(O34,O34,NA())","v":{"$error":"#VALUE!"}},null,"50mm","2\"",50,{"$f":"POWER(AA4,0.45)","v":5.8148230317277987},{"$f":"IF(AI2=37.5,BS4,\" \")","v":" "},null,null,null,{"$f":"IF(AI2=37.5,BW4,IF(AI2=25,BQ4,IF(AI2=19,BK4,IF(AI2=12.5,BE4,IF(AI2=9.5,AY4,IF(AI2=4.75,AS4))))))","v":false},null,null,null,5.109,{"$f":"IF(AI2=25,100,#N/A)","v":{"$error":"#N/A"}},null,"2\"",null,null,null,null,null,"2\"",null,null,null,null,null,"2\"",null,null,null,null,null,"2\"",null,null,null,null,null,"2\"",null,null,null,null,null,"2\"",100,null,null,null,100]
[null,null,"Designed By:",null,{"$f":"Setup!E9","v":"00:00:00"},null,"Esals:",null,{"$f":"Setup!E13","v":0},null,"SRL:",null,{"$f":"Setup!E12","v":0},null,null,null,null,null,null,null,null,"1 1/2\"",{"$f":"IF(N34,N34,NA())","v":{"$error":"#VALUE!"}},null,"37.5mm","1 1/2\"",37.5,{"$f":"POWER(AA5,0.45)","v":5.1087431744234335},{"$f":"IF(AI2=37.5,BS5,IF(AI2=25,BM5,IF(AI2=19,BG5,IF(AI2=12.5,BA5,IF(AI2=9.5,AU5,IF(AI2=4.75,AO5))))))","v":false},{"$f":"IF(AI2=37.5,BT5,IF(AI2=25,BN5,IF(AI2=19,BH5,IF(AI2=12.5,BB5,IF(AI2=9.5,AV5,IF(AI2=4.75,AP5))))))","v":false},null,null,{"$f":"IF(AI2=37.5,BW5,IF(AI2=25,BQ5,IF(AI2=19,BK5,IF(AI2=12.5,BE5,IF(AI2=9.5,AY5,IF(AI2=4.75,AS5))))))","v":false},null,null,null,4.2569999999999997,{"$f":"IF(AI2=19,100,#N/A)","v":{"$error":"#N/A"}},null,"1 1/2\"",null,null,null,null,null,"1 1/2\"",null,null,null,null,null,"1 1/2\"",null,null,null,null,null,"1 1/2\"",null,null,null,null,null,"1 1/2\"",100,null,null,null,100,"1 1/2\"",90,100]
[null,null,"Date:",null,{"$f":"Setup!E6","v":"00:00:00"},null,"Rap:",null,{"$f":"Setup!E18","v":0},null,"PG Grade:",null,{"$f":"Setup!E15","v":0},null,null,null,null,null,null,null,null,"1\"",{"$f":"IF(M34,M34,NA())","v":{"$error":"#VALUE!"}},null,"25.0mm","1\"",25,{"$f":"POWER(AA6,0.45)","v":4.2566996126039234},{"$f":"IF(AI2=37.5,BS6,IF(AI2=25,BM6,IF(AI2=19,BG6,IF(AI2=12.5,BA6,IF(AI2=9.5,AU6,IF(AI2=4.75,AO6))))))","v":false},{"$f":"IF(AI2=37.5,BT6,IF(AI2=25,BN6,IF(AI2=19,BH6,IF(AI2=12.5,BB6,IF(AI2=9.5,AV6,IF(AI2=4.75,AP6))))))","v":false},null,null,{"$f":"IF(AI2=37.5,BW6,IF(AI2=25,BQ6,IF(AI2=19,BK6,IF(AI2=12.5,BE6,IF(AI2=9.5,AY6,IF(AI2=4.75,AS6))))))","v":false},null,null,null,3.762,{"$f":"IF(AI2=12.5,100,#N/A)","v":{"$error":"#N/A"}},null,"1\"",null,null,null,null,null,"1\"",null,null,null,null,null,"1\"",null,null,null,null,null,"1\"",100,null,null,null,100,"1\"",90,100,null,null,null,"1\"",null,89]
[null,null,null,null,null,null,null,null,null,null,null,null,null,null,null,null,null,null,null,null,null,"3/4\"",{"$f":"IF(L34,L34,NA())","v":{"$error":"#VALUE!"}},null,"19.0mm","3/4\"",19,3.7621761023862978,{"$f":"IF(AI2=37.5,BS7,IF(AI2=25,BM7,IF(AI2=19,BG7,IF(AI2=12.5,BA7,IF(AI2=9.5,AU7,IF(AI2=4.75,AO7))))))","v":false},{"$f":"IF(AI2=37.5,BT7,IF(AI2=25,BN7,IF(AI2=19,BH7,IF(AI2=12.5,BB7,IF(AI2=9.5,AV7,IF(AI2=4.75,AP7))))))","v":false},null,null,{"$f":"IF(AI2=37.5,BW7,IF(AI2=25,BQ7,IF(AI2=19,BK7,IF(AI2=12.5,BE7,IF(AI2=9.5,AY7,IF(AI2=4.75,AS7))))))","v":false},null,null,null,3.1160000000000001,{"$f":"IF(AI2=9.5,100,IF(AI2=4.75,100,#N/A))","v":{"$error":"#N/A"}},null,"3/4\"",null,null,null,null,null,"3/4\"",null,null,null,null,null,"3/4\"",100,null,null,null,100,"3/4\"",90,100,null,null,null,"3/4\"",null,89,null,null,null,"3/4\""]
[null,null,{"$f":"IF('Trial Blends'!N42=1,CONCATENATE(\"Trial Blend 1 has been selected as the design aggregate structure and an Estimated Optium Asphalt Content of \",'Trial Blends'!N43,\" has been chosen\"),IF('Trial Blends'!N42=2,CONCATENATE(\"Trial Blend 2 has been selected as the design aggregate structure and an Estimated Optium Asphalt Content of \",'Trial Blends'!N43,\" has been chosen\"),IF('Trial Blends'!N42=3,CONCATENATE(\"Trial Blend 3 has been selected as the design aggregate structure and an Estimated Optium Asphalt Content of \",'Trial Blends'!N43,\" has been chosen\"),\" \")))","v":" "},null,null,null,null,null,null,null,null,null,null,null,null,null,null,null,null,null,null,"1/2\"",{"$f":"IF(K34,K34,NA())","v":{"$error":"#VALUE!"}},null,"12.5mm","1/2\"",12.5,3.116086507375345,{"$f":"IF(AI2=37.5,BS8,IF(AI2=25,BM8,IF(AI2=19,BG8,IF(AI2=12.5,BA8,IF(AI2=9.5,AU8,IF(AI2=4.75,AO8))))))","v":false},{"$f":"IF(AI2=37.5,BT8,IF(AI2=25,BN8,IF(AI2=19,BH8,IF(AI2=12.5,BB8,IF(AI2=9.5,AV8,IF(AI2=4.75,AP8))))))","v":false},null,null,{"$f":"IF(AI2=37.5,BW8,IF(AI2=25,BQ8,IF(AI2=19,BK8,IF(AI2=12.5,BE8,IF(AI2=9.5,AY8,IF(AI2=4.75,AS8))))))","v":false},null,null,null,2.754,null,null,"1/2\"",100,null,null,null,100,"1/2\"",100,null,null,null,100,"1/2\"",90,{"$f":"IF($AB$1=\"SMA125\",99,100)","v":100},null,null,null,"1/2\"",null,89,null,null,null,"1/2\"",null,null,null,null,null,"1/2\""]
[null,null,null,null,null,null,null,null,null,null,null,null,null,null,null,null,null,null,null,null,null,"3/8\"",{"$f":"J34","v":" "},null,"9.5mm","3/8\"",9.5,2.754074108566122,{"$f":"IF(AI2=37.5,BS9,IF(AI2=25,BM9,IF(AI2=19,BG9,IF(AI2=12.5,BA9,IF(AI2=9.5,AU9,IF(AI2=4.75,AO9))))))","v":false},{"$f":"IF(AI2=37.5,BT9,IF(AI2=25,BN9,IF(AI2=19,BH9,IF(AI2=12.5,BB9,IF(AI2=9.5,AV9,IF(AI2=4.75,AP9))))))","v":false},47,null,{"$f":"IF(AI2=37.5,BW9,IF(AI2=25,BQ9,IF(AI2=19,BK9,IF(AI2=12.5,BE9,IF(AI2=9.5,AY9,IF(AI2=4.75,AS9))))))","v":false},null,null,null,2.016,null,null,"3/8\"",95,100,null,null,null,"3/8\"",{"$f":"IF($AB$1=\"SMA95\",75,90)","v":90},{"$f":"IF($AB$1=\"SMA95\",95,100)","v":100},null,null,null,"3/8\"",{"$f":"IF($AB$1=\"SMA125\",70,\" \")","v":" "},{"$f":"IF($AB$1=\"SMA125\",85,89)","v":89},null,null,null,"3/8\"",null,null,null,null,null,"3/8\"",null,null,null,null,null,"3/8\"",null,null,47]
[null,null,null,null,null,null,null,null,null,null,null,null,null,null,null,null,null,null,null,null,null,"1/4\"",{"$f":"IF(AJ2=6.33,I34,#N/A)","v":{"$error":"#N/A"}}]
[null,null,null,null,null,null,null,null,null,null,null,null,null,null,null,null,null,null,null,null,null,"#4",{"$f":"H34","v":" "},null,"4.75mm","#4",4.75,2.0161002539629291,{"$f":"IF(AI2=37.5,BS11,IF(AI2=25,BM11,IF(AI2=19,BG11,IF(AI2=12.5,BA11,IF(AI2=9.5,AU11,IF(AI2=4.75,AO11))))))","v":false},{"$f":"IF(AI2=37.5,BT11,IF(AI2=25,BN11,IF(AI2=19,BH11,IF(AI2=12.5,BB11,IF(AI2=9.5,AV11,IF(AI2=4.75,AP11))))))","v":false},null,null,{"$f":"IF(AI2=37.5,BW11,IF(AI2=25,BQ11,IF(AI2=19,BK11,IF(AI2=12.5,BE11,IF(AI2=9.5,AY11,IF(AI2=4.75,AS11))))))","v":false},null,null,null,1.472,null,null,"#4",89,100,null,null,null,"#4",{"$f":"IF($AB$1=\"SMA95\",30,\" \")","v":" "},{"$f":"IF($AB$1=\"SMA95\",50,\" \")","v":" "},null,null,null,"#4",{"$f":"IF($AB$1=\"SMA125\",28,\" \")","v":" "},{"$f":"IF($AB$1=\"SMA125\",40,\" \")","v":" "},null,null,null,"#4",null,null,47,null,null,"#4",null,null,40,null,null,"#4"]
[null,null,null,null,null,null,null,null,null,null,null,null,null,null,null,null,null,null,null,null,null,"#8",{"$f":"G34","v":" "},null,"2.36mm","#8",2.36,1.4716698795820382,{"$f":"IF(AI2=37.5,BS12,IF(AI2=25,BM12,IF(AI2=19,BG12,IF(AI2=12.5,BA12,IF(AI2=9.5,AU12,IF(AI2=4.75,AO12))))))","v":false},{"$f":"IF(AI2=37.5,BT12,IF(AI2=25,BN12,IF(AI2=19,BH12,IF(AI2=12.5,BB12,IF(AI2=9.5,AV12,IF(AI2=4.75,AP12))))))","v":false},null,null,{"$f":"IF(AI2=37.5,BW12,IF(AI2=25,BQ12,IF(AI2=19,BK12,IF(AI2=12.5,BE12,IF(AI2=9.5,AY12,IF(AI2=4.75,AS12))))))","v":false},null,null,null,1.077,null,null,"#8",null,null,null,null,null,"#8",{"$f":"IF($AB$1=\"SMA95\",20,32)","v":32},{"$f":"IF($AB$1=\"SMA95\",30,67)","v":67},47,null,null,"#8",{"$f":"IF($AB$1=\"SMA125\",18,28)","v":28},{"$f":"IF($AB$1=\"SMA125\",30,58)","v":58},39,null,null,"#8",23,49,null,null,null,"#8",19,45,null,null,null,"#8",15,41]
[null,null,null,null,null,null,null,null,null,null,null,null,null,null,null,null,null,null,null,null,null,"#16",{"$f":"F34","v":" "},null,"1.18mm","#16",1.18,1.0773254099250416,{"$f":"IF(AI2=37.5,BS13,IF(AI2=25,BM13,IF(AI2=19,BG13,IF(AI2=12.5,BA13,IF(AI2=9.5,AU13,IF(AI2=4.75,AO13))))))","v":false},{"$f":"IF(AI2=37.5,BT13,IF(AI2=25,BN13,IF(AI2=19,BH13,IF(AI2=12.5,BB13,IF(AI2=9.5,AV13,IF(AI2=4.75,AP13))))))","v":false},null,null,{"$f":"IF(AI2=37.5,BW13,IF(AI2=25,BQ13,IF(AI2=19,BK13,IF(AI2=12.5,BE13,IF(AI2=9.5,AY13,IF(AI2=4.75,AS13))))))","v":false},null,null,null,0.79500000000000004,null,null,"#16",30,60,null,null,null,"#16",null,null,null,null,null,"#16",null,null,null,null,null,"#16",null,null,null,null,null,"#16",null,null,null,null,null,"#16"]
[null,null,null,null,null,null,null,null,null,null,null,null,null,null,null,null,null,null,null,null,null,"#30",{"$f":"E34","v":" "},null,"600µm","#30",0.6,0.79463568224020453,{"$f":"IF(AI2=37.5,BS14,IF(AI2=25,BM14,IF(AI2=19,BG14,IF(AI2=12.5,BA14,IF(AI2=9.5,AU14,IF(AI2=4.75,AO14))))))","v":false},{"$f":"IF(AI2=37.5,BT14,IF(AI2=25,BN14,IF(AI2=19,BH14,IF(AI2=12.5,BB14,IF(AI2=9.5,AV14,IF(AI2=4.75,AP14))))))","v":false},null,null,{"$f":"IF(AI2=37.5,BW14,IF(AI2=25,BQ14,IF(AI2=19,BK14,IF(AI2=12.5,BE14,IF(AI2=9.5,AY14,IF(AI2=4.75,AS14))))))","v":false},null,null,null,0.58199999999999996,null,null,"#30",null,null,null,null,null,"#30",null,null,null,null,null,"#30",null,null,null,null,null,"#30",null,null,null,null,null,"#30",null,null,null,null,null,"#30"]
[null,null,null,null,null,null,null,null,null,null,null,null,null,null,null,null,null,null,null,null,null,"#50",{"$f":"D34","v":" "},null,"300µm","#50",0.3,0.58170736792793831,{"$f":"IF(AI2=37.5,BS15,IF(AI2=25,BM15,IF(AI2=19,BG15,IF(AI2=12.5,BA15,IF(AI2=9.5,AU15,IF(AI2=4.75,AO15))))))","v":false},{"$f":"IF(AI2=37.5,BT15,IF(AI2=25,BN15,IF(AI2=19,BH15,IF(AI2=12.5,BB15,IF(AI2=9.5,AV15,IF(AI2=4.75,AP15))))))","v":false},null,null,{"$f":"IF(AI2=37.5,BW15,IF(AI2=25,BQ15,IF(AI2=19,BK15,IF(AI2=12.5,BE15,IF(AI2=9.5,AY15,IF(AI2=4.75,AS15))))))","v":false},null,null,null,0.42599999999999999,null,null,"#50",null,null,null,null,null,"#50",null,null,null,null,null,"#50",null,null,null,null,null,"#50",null,null,null,null,null,"#50",null,null,null,null,null,"#50"]
[null,null,null,null,null,null,null,null,null,null,null,null,null,null,null,null,null,null,null,null,null,"#100",{"$f":"C34","v":" "},null,"150µm","#100",0.15,0.42583471830473674,{"$f":"IF(AI2=37.5,BS16,IF(AI2=25,BM16,IF(AI2=19,BG16,IF(AI2=12.5,BA16,IF(AI2=9.5,AU16,IF(AI2=4.75,AO16))))))","v":false},{"$f":"IF(AI2=37.5,BT16,IF(AI2=25,BN16,IF(AI2=19,BH16,IF(AI2=12.5,BB16,IF(AI2=9.5,AV16,IF(AI2=4.75,AP16))))))","v":false},null,null,{"$f":"IF(AI2=37.5,BW16,IF(AI2=25,BQ16,IF(AI2=19,BK16,IF(AI2=12.5,BE16,IF(AI2=9.5,AY16,IF(AI2=4.75,AS16))))))","v":false},null,null,null,0.312,null,null,"#100",null,null,null,null,null,"#100",null,null,null,null,null,"#100",null,null,null,null,null,"#100",null,null,null,null,null,"#100",null,null,null,null,null,"#100"]
[null,null,null,null,null,null,null,null,null,null,null,null,null,null,null,null,null,null,null,null,null,"#200",{"$f":"B34","v":" "},null,"75µm","#200",7.4999999999999997E-2,{"$f":"POWER(AA17,0.45)","v":0.31172925995349998},{"$f":"IF(AI2=37.5,BS17,IF(AI2=25,BM17,IF(AI2=19,BG17,IF(AI2=12.5,BA17,IF(AI2=9.5,AU17,IF(AI2=4.75,AO17))))))","v":false},{"$f":"IF(AI2=37.5,BT17,IF(AI2=25,BN17,IF(AI2=19,BH17,IF(AI2=12.5,BB17,IF(AI2=9.5,AV17,IF(AI2=4.75,AP17))))))","v":false},null,null,{"$f":"IF(AI2=37.5,BW17,IF(AI2=25,BQ17,IF(AI2=19,BK17,IF(AI2=12.5,BE17,IF(AI2=9.5,AY17,IF(AI2=4.75,AS17))))))","v":false},null,null,null,0,0,null,"#200",6,12,null,null,null,"#200",{"$f":"IF($AB$1=\"SMA95\",8,2)","v":2},{"$f":"IF($AB$1=\"SMA95\",11,10)","v":10},null,null,null,"#200",{"$f":"IF($AB$1=\"SMA125\",8,2)","v":2},{"$f":"IF($AB$1=\"SMA125\",11,10)","v":10},null,null,null,"#200",2,8,null,null,null,"#200",1,7,null,null,null,"#200",0,6]
[null,null,null,null,null,null,null,null,null,null,null,null,null,null,null,null,null,null,null,null,null,null,null,null,"Pan",null,0,0,null,null,null,null,{"$f":"IF(AI2=37.5,BW18,IF(AI2=25,BQ18,IF(AI2=19,BK18,IF(AI2=12.5,BE18,IF(AI2=9.5,AY18,IF(AI2=4.75,AS18))))))","v":false},null,null,null,null,null,null,null,null,null,null,null,0,null,null,null,null,null,0,null,null,null,null,null,0,null,null,null,null,null,0,null,null,null,null,null,0,null,null,null,null,null,0]
[]
[]
[]
[null,null,null,null,null,null,null,null,null,null,null,null,null,null,null,null,null,null,null,{"$f":"$N$34","v":" "},{"$f":"$M$34","v":" "},"Bulk SpGr (Gsb)",null,null,{"$f":"IF(W1=1,'Agg Blends'!L36,IF(W1=2,'Agg Blends'!M36,IF(W1=3,'Agg Blends'!N36)))","v":false}]
[null,null,null,null,null,null,null,null,null,null,null,null,null,null,null,null,null,null,null,null,null,"Eff. SpGr (Gse)",null,null,{"$f":"IF($W$1=1,Gmm!J23,IF($W$1=2,Gmm!P23,IF($W$1=3,Gmm!V23)))","v":false}]
[null,null,null,null,null,null,null,null,null,null,null,null,null,null,null,null,null,null,null,null,null,"App. SpGr (Gsa)",null,null,{"$f":"IF(W1=1,'Agg Blends'!L38,IF(W1=2,'Agg Blends'!M38,IF(W1=3,'Agg Blends'!N38)))","v":false}]
[null,null,null,null,null,null,null,null,null,null,null,null,null,null,null,null,null,null,null,null,null,"H2O Absorption (Abs)",null,null,{"$f":"IF($W$1=1,'Agg Blends'!L37,IF($W$1=2,'Agg Blends'!M37,IF($W$1=3,'Agg Blends'!N37)))","v":false}]
[null,null,null,null,null,null,null,null,null,null,null,null,null,null,null,null,null,null,null,null,null,"AC Absorption (Pba)",null,null,{"$f":"IF($W$1=1,Gmm!J29,IF($W$1=2,Gmm!P29,IF($W$1=3,Gmm!V29)))","v":false}]
[null,null,null,null,null,null,null,null,null,null,null,null,null,null,null,null,null,null,null,null,null,"Sand Equivalency",null,null,{"$f":"IF($W$1=1,'Agg Blends'!L39,IF($W$1=2,'Agg Blends'!M39,IF($W$1=3,'Agg Blends'!N39)))","v":false}]
[null,null,null,null,null,null,null,null,null,null,null,null,null,null,null,null,null,null,null,null,null,"Flat & Elongated 3:1",null,null,{"$f":"IF($W$1=1,'Agg Blends'!L40,IF($W$1=2,'Agg Blends'!M40,IF($W$1=3,'Agg Blends'!N40)))","v":false}]
[null,null,null,null,null,null,null,null,null,null,null,null,null,null,null,null,null,null,null,null,null,"Flat & Elongated 5:1",null,null,{"$f":"IF($W$1=1,'Agg Blends'!L41,IF($W$1=2,'Agg Blends'!M41,IF($W$1=3,'Agg Blends'!N41)))","v":false}]
[null,null,null,null,null,null,null,null,null,null,null,null,null,null,null,null,null,null,null,null,null,"Uncompacted Voids",null,null,{"$f":"IF($W$1=1,'Agg Blends'!L43,IF($W$1=2,'Agg Blends'!M43,IF($W$1=3,'Agg Blends'!N43)))","v":false}]
[null,null,null,null,null,null,null,null,null,null,null,null,null,null,null,null,null,null,null,null,null,"CA Angularity (1)",null,null,{"$f":"IF($W$1=1,'Agg Blends'!L44,IF($W$1=2,'Agg Blends'!M44,IF($W$1=3,'Agg Blends'!N44)))","v":false}]
[null,"75µm","150µm","300µm","600µm","1.18mm","2.36mm","4.75mm","6.33mm","9.5mm","12.5mm","19.0mm","25.0mm","37.5mm","50mm",null,null,null,null,null,null,"CA Angularity (2)",null,null,{"$f":"IF($W$1=1,'Agg Blends'!L45,IF($W$1=2,'Agg Blends'!M45,IF($W$1=3,'Agg Blends'!N45)))","v":false}]
[null,"#200","#100","#50","#30","#16","#8","#4","1/4\"","3/8\"","1/2\"","3/4\"","1\"","1 1/2\"","2\"",null,null,null,null,null,null,"VCAMIX",null,null,{"$f":"VCA!N30","v":""}]
[null,{"$f":"IF($W$1=1,'Agg Blends'!$L34,IF($W$1=2,'Agg Blends'!$M34,IF($W$1=3,'Agg Blends'!$N34,\" \")))","v":" "},{"$f":"IF($W$1=1,'Agg Blends'!$L33,IF($W$1=2,'Agg Blends'!$M33,IF($W$1=3,'Agg Blends'!$N33,\" \")))","v":" "},{"$f":"IF($W$1=1,'Agg Blends'!$L32,IF($W$1=2,'Agg Blends'!$M32,IF($W$1=3,'Agg Blends'!$N32,\" \")))","v":" "},{"$f":"IF($W$1=1,'Agg Blends'!$L31,IF($W$1=2,'Agg Blends'!$M31,IF($W$1=3,'Agg Blends'!$N31,\" \")))","v":" "},{"$f":"IF($W$1=1,'Agg Blends'!$L30,IF($W$1=2,'Agg Blends'!$M30,IF($W$1=3,'Agg Blends'!$N30,\" \")))","v":" "},{"$f":"IF($W$1=1,'Agg Blends'!$L29,IF($W$1=2,'Agg Blends'!$M29,IF($W$1=3,'Agg Blends'!$N29,\" \")))","v":" "},{"$f":"IF($W$1=1,'Agg Blends'!$L28,IF($W$1=2,'Agg Blends'!$M28,IF($W$1=3,'Agg Blends'!$N28,\" \")))","v":" "},{"$f":"IF($W$1=1,'Agg Blends'!$L27,IF($W$1=2,'Agg Blends'!$M27,IF($W$1=3,'Agg Blends'!$N27,\" \")))","v":" "},{"$f":"IF($W$1=1,'Agg Blends'!$L26,IF($W$1=2,'Agg Blends'!$M26,IF($W$1=3,'Agg Blends'!$N26,\" \")))","v":" "},{"$f":"IF($W$1=1,'Agg Blends'!$L25,IF($W$1=2,'Agg Blends'!$M25,IF($W$1=3,'Agg Blends'!$N25,\" \")))","v":" "},{"$f":"IF($W$1=1,'Agg Blends'!$L24,IF($W$1=2,'Agg Blends'!$M24,IF($W$1=3,'Agg Blends'!$N24,\" \")))","v":" "},{"$f":"IF($W$1=1,'Agg Blends'!$L23,IF($W$1=2,'Agg Blends'!$M23,IF($W$1=3,'Agg Blends'!$N23,\" \")))","v":" "},{"$f":"IF($W$1=1,'Agg Blends'!$L22,IF($W$1=2,'Agg Blends'!$M22,IF($W$1=3,'Agg Blends'!$N22,\" \")))","v":" "},{"$f":"IF($W$1=1,'Agg Blends'!$L21,IF($W$1=2,'Agg Blends'!$M21,IF($W$1=3,'Agg Blends'!$N21,\" \")))","v":" "},null,null,null,null,null,null,"VCADRC",null,null,{"$f":"VCA!N24","v":""},null,null,null,null,null,null,null,null,null,null,null,null,null,null,{"$f":"$N$34","v":" "}]
[null,0.31172925995349998,0.42583471830473674,0.58170736792793831,0.79463568224020453,1.0773254099250416,1.4716698795820382,2.0161002539629291,2.754074108566122,3.116086507375345,3.7621761023862978,4.2566996126039234,5.1087431744234335,5.8148230317277987]
[null,null,"VCAMIX / VCADRC",null,null,{"$f":"Y33","v":""},{"$f":"Y34","v":""},null,"Flat & Elongated 3:1",null,null,{"$f":"Y28","v":false}]
[null,null,"Bulk SpGr (Gsb)",null,null,{"$f":"Y22","v":false},null,null,"Flat & Elongated 5:1",null,null,{"$f":"IF(ISTEXT(Y29),\"0\",Y29)","v":false}]
[null,null,"Eff. SpGr (Gse)",null,null,{"$f":"Y23","v":false},null,null,"CA Angularity (1)",null,null,{"$f":"Y31","v":false}]
[null,null,"App. SpGr (Gsa)",null,null,{"$f":"Y24","v":false},null,null,"CA Angularity (2)",null,null,{"$f":"Y32","v":false}]
[null,null,"H2O Absorption (Abs)",null,null,{"$f":"Y25","v":false},null,null,"Sand Equivalency",null,null,{"$f":"Y27","v":false}]
[null,null,"AC Absorption (Pba)",null,null,{"$f":"Y26","v":false},null,null,"Uncompacted Voids",null,null,{"$f":"Y30","v":false}]

{"sheet":"Gmm2","index":10,"n_rows":35,"n_cols":36,"rows_kept":35,"cut":false,"hidden":false,"merged":[[32,9,32,16],[29,6,29,7],[28,6,28,7],[27,6,27,7],[26,6,26,7],[25,6,25,7],[26,10,26,11],[27,10,27,11],[28,10,28,11],[29,10,29,11],[29,8,29,9],[28,8,28,9],[27,8,27,9],[26,8,26,9],[29,12,29,13],[28,12,28,13],[27,12,27,13],[26,12,26,13],[25,12,25,13],[29,14,29,15],[28,14,28,15],[27,14,27,15],[25,14,25,15],[25,16,25,17],[0,1,0,2],[2,1,2,22],[3,2,3,4],[3,5,3,8],[3,9,3,12],[3,17,3,19],[3,20,3,21],[5,20,5,21],[4,2,4,4],[4,5,4,8],[4,9,4,12],[4,13,4,15],[4,18,4,19],[4,20,4,21],[5,2,5,4],[5,5,5,7],[5,9,5,12],[5,13,5,15],[5,17,5,19],[3,13,3,16],[29,20,29,21],[28,20,28,21],[27,20,27,21],[26,20,26,21],[21,0,21,22],[23,6,23,7],[23,8,23,9],[23,10,23,11],[23,12,23,13],[23,14,23,15],[23,16,23,17],[23,18,23,19],[23,20,23,21],[25,20,25,21],[29,16,29,17],[28,16,28,17],[27,16,27,17],[26,16,26,17],[25,18,25,19],[25,10,25,11],[25,8,25,9],[26,14,26,15],[5,32,5,35],[7,32,7,35],[8,32,8,35],[9,32,9,35],[17,10,17,11],[18,10,18,11],[7,8,7,12],[17,12,17,13],[18,12,18,13],[17,8,17,9],[7,13,7,14],[12,0,12,22],[15,8,15,9],[16,8,16,9],[14,10,14,11],[14,12,14,13],[15,12,15,13],[16,12,16,13],[9,5,10,18],[16,10,16,11],[15,10,15,11],[18,8,18,9],[34,12,34,15],[34,4,34,11],[30,18,30,21],[24,1,24,5],[25,1,25,5],[26,1,26,5],[27,1,27,5],[28,1,28,5],[29,1,29,5],[30,6,30,9],[30,10,30,13],[30,14,30,17],[24,20,24,21],[24,18,24,19],[24,16,24,17],[24,14,24,15],[24,12,24,13],[24,10,24,11],[24,8,24,9],[24,6,24,7],[29,18,29,19],[28,18,28,19],[27,18,27,19],[26,18,26,19]]}
[null,{"$f":"Setup!A2","v":"ESB-21"},null,null,null,null,null,null,null,null,null,null,null,null,null,null,null,null,null,null,null,null,null,null,null,null,null,null,null,null,null,null,"Measured Gmm"]
[null,null,null,null,null,null,null,null,null,null,null,null,null,null,null,null,null,null,null,null,null,null,null,null,null,null,null,null,null,null,null,null,"Calculated Gmm"]
[null,"Maximum Specific Gravity of AC Trials"]
[null,null,"Producer;",null,null,{"$f":"Setup!E7","v":0},null,null,null,"Material Class:",null,null,null,{"$f":"Setup!E11","v":0},null,null,null,"JMF",null,null,{"$f":"Setup!E5","v":0}]
[null,null,"Designed By:",null,null,{"$f":"Setup!E9","v":0},null,null,null,"Esals:",null,null,null,{"$f":"Setup!E13","v":0},null,null,null,null,"SRL:",null,{"$f":"Setup!E12","v":0}]
[null,null,"Date:",null,null,{"$f":"Setup!E6","v":"00:00:00"},null,null,null,"Rap:",null,null,null,{"$f":"Setup!E18","v":0},null,null,null,"PG Grade:",null,null,{"$f":"Setup!E15","v":0},null,null,null,null,null,null,null,null,null,null,null,{"$f":"IF('Trial Blends'!$N$42=1,Gmm!J16,IF('Trial Blends'!$N$42=2,Gmm!P16,IF('Trial Blends'!$N$42=3,Gmm!V16)))","v":false}]
[null,null,null,null,null,null,null,null,null,null,null,null,null,null,null,null,null,null,null,null,null,null,null,null,null,null,null,null,null,null,null,null,{"$f":"K16","v":-0.5},{"$f":"K17","v":0},{"$f":"K18","v":0.5},{"$f":"K19","v":1}]
[null,null,null,null,null,null,null,null,"Trial Blend selected",null,null,null,null,{"$f":"'Trial Blends'!N42","v":0},null,null,null,null,null,null,null,null,null,null,null,null,null,null,null,null,null,"Gsb selected",{"$f":"IF('Trial Blends'!$N$42=1,Gmm!J27,IF('Trial Blends'!$N$42=2,Gmm!P27,IF('Trial Blends'!$N$42=3,Gmm!V27)))","v":false}]
[null,null,null,null,null,null,null,null,null,null,null,null,null,null,null,null,null,null,null,null,null,null,null,null,null,null,null,null,null,null,null,"AC in test mix",{"$f":"IF('Trial Blends'!N42=1,Gmm!J20,IF('Trial Blends'!N42=2,Gmm!P20,IF('Trial Blends'!N42=3,Gmm!V20)))","v":false}]
[null,null,null,null,null,"This Worksheet gives the option to use Calculated or Measured Maximum Specific Gravities for the AC Trials ",null,null,null,null,null,null,null,null,null,null,null,null,null,null,null,null,null,null,null,null,null,null,null,null,null,"Gb",{"$f":"Setup!E16","v":0}]
[null,null,null,null,null,null,null,null,null,null,null,null,null,null,null,null,null,null,null,null,null,null,null,null,null,null,null,null,null,null,null,4,{"$f":"ROUND(AG9/AG10,3)","v":{"$error":"#DIV/0!"}},{"$f":"ROUND(AG9/AG10,3)","v":{"$error":"#DIV/0!"}},{"$f":"ROUND(AG9/AG10,3)","v":{"$error":"#DIV/0!"}},{"$f":"ROUND(AG9/AG10,3)","v":{"$error":"#DIV/0!"}}]
[null,null,null,null,null,null,null,null,null,null,null,null,null,null,null,null,null,null,null,null,null,null,null,null,null,null,null,null,null,null,null,5,{"$f":"ROUND(100-AG9,1)","v":100},{"$f":"ROUND(100-AG9,1)","v":100},{"$f":"ROUND(100-AG9,1)","v":100},{"$f":"ROUND(100-AG9,1)","v":100}]
["Calculated Maximum Specific Gravity of the Selected Trial Blend at the Estiminated Optium Asphalt ",null,null,null,null,null,null,null,null,null,null,null,null,null,null,null,null,null,null,null,null,null,null,null,null,null,null,null,null,null,null,6,{"$f":"ROUND(AG6*AG12,3)","v":0},{"$f":"ROUND(AG6*AH12,3)","v":0},{"$f":"ROUND(AG6*AI12,3)","v":0},{"$f":"ROUND(AG6*AJ12,3)","v":0}]
[null,null,null,null,null,null,null,null,null,null,null,null,null,null,null,null,null,null,null,null,null,null,null,null,null,null,null,null,null,null,null,7,{"$f":"ROUND(AG11*AG6,3)","v":{"$error":"#DIV/0!"}},{"$f":"ROUND(AH11*AG6,3)","v":{"$error":"#DIV/0!"}},{"$f":"ROUND(AI11*AG6,3)","v":{"$error":"#DIV/0!"}},{"$f":"ROUND(AJ11*AG6,3)","v":{"$error":"#DIV/0!"}}]
[null,null,null,null,null,null,null,null,null,null,"% AC",null,"Gmm",null,null,null,null,null,null,null,null,null,null,null,null,null,null,null,null,null,null,8,{"$f":"ROUND(100-AG14,3)","v":{"$error":"#DIV/0!"}},{"$f":"ROUND(100-AH14,3)","v":{"$error":"#DIV/0!"}},{"$f":"ROUND(100-AI14,3)","v":{"$error":"#DIV/0!"}},{"$f":"ROUND(100-AJ14,3)","v":{"$error":"#DIV/0!"}}]
[null,null,null,null,null,null,null,null,-0.5,null,{"$f":"K17-0.5","v":-0.5},null,{"$f":"IF(ISERROR(AG21),\"\",AG21)","v":""},null,null,null,null,null,null,null,null,null,null,null,null,null,null,null,null,null,null,9,{"$f":"ROUND(AG13/AG15,3)","v":{"$error":"#DIV/0!"}},{"$f":"ROUND(AH13/AH15,3)","v":{"$error":"#DIV/0!"}},{"$f":"ROUND(AI13/AI15,3)","v":{"$error":"#DIV/0!"}},{"$f":"ROUND(AJ13/AJ15,3)","v":{"$error":"#DIV/0!"}}]
[null,null,null,null,null,null,null,null,"Est. AC",null,{"$f":"'Trial Blends'!N43","v":0},null,{"$f":"IF(ISERROR(AH21),\"\",AH21)","v":""},null,null,null,null,null,null,null,null,null,null,null,null,null,null,null,null,null,null,10,{"$f":"ROUND(100-K16,1)","v":100.5},{"$f":"ROUND(100-K17,1)","v":100},{"$f":"ROUND(100-K18,1)","v":99.5},{"$f":"ROUND(100-K19,1)","v":99}]
[null,null,null,null,null,null,null,null,"+0.5",null,{"$f":"K17+0.5","v":0.5},null,{"$f":"IF(ISERROR(AI21),\"\",AI21)","v":""},null,null,null,null,null,null,null,null,null,null,null,null,null,null,null,null,null,null,11,{"$f":"ROUND(K16/AG10,3)","v":{"$error":"#DIV/0!"}},{"$f":"ROUND(K17/AG10,3)","v":{"$error":"#DIV/0!"}},{"$f":"ROUND(K18/AG10,3)","v":{"$error":"#DIV/0!"}},{"$f":"ROUND(K19/AG10,3)","v":{"$error":"#DIV/0!"}}]
[null,null,null,null,null,null,null,null,"+1.0",null,{"$f":"K17+1","v":1},null,{"$f":"IF(ISERROR(AJ21),\"\",AJ21)","v":""},null,null,null,null,null,null,null,null,null,null,null,null,null,null,null,null,null,null,12,{"$f":"ROUND(AG17/AG16,3)","v":{"$error":"#DIV/0!"}},{"$f":"ROUND(AH17/AH16,3)","v":{"$error":"#DIV/0!"}},{"$f":"ROUND(AI17/AI16,3)","v":{"$error":"#DIV/0!"}},{"$f":"ROUND(AJ17/AJ16,3)","v":{"$error":"#DIV/0!"}}]
[null,null,null,null,null,null,null,null,null,null,null,null,null,null,null,null,null,null,null,null,null,null,null,null,null,null,null,null,null,null,null,13,{"$f":"ROUND(AG19+AG18,3)","v":{"$error":"#DIV/0!"}},{"$f":"ROUND(AH19+AH18,3)","v":{"$error":"#DIV/0!"}},{"$f":"ROUND(AI19+AI18,3)","v":{"$error":"#DIV/0!"}},{"$f":"ROUND(AJ19+AJ18,3)","v":{"$error":"#DIV/0!"}}]
[null,null,null,null,null,null,null,null,null,null,null,null,null,null,null,null,null,null,null,null,null,null,null,null,null,null,null,null,null,null,null,14,{"$f":"ROUND(100/AG20,3)","v":{"$error":"#DIV/0!"}},{"$f":"ROUND(100/AH20,3)","v":{"$error":"#DIV/0!"}},{"$f":"ROUND(100/AI20,3)","v":{"$error":"#DIV/0!"}},{"$f":"ROUND(100/AJ20,3)","v":{"$error":"#DIV/0!"}}]
["Measured Maximum Specific Gravity of the Selected Trial Blend at the Estiminated Optium Asphalt ",null,null,null,null,null,null,null,null,null,null,null,null,null,null,null,null,null,null,null,null,null,null,null,null,null,null,null,null,null,null,"Absor. AC",{"$f":"100*((AG16-AG8)/(AG8*AG16))*AG10","v":{"$error":"#DIV/0!"}},{"$f":"100*((AH16-AG8)/(AG8*AH16))*$AG$10","v":{"$error":"#DIV/0!"}},{"$f":"100*((AI16-AG8)/(AI16*AG8))*$AG$10","v":{"$error":"#DIV/0!"}},{"$f":"100*((AJ16-AG8)/(AG8*AJ16))*$AG$10","v":{"$error":"#DIV/0!"}}]
[null,null,null,null,null,null,null,null,null,null,null,null,null,null,null,null,null,null,null,null,null,null,null,null,null,null,null,null,null,null,null,"Pbe",{"$f":"ROUND(K16-(AG22/100)*(100-K16),1)","v":{"$error":"#DIV/0!"}},{"$f":"ROUND(K17-(AH22/100)*(100-K17),1)","v":{"$error":"#DIV/0!"}},{"$f":"ROUND(K18-(AI22/100)*(100-K18),1)","v":{"$error":"#DIV/0!"}},{"$f":"ROUND(K19-(AJ22/100)*(100-K18),1)","v":{"$error":"#DIV/0!"}}]
[null,null,null,null,null,null,{"$f":"K16","v":-0.5},null,"% AC",null,{"$f":"K17","v":0},null,"% AC",null,{"$f":"K18","v":0.5},null,"% AC",null,{"$f":"K19","v":1},null,"% AC"]
[null,"Sample Number",null,null,null,null,1,null,2,null,1,null,2,null,1,null,2,null,1,null,2]
[null,"Dry Wt. of Sample",null,null,null,null,null,null,null,null,null,null,null,null,null,null,null,null,null,null,null,null,null,null,null,null,null,null,null,null,null,"Gse",{"$f":"(100-G24)/(100/G31-G24/$AG$10)","v":{"$error":"#VALUE!"}},{"$f":"(100-K24)/(100/K31-K24/$AG$10)","v":{"$error":"#VALUE!"}},{"$f":"(100-O24)/(100/O31-O24/$AG$10)","v":{"$error":"#VALUE!"}},{"$f":"(100-S24)/(100/S31-S24/$AG$10)","v":{"$error":"#VALUE!"}}]
[null,{"$f":"IF(Setup!$E$20=\"Suspension\",\"Mass of Pyc in Water\",\"Mass of Pyc + Water\")","v":"Mass of Pyc + Water"},null,null,null,null,{"$f":"IF(G26,Setup!$F$21,\" \")","v":" "},null,{"$f":"IF(I26,Setup!$F$21,\" \")","v":" "},null,{"$f":"IF(K26,Setup!$F$21,\" \")","v":" "},null,{"$f":"IF(M26,Setup!$F$21,\" \")","v":" "},null,{"$f":"IF(O26,Setup!$F$21,\" \")","v":" "},null,{"$f":"IF(Q26,Setup!$F$21,\" \")","v":" "},null,{"$f":"IF(S26,Setup!$F$21,\" \")","v":" "},null,{"$f":"IF(U26,Setup!$F$21,\" \")","v":" "},null,null,null,null,null,null,null,null,null,null,"Absor AC",{"$f":"100*((AG26-$AG$8)/($AG$8*$AG$26))*$AG$10","v":{"$error":"#VALUE!"}},{"$f":"100*((AH26-$AG$8)/($AG$8*$AH$26))*$AG$10","v":{"$error":"#VALUE!"}},{"$f":"100*((AI26-$AG$8)/($AG$8*$AI$26))*$AG$10","v":{"$error":"#VALUE!"}},{"$f":"100*((AJ26-$AG$8)/($AG$8*$AJ$26))*$AG$10","v":{"$error":"#VALUE!"}}]
[null,{"$f":"IF(Setup!F20=\"Suspension\",\"Mass samp+Pyc in H2O\",\"Mass Pyc + Mix + Water\")","v":"Mass Pyc + Mix + Water"},null,null,null,null,null,null,null,null,null,null,null,null,null,null,null,null,null,null,null,null,null,null,null,null,null,null,null,null,null,"Pbe",{"$f":"ROUND(G24-(AG27/100)*(100-G24),1)","v":{"$error":"#VALUE!"}},{"$f":"ROUND(K24-(AH27/100)*(100-K24),1)","v":{"$error":"#VALUE!"}},{"$f":"ROUND(O24-(AI27/100)*(100-O24),1)","v":{"$error":"#VALUE!"}},{"$f":"ROUND(S24-(AJ27/100)*(100-S24),1)","v":{"$error":"#VALUE!"}}]
[null,"Volume of Voidless Mix",null,null,null,null,{"$f":"IF(G28,ROUND(G26+G27-G28,1),\" \")","v":" "},null,{"$f":"IF(I28,ROUND(I26+I27-I28,1),\" \")","v":" "},null,{"$f":"IF(K28,ROUND(K26+K27-K28,1),\" \")","v":" "},null,{"$f":"IF(M28,ROUND(M26+M27-M28,1),\" \")","v":" "},null,{"$f":"IF(O28,ROUND(O26+O27-O28,1),\" \")","v":" "},null,{"$f":"IF(Q28,ROUND(Q26+Q27-Q28,1),\" \")","v":" "},null,{"$f":"IF(S28,ROUND(S26+S27-S28,1),\" \")","v":" "},null,{"$f":"IF(U28,ROUND(U26+U27-U28,1),\" \")","v":" "}]
[null,"Max. Sp. Gr. Of Mix",null,null,null,null,{"$f":"IF(G26,ROUND(G26/G29,3),\" \")","v":" "},null,{"$f":"IF(I26,ROUND(I26/I29,3),\" \")","v":" "},null,{"$f":"IF(K26,ROUND(K26/K29,3),\" \")","v":" "},null,{"$f":"IF(M26,ROUND(M26/M29,3),\" \")","v":" "},null,{"$f":"IF(O26,ROUND(O26/O29,3),\" \")","v":" "},null,{"$f":"IF(Q26,ROUND(Q26/Q29,3),\" \")","v":" "},null,{"$f":"IF(S26,ROUND(S26/S29,3),\" \")","v":" "},null,{"$f":"IF(U26,ROUND(U26/U29,3),\" \")","v":" "}]
[null,null,null,null,null,null,{"$f":"IF(G28,ROUND(AVERAGE(G30:I30),3),\" \")","v":" "},null,null,null,{"$f":"IF(K28,ROUND(AVERAGE(K30:M30),3),\" \")","v":" "},null,null,null,{"$f":"IF(O28,ROUND(AVERAGE(O30:Q30),3),\" \")","v":" "},null,null,null,{"$f":"IF(S28,ROUND(AVERAGE(S30:U30),3),\" \")","v":" "}]
[]
[null,null,null,null,null,null,null,null,null,{"$f":"Setup!$F$20&\" Method of Testing\"","v":" Method of Testing"}]
[]
[null,null,null,null,"Select Gmm to be used in AC Trials",null,null,null,null,null,null,null,"Calculated Gmm"]

{"sheet":"AC Trials","index":11,"n_rows":278,"n_cols":46,"rows_kept":278,"cut":false,"hidden":false,"merged":[[7,1,7,2],[28,1,28,2],[3,15,3,18],[36,1,36,2],[36,3,36,4],[36,5,36,8],[36,9,36,10],[36,11,36,12],[36,13,36,14],[36,15,36,16],[36,17,36,18],[12,1,12,2],[12,3,12,4],[12,5,12,8],[12,9,12,10],[12,11,12,12],[12,13,12,14],[12,15,12,16],[12,17,12,18],[7,15,7,22],[10,5,10,8],[10,9,10,10],[18,5,18,8],[18,9,18,10],[18,11,18,12],[51,0,51,25],[49,3,49,6],[48,3,48,6],[47,3,47,6],[46,3,46,6],[45,3,45,6],[44,3,44,6],[43,3,43,6],[42,3,42,6],[49,19,49,22],[48,19,48,22],[44,19,44,22],[43,19,43,22],[42,19,42,22],[49,16,49,18],[48,16,48,18],[47,16,47,18],[46,16,46,18],[45,16,45,18],[44,16,44,18],[43,16,43,18],[42,16,42,18],[45,20,45,21],[49,7,49,9],[48,7,48,9],[47,7,47,9],[46,7,46,9],[45,7,45,9],[44,7,44,9],[43,7,43,9],[42,7,42,9],[12,19,12,20],[36,19,36,20],[20,5,20,8],[20,9,20,10],[20,11,20,12],[20,13,20,14],[20,15,20,16],[20,17,20,18],[20,19,20,20],[23,3,23,10],[23,11,23,14],[31,3,31,10],[31,12,31,14],[43,10,43,12],[43,13,43,15],[44,13,44,15],[45,13,45,15],[46,13,46,15],[47,13,47,15],[42,10,42,12],[41,10,41,12],[46,21,46,22],[47,21,47,22],[48,13,48,15],[49,13,49,15],[49,10,49,12],[48,10,48,12],[47,10,47,12],[46,10,46,12],[45,10,45,12],[44,10,44,12],[40,10,40,12],[40,7,40,9],[40,3,40,6],[39,3,39,18],[41,16,41,18],[41,13,41,15],[42,13,42,15],[40,13,40,15],[24,17,25,18],[27,15,27,16],[27,17,27,18],[41,3,41,6],[26,13,26,14],[26,11,26,12],[26,3,26,4],[26,5,26,8],[28,3,28,4],[28,5,28,8],[28,9,28,10],[28,11,28,12],[28,13,28,14],[41,7,41,9],[28,15,28,16],[28,17,28,18],[12,21,12,22],[8,13,9,14],[8,15,9,16],[8,17,9,18],[8,19,9,20],[8,21,9,22],[20,21,20,22],[10,13,10,14],[18,13,18,14],[18,15,18,16],[18,17,18,18],[18,19,18,20],[18,21,18,22],[28,19,28,20],[28,21,28,22],[28,23,28,24],[36,21,36,22],[36,23,36,24],[24,21,25,22],[21,19,21,20],[27,19,27,20],[27,23,27,24],[21,21,21,22],[21,23,21,24],[34,23,34,24],[40,19,40,22],[41,19,41,22],[40,16,40,18],[39,19,39,22],[29,19,29,20],[29,21,29,22],[32,15,33,16],[32,17,33,18],[32,19,33,20],[32,21,33,22],[37,19,37,20],[37,21,37,22],[0,1,0,2],[3,2,3,4],[3,5,3,8],[3,9,3,14],[3,19,3,21],[3,22,3,23],[5,22,5,23],[4,2,4,4],[4,5,4,8],[4,9,4,14],[4,15,4,17],[4,20,4,21],[4,22,4,23],[5,2,5,4],[5,5,5,7],[5,9,5,14],[5,15,5,17],[5,19,5,21],[2,7,2,17],[7,23,7,24],[7,3,7,10],[7,11,7,14],[8,1,9,2],[8,3,9,4],[8,5,9,8],[16,1,17,2],[16,3,17,4],[16,5,17,8],[16,13,17,14],[15,1,15,2],[15,15,15,22],[11,19,11,20],[11,21,11,22],[11,1,11,2],[11,3,11,4],[11,5,11,8],[11,13,11,14],[10,15,10,16],[10,17,10,18],[10,19,10,20],[10,21,10,22],[10,1,10,2],[10,3,10,4],[8,23,9,24],[8,9,9,10],[11,23,11,24],[10,23,10,24],[12,23,12,24],[13,23,13,24],[16,23,17,24],[11,9,11,10],[8,11,9,12],[10,11,10,12],[11,11,11,12],[16,9,17,10],[16,11,17,12],[13,19,13,20],[13,21,13,22],[15,23,15,24],[15,3,15,10],[15,11,15,14],[16,17,17,18],[16,19,17,20],[16,21,17,22],[16,15,17,16],[11,15,11,16],[11,17,11,18],[23,1,23,2],[23,15,23,22],[23,23,23,24],[24,9,25,10],[24,11,25,12],[19,23,19,24],[19,1,19,2],[19,3,19,4],[19,5,19,8],[19,13,19,14],[19,9,19,10],[19,11,19,12],[20,23,20,24],[19,15,19,16],[19,17,19,18],[19,19,19,20],[19,21,19,22],[20,1,20,2],[20,3,20,4],[18,23,18,24],[18,1,18,2],[18,3,18,4],[27,21,27,22],[24,15,25,16],[24,23,25,24],[24,1,25,2],[24,3,25,4],[24,5,25,8],[24,13,25,14],[26,15,26,16],[26,17,26,18],[26,19,26,20],[26,21,26,22],[26,23,26,24],[26,1,26,2],[24,19,25,20],[27,1,27,2],[27,3,27,4],[27,5,27,8],[27,13,27,14],[27,11,27,12],[27,9,27,10],[26,9,26,10],[34,1,34,2],[34,3,34,4],[34,5,34,8],[34,13,34,14],[34,9,34,10],[34,11,34,12],[29,23,29,24],[31,1,31,2],[31,15,31,22],[31,23,31,24],[32,11,33,12],[34,15,34,16],[34,17,34,18],[34,19,34,20],[34,21,34,22],[32,23,33,24],[32,1,33,2],[32,3,33,4],[32,5,33,8],[32,13,33,14],[32,9,33,10],[37,23,37,24],[35,15,35,16],[35,17,35,18],[35,19,35,20],[35,21,35,22],[35,23,35,24],[35,1,35,2],[35,3,35,4],[35,5,35,8],[35,13,35,14],[35,9,35,10],[35,11,35,12]]}
[null,{"$f":"Setup!A2","v":"ESB-21"},null,null,null,null,null,null,null,null,null,null,null,null,null,null,null,null,null,null,null,null,null,null,null,null,null,null,null,null,null,null,{"$f":"Setup!F25","v":0},null,{"$f":"Setup!F24","v":0}]
[null,null,null,null,null,null,null,null,null,null,null,null,null,null,null,null,null,null,null,null,null,null,null,null,null,null,null,null,null,null,null,null,{"$f":"'Gmm2'!M35","v":"Calculated Gmm"}]
[null,null,null,null,null,null,null,"Varying Asphalt Content For Trial Blend",null,null,null,null,null,null,null,null,null,null,{"$f":"'Trial Blends'!N42","v":0},null,null,null,null,null,null,null,null,null,null,null,null,null,{"$f":"'Trial Blends'!N42","v":0}]
[null,null,"Producer;",null,null,{"$f":"Setup!E7","v":0},null,null,null,"Material Class:",null,null,null,null,null,{"$f":"Setup!E11","v":0},null,null,null,"JMF",null,null,{"$f":"Setup!E5","v":0},null,null,null,null,null,null,null,null,null,{"$f":"IF(AG3=1,'Agg Blends'!L36,IF(AG3=2,'Agg Blends'!M36,IF(AG3=3,'Agg Blends'!N36)))","v":false}]
[null,null,"Designed By:",null,null,{"$f":"Setup!E9","v":0},null,null,null,"Esals:",null,null,null,null,null,{"$f":"Setup!E13","v":0},null,null,null,null,"SRL:",null,{"$f":"Setup!E12","v":0},null,null,null,null,null,null,null,null,null,{"$f":"100-B8","v":100.5},"%Agg AC1"]
[null,null,"Date:",null,null,{"$f":"Setup!E6","v":"00:00:00"},null,null,null,"Rap:",null,null,null,null,null,{"$f":"Setup!E18","v":0},null,null,null,"PG Grade:",null,null,{"$f":"Setup!E15","v":0},null,null,null,null,null,null,null,null,null,{"$f":"100-B16","v":100},"%Agg AC2"]
[null,null,null,null,null,null,null,null,null,null,null,null,null,null,null,null,null,null,null,null,null,null,null,null,null,null,null,null,null,null,null,null,{"$f":"100-B24","v":99.5},"%Agg AC3"]
[null,{"$f":"'Gmm2'!K16","v":-0.5},null,"Asphalt Content",null,null,null,null,null,null,null,"Samp Ht.",null,null,null,"Maximum Theoretical Gravity (Gmm) =",null,null,null,null,null,null,null,{"$f":"IF($AG$2=\"Measured Gmm\",'Gmm2'!G31,'Gmm2'!M16)","v":""},null,null,null,null,null,null,null,null,{"$f":"100-B32","v":99},"%Agg AC4"]
[null,null,null,"Dry Weight",null,{"$f":"IF(Setup!$F$24=\"Suspension\",\"Mass Spec. in H2O\",\"Mass Pyc + Specimen + Water\")","v":"Mass Pyc + Specimen + Water"},null,null,null,"SSD Weight",null,"Height @ Nini",null,"Height @ Ndes",null,"Gmb",null,"% Gmm",null,"Voids",null,"VMA",null,"VFA"]
[null,null,null,null,null,{"$f":"IF(Setup!I17=\"Suspension\",\"Mass samp+Pyc in H2O\",\"Mass Pyc + Mix + Water\")","v":"Mass Pyc + Mix + Water"}]
[null,"Spec. 1",null,null,null,null,null,null,null,null,null,null,null,null,null,{"$f":"IF($AI$1=\"Suspension\",ROUND(D11/(J11-F11),3),IF($AI$1=\"Volumeter\",ROUND(D11/(J11-(F11-$AG$1)),3),\" \"))","v":" "},null,{"$f":"IF(J11,ROUND(P11/X8*100,1),\"\")","v":""},null,{"$f":"IF(J11,ROUND(100*(1-(P11/$X$8)),1),\"\")","v":""},null,{"$f":"IF(J11,ROUND(100-(P11/$AG$4)*$AG$5,1),\"\")","v":""},null,{"$f":"IF(J11,100*(V11-T11)/V11,\"\")","v":""}]
[null,"Spec. 2",null,null,null,null,null,null,null,null,null,null,null,null,null,{"$f":"IF($AI$1=\"Suspension\",ROUND(D12/(J12-F12),3),IF($AI$1=\"Volumeter\",ROUND(D12/(J12-(F12-$AG$1)),3),\" \"))","v":" "},null,{"$f":"IF(J12,ROUND(P12/X8*100,1),\"\")","v":""},null,{"$f":"IF(J12,ROUND(100*(1-(P12/$X$8)),1),\"\")","v":""},null,{"$f":"IF(J12,ROUND(100-(P12/$AG$4)*$AG$5,1),\"\")","v":""},null,{"$f":"IF(J12,100*(V12-T12)/V12,\"\")","v":""}]
[null,"Spec. 3",null,null,null,null,null,null,null,null,null,null,null,null,null,{"$f":"IF($AI$1=\"Suspension\",ROUND(D13/(J13-F13),3),IF($AI$1=\"Volumeter\",ROUND(D13/(J13-(F13-$AG$1)),3),\" \"))","v":" "},null,{"$f":"IF(J13,ROUND(P13/X8*100,1),\"\")","v":""},null,{"$f":"IF(J13,ROUND(100*(1-(P13/$X$8)),1),\"\")","v":""},null,{"$f":"IF(J13,ROUND(100-(P13/$AG$4)*$AG$5,1),\"\")","v":""},null,{"$f":"IF(J13,100*(V13-T13)/V13,\"\")","v":""}]
[null,null,null,null,null,null,null,null,null,null,null,null,null,null,null,null,null,null,null,{"$f":"IF(J11,ROUND(AVERAGE(T11:T13),2),\"\")","v":""},null,{"$f":"IF(J11,ROUND(AVERAGE(V11:V13),2),\"\")","v":""},null,{"$f":"IF(J11,ROUND(AVERAGE(X11:X13),2),\"\")","v":""}]
[]
[null,{"$f":"'Gmm2'!K17","v":0},null,"Asphalt Content",null,null,null,null,null,null,null,"Samp Ht.",null,null,null,"Maximum Theoretical Gravity (Gmm) =",null,null,null,null,null,null,null,{"$f":"IF($AG$2=\"Measured Gmm\",'Gmm2'!K31,'Gmm2'!M17)","v":""}]
[null,null,null,"Dry Weight",null,{"$f":"IF(Setup!$F$24=\"Suspension\",\"Mass Spec. in H2O\",\"Mass Pyc + Specimen + Water\")","v":"Mass Pyc + Specimen + Water"},null,null,null,"SSD Weight",null,"Height @ Nini",null,"Height @ Ndes",null,"Gmb",null,"% Gmm",null,"Voids",null,"VMA",null,"VFA"]
[null,null,null,null,null,{"$f":"IF(Setup!I23=\"Suspension\",\"Mass samp+Pyc in H2O\",\"Mass Pyc + Mix + Water\")","v":"Mass Pyc + Mix + Water"}]
[null,"Spec. 1",null,null,null,null,null,null,null,null,null,null,null,null,null,{"$f":"IF($AI$1=\"Suspension\",ROUND(D19/(J19-F19),3),IF($AI$1=\"Volumeter\",ROUND(D19/(J19-(F19-$AG$1)),3),\" \"))","v":" "},null,{"$f":"IF(J19,ROUND(P19/X16*100,1),\"\")","v":""},null,{"$f":"IF(J19,ROUND(100*(1-(P19/$X$16)),1),\"\")","v":""},null,{"$f":"IF(J19,ROUND(100-(P19/$AG$4)*$AG$6,1),\"\")","v":""},null,{"$f":"IF(J19,100*(V19-T19)/V19,\"\")","v":""}]
[null,"Spec. 2",null,null,null,null,null,null,null,null,null,null,null,null,null,{"$f":"IF($AI$1=\"Suspension\",ROUND(D20/(J20-F20),3),IF($AI$1=\"Volumeter\",ROUND(D20/(J20-(F20-$AG$1)),3),\" \"))","v":" "},null,{"$f":"IF(J20,ROUND(P20/X16*100,1),\"\")","v":""},null,{"$f":"IF(J20,ROUND(100*(1-(P20/$X$16)),1),\"\")","v":""},null,{"$f":"IF(J20,ROUND(100-(P20/$AG$4)*$AG$6,1),\"\")","v":""},null,{"$f":"IF(J20,100*(V20-T20)/V20,\"\")","v":""},null,null,null,null,null,null,null,null,{"$f":"AVERAGE(D19:E21)","v":{"$error":"#DIV/0!"}}]
[null,"Spec. 3",null,null,null,null,null,null,null,null,null,null,null,null,null,{"$f":"IF($AI$1=\"Suspension\",ROUND(D21/(J21-F21),3),IF($AI$1=\"Volumeter\",ROUND(D21/(J21-(F21-$AG$1)),3),\" \"))","v":" "},null,{"$f":"IF(J21,ROUND(P21/X16*100,1),\"\")","v":""},null,{"$f":"IF(J21,ROUND(100*(1-(P21/$X$16)),1),\"\")","v":""},null,{"$f":"IF(J21,ROUND(100-(P21/$AG$4)*$AG$6,1),\"\")","v":""},null,{"$f":"IF(J21,100*(V21-T21)/V21,\"\")","v":""}]
[null,null,null,null,null,null,null,null,null,null,null,null,null,null,null,null,null,null,null,{"$f":"IF(J19,ROUND(AVERAGE(T19:T21),2),\"\")","v":""},null,{"$f":"IF(J19,ROUND(AVERAGE(V19:V21),2),\"\")","v":""},null,{"$f":"IF(J19,ROUND(AVERAGE(X19:X21),2),\"\")","v":""}]
[]
[null,{"$f":"'Gmm2'!K18","v":0.5},null,"Asphalt Content",null,null,null,null,null,null,null,"Samp Ht.",null,null,null,"Maximum Theoretical Gravity (Gmm) =",null,null,null,null,null,null,null,{"$f":"IF($AG$2=\"Measured Gmm\",'Gmm2'!O31,'Gmm2'!M18)","v":""}]
[null,null,null,"Dry Weight",null,{"$f":"IF(Setup!$F$24=\"Suspension\",\"Mass Spec. in H2O\",\"Mass Pyc + Specimen + Water\")","v":"Mass Pyc + Specimen + Water"},null,null,null,"SSD Weight",null,"Height @ Nini",null,"Height @ Ndes",null,"Gmb",null,"% Gmm",null,"Voids",null,"VMA",null,"VFA"]
[null,null,null,null,null,{"$f":"IF(Setup!I30=\"Suspension\",\"Mass samp+Pyc in H2O\",\"Mass Pyc + Mix + Water\")","v":"Mass Pyc + Mix + Water"}]
[null,"Spec. 1",null,null,null,null,null,null,null,null,null,null,null,null,null,{"$f":"IF($AI$1=\"Suspension\",ROUND(D27/(J27-F27),3),IF($AI$1=\"Volumeter\",ROUND(D27/(J27-(F27-$AG$1)),3),\" \"))","v":" "},null,{"$f":"IF(J27,ROUND(P27/X24*100,1),\"\")","v":""},null,{"$f":"IF(J27,ROUND(100*(1-(P27/$X$24)),1),\"\")","v":""},null,{"$f":"IF(J27,ROUND(100-(P27/$AG$4)*$AG$7,1),\"\")","v":""},null,{"$f":"IF(J27,100*(V27-T27)/V27,\"\")","v":""}]
[null,"Spec. 2",null,null,null,null,null,null,null,null,null,null,null,null,null,{"$f":"IF($AI$1=\"Suspension\",ROUND(D28/(J28-F28),3),IF($AI$1=\"Volumeter\",ROUND(D28/(J28-(F28-$AG$1)),3),\" \"))","v":" "},null,{"$f":"IF(J28,ROUND(P28/X24*100,1),\"\")","v":""},null,{"$f":"IF(J28,ROUND(100*(1-(P28/$X$24)),1),\"\")","v":""},null,{"$f":"IF(J28,ROUND(100-(P28/$AG$4)*$AG$7,1),\"\")","v":""},null,{"$f":"IF(J28,100*(V28-T28)/V28,\"\")","v":""}]
[null,"Spec. 3",null,null,null,null,null,null,null,null,null,null,null,null,null,{"$f":"IF($AI$1=\"Suspension\",ROUND(D29/(J29-F29),3),IF($AI$1=\"Volumeter\",ROUND(D29/(J29-(F29-$AG$1)),3),\" \"))","v":" "},null,{"$f":"IF(J29,ROUND(P29/X24*100,1),\"\")","v":""},null,{"$f":"IF(J29,ROUND(100*(1-(P29/$X$24)),1),\"\")","v":""},null,{"$f":"IF(J29,ROUND(100-(P29/$AG$4)*$AG$7,1),\"\")","v":""},null,{"$f":"IF(J29,100*(V29-T29)/V29,\"\")","v":""}]
[null,null,null,null,null,null,null,null,null,null,null,null,null,null,null,null,null,null,null,{"$f":"IF(J27,ROUND(AVERAGE(T27:T29),2),\"\")","v":""},null,{"$f":"IF(J27,ROUND(AVERAGE(V27:V29),2),\"\")","v":""},null,{"$f":"IF(J27,ROUND(AVERAGE(X27:X29),2),\"\")","v":""}]
[]
[null,{"$f":"'Gmm2'!K19","v":1},null,"Asphalt Content",null,null,null,null,null,null,null,null,"Samp Ht.",null,null,"Maximum Theoretical Gravity (Gmm) =",null,null,null,null,null,null,null,{"$f":"IF($AG$2=\"Measured Gmm\",'Gmm2'!S31,'Gmm2'!M19)","v":""}]
[null,null,null,"Dry Weight",null,{"$f":"IF(Setup!$F$24=\"Suspension\",\"Mass Spec. in H2O\",\"Mass Pyc + Specimen + Water\")","v":"Mass Pyc + Specimen + Water"},null,null,null,"SSD Weight",null,"Height @ Nini",null,"Height @ Ndes",null,"Gmb",null,"% Gmm",null,"Voids",null,"VMA",null,"VFA"]
[null,null,null,null,null,{"$f":"IF(Setup!I36=\"Suspension\",\"Mass samp+Pyc in H2O\",\"Mass Pyc + Mix + Water\")","v":"Mass Pyc + Mix + Water"}]
[null,"Spec. 1",null,null,null,null,null,null,null,null,null,null,null,null,null,{"$f":"IF($AI$1=\"Suspension\",ROUND(D35/(J35-F35),3),IF($AI$1=\"Volumeter\",ROUND(D35/(J35-(F35-$AG$1)),3),\" \"))","v":" "},null,{"$f":"IF(J35,ROUND(P35/X32*100,1),\"\")","v":""},null,{"$f":"IF(J35,ROUND(100*(1-(P35/$X$32)),1),\"\")","v":""},null,{"$f":"IF(J35,ROUND(100-(P35/$AG$4)*$AG$8,1),\"\")","v":""},null,{"$f":"IF(J35,100*(V35-T35)/V35,\"\")","v":""}]
[null,"Spec. 2",null,null,null,null,null,null,null,null,null,null,null,null,null,{"$f":"IF($AI$1=\"Suspension\",ROUND(D36/(J36-F36),3),IF($AI$1=\"Volumeter\",ROUND(D36/(J36-(F36-$AG$1)),3),\" \"))","v":" "},null,{"$f":"IF(J36,ROUND(P36/X32*100,1),\"\")","v":""},null,{"$f":"IF(J36,ROUND(100*(1-(P36/$X$32)),1),\"\")","v":""},null,{"$f":"IF(J36,ROUND(100-(P36/$AG$4)*$AG$8,1),\"\")","v":""},null,{"$f":"IF(J36,100*(V36-T36)/V36,\"\")","v":""}]
[null,"Spec. 3",null,null,null,null,null,null,null,null,null,null,null,null,null,{"$f":"IF($AI$1=\"Suspension\",ROUND(D37/(J37-F37),3),IF($AI$1=\"Volumeter\",ROUND(D37/(J37-(F37-$AG$1)),3),\" \"))","v":" "},null,{"$f":"IF(J37,ROUND(P37/X32*100,1),\"\")","v":""},null,{"$f":"IF(J37,ROUND(100*(1-(P37/$X$32)),1),\"\")","v":""},null,{"$f":"IF(J37,ROUND(100-(P37/$AG$4)*$AG$8,1),\"\")","v":""},null,{"$f":"IF(J37,100*(V37-T37)/V37,\"\")","v":""}]
[null,null,null,null,null,null,null,null,null,null,null,null,null,null,null,null,null,null,null,{"$f":"IF(J35,ROUND(AVERAGE(T35:T37),2),\"\")","v":""},null,{"$f":"IF(J35,ROUND(AVERAGE(V35:V37),2),\"\")","v":""},null,{"$f":"IF(J35,ROUND(AVERAGE(X35:X37),2),\"\")","v":""}]
[]
[null,null,null,"Varrying AC Results",null,null,null,null,null,null,null,null,null,null,null,null,null,null,null,"Specifications",null,null,null,null,null,null,null,null,null,null,null,null,null,null,null,null,null,{"$f":"P4","v":0}]
[null,null,null,"AC Content",null,null,null,{"$f":"B8","v":-0.5},null,null,{"$f":"B16","v":0},null,null,{"$f":"B24","v":0.5},null,null,{"$f":"B32","v":1},null,null,null,null,null,null,null,null,null,null,null,null,null,null,null,null,null,null,null,null,{"$f":"P5","v":0},null,"SP37.5","<.3",64,78,"11.5 Min",91.5,8.5]
[null,null,null,"Gmm",null,null,null,{"$f":"X8","v":""},null,null,{"$f":"X16","v":""},null,null,{"$f":"X24","v":""},null,null,{"$f":"X32","v":""},null,null,null,null,null,null,null,null,null,null,null,null,null,null,null,null,null,null,null,null,null,null,"SP37.5",".3 to <3",64,78,"11.5 Min",90.5,9.5]
[null,null,null,"Gmb@Ndes",null,null,null,{"$f":"IF(J12,(AVERAGE(P11:Q12)),\"\")","v":""},null,null,{"$f":"IF(J20,(AVERAGE(P19:Q20)),\"\")","v":""},null,null,{"$f":"IF(J28,(AVERAGE(P27:Q28)),\"\")","v":""},null,null,{"$f":"IF(J36,(AVERAGE(P35:Q36)),\"\")","v":""},null,null,null,null,null,null,null,null,null,null,null,null,null,null,null,null,null,null,null,null,{"$f":"INDEX($AR$41:$AR$278,MATCH(1,(AL40=$AN$41:$AN$278)*(AL41=AO41:AO278),0))","v":{"$error":"#N/A"}},null,"SP37.5","3 to <10",64,75,"11.5 Min",89,11]
[null,null,null,"Voids",null,null,null,{"$f":"T14","v":""},null,null,{"$f":"T22","v":""},null,null,{"$f":"T30","v":""},null,null,{"$f":"T38","v":""},null,null,{"$f":"IF(OR(Setup!$E$11=\"SMA95\",Setup!$E$11=\"SMA125\",Setup!$E$11=\"SP6.33\",Setup!$E$11=\"WM6.33\"),\"3.5 - 4.0\",4)","v":4},null,null,null,null,null,null,null,null,null,null,null,null,null,null,null,null,null,{"$f":"INDEX($AP$41:$AP$278,MATCH(1,(AL40=$AN$41:$AN$278)*($AL$41=$AO$41:$AO$278),0))","v":{"$error":"#N/A"}},null,"SP37.5","10 to <30",64,75,"11.5 Min",89,11]
[null,null,null,"VMA",null,null,null,{"$f":"V14","v":""},null,null,{"$f":"V22","v":""},null,null,{"$f":"V30","v":""},null,null,{"$f":"V38","v":""},null,null,{"$f":"AL43","v":{"$error":"#N/A"}},null,null,null,null,null,null,null,null,null,null,null,null,null,null,null,null,null,{"$f":"INDEX($AQ$41:$AQ$278,MATCH(1,(AL40=$AN$41:$AN$278)*($AL$41=$AO$41:$AO$278),0))","v":{"$error":"#N/A"}},null,"SP37.5","3 to <30",64,75,"11.5 Min",89,11]
[null,null,null,"VFA",null,null,null,{"$f":"X14","v":""},null,null,{"$f":"X22","v":""},null,null,{"$f":"X30","v":""},null,null,{"$f":"X38","v":""},null,null,{"$f":"AL44","v":{"$error":"#N/A"}},"-",null,{"$f":"AL45","v":{"$error":"#N/A"}},null,null,null,null,null,null,null,null,null,null,null,null,null,null,{"$f":"INDEX($AS$41:$AS$278,MATCH(1,(AL40=$AN$41:$AN$278)*($AL$41=$AO$41:$AO$278),0))","v":{"$error":"#N/A"}},null,"SP37.5",">30",64,75,"11.5 Min",89,11]
[null,null,null,"%Gmm@Nini",null,null,null,{"$f":"IF(J12,H43*((AVERAGE(N11:O12)/AVERAGE(L11:M12))/X8)*100,\"\")","v":""},null,null,{"$f":"IF(J20,K43*((AVERAGE(N19:O20)/AVERAGE(L19:M20))/X16)*100,\"\")","v":""},null,null,{"$f":"IF(J28,N43*((AVERAGE(N27:O28)/AVERAGE(L27:M28))/X24)*100,\"\")","v":""},null,null,{"$f":"IF(J28,Q43*((AVERAGE(N35:O36)/AVERAGE(L35:M36))/X32)*100,\"\")","v":""},null,null,null,"<",{"$f":"AL46","v":{"$error":"#N/A"}},null,null,null,null,null,null,null,null,null,null,null,null,null,null,null,{"$f":"INDEX($AT$41:$AT$278,MATCH(1,(AL40=$AN$41:$AN$278)*($AL$41=$AO$41:$AO$278),0))","v":{"$error":"#N/A"}},null,"SR37.5","<.3",64,78,"11.5 Min",91.5,8.5]
[null,null,null,"Voids@Nini",null,null,null,{"$f":"IF(J12,100-H47,\"\")","v":""},null,null,{"$f":"IF(J20,100-K47,\"\")","v":""},null,null,{"$f":"IF(J28,100-N47,\"\")","v":""},null,null,{"$f":"IF(J36,100-Q47,\"\")","v":""},null,null,null,">",{"$f":"AL47","v":{"$error":"#N/A"}},null,null,null,null,null,null,null,null,null,null,null,null,null,null,null,null,null,"SR37.5",".3 to <3",64,78,"11.5 Min",90.5,9.5]
[null,null,null,"Effective AC",null,null,null,{"$f":"IF(J12,IF($AG$2=\"Measured\",'Gmm2'!AG28,'Gmm2'!AG23),\"\")","v":""},null,null,{"$f":"IF(J20,IF($AG$2=\"Measured\",'Gmm2'!AH28,'Gmm2'!AH23),\"\")","v":""},null,null,{"$f":"IF(J28,IF($AG$2=\"Measured\",'Gmm2'!AI28,'Gmm2'!AI23),\"\")","v":""},null,null,{"$f":"IF(J36,IF($AG$2=\"Measured\",'Gmm2'!AJ28,'Gmm2'!AJ23),\"\")","v":""},null,null,null,null,null,null,null,null,null,null,null,null,null,null,null,null,null,null,null,null,null,null,"SR37.5","3 to <10",64,75,"11.5 Min",89,11]
[null,null,null,"Dust / Binder",null,null,null,{"$f":"IF(J12,ROUND('Design Agg'!$B$34/H49,1),\"\")","v":""},null,null,{"$f":"IF(J20,ROUND('Design Agg'!$B$34/K49,1),\"\")","v":""},null,null,{"$f":"IF(J28,ROUND('Design Agg'!$B$34/N49,1),\"\")","v":""},null,null,{"$f":"IF(J36,ROUND('Design Agg'!$B$34/Q49,1),\"\")","v":""},null,null,{"$f":"IF(OR(Setup!$E$11=\"SMA95\",Setup!$E$11=\"SMA125\"),\"NA\",\"0.6 - 1.2\")","v":"0.6 - 1.2"},null,null,null,null,null,null,null,null,null,null,null,null,null,null,null,null,null,null,null,"SR37.5","10 to <30",64,75,"11.5 Min",89,11]
[null,null,null,null,null,null,null,null,null,null,null,null,null,null,null,null,null,null,null,null,null,null,null,null,null,null,null,null,null,null,null,null,null,null,null,null,null,null,null,"SR37.5","3 to <30",64,75,"11.5 Min",89,11]
[{"$f":"Setup!$F$24&\" Method of Testing\"","v":" Method of Testing"},null,null,null,null,null,null,null,null,null,null,null,null,null,null,null,null,null,null,null,null,null,null,null,null,null,null,null,null,null,null,null,null,null,null,null,null,null,null,"SR37.5",">30",64,75,"11.5 Min",89,11]
[null,null,null,null,null,null,null,null,null,null,null,null,null,null,null,null,null,null,null,null,null,null,null,null,null,null,null,null,null,null,null,null,null,null,null,null,null,null,null,"SP25B","<.3",66,78,"12.5 Min",91.5,8.5]
[null,null,null,null,null,null,null,null,null,null,null,null,null,null,null,null,null,null,null,null,null,null,null,null,null,null,null,null,null,null,null,null,null,null,null,null,null,null,null,"SP25B",".3 to <3",66,78,"12.5 Min",90.5,9.5]
[null,null,null,null,null,null,null,null,null,null,null,null,null,null,null,null,null,null,null,null,null,null,null,null,null,null,null,null,null,null,null,null,null,null,null,null,null,null,null,"SP25B","3 to <10",66,75,"12.5 Min",89,11]
[null,null,null,null,null,null,null,null,null,null,null,null,null,null,null,null,null,null,null,null,null,null,null,null,null,null,null,null,null,null,null,null,null,null,null,null,null,null,null,"SP25B","10 to <30",66,75,"12.5 Min",89,11]
[null,null,null,null,null,null,null,null,null,null,null,null,null,null,null,null,null,null,null,null,null,null,null,null,null,null,null,null,null,null,null,null,null,null,null,null,null,null,null,"SP25B","3 to <30",66,75,"12.5 Min",89,11]
[null,null,null,null,null,null,null,null,null,null,null,null,null,null,null,null,null,null,null,null,null,null,null,null,null,null,null,null,null,null,null,null,null,null,null,null,null,null,null,"SP25B",">30",66,75,"12.5 Min",89,11]
[null,null,null,null,null,null,null,null,null,null,null,null,null,null,null,null,null,null,null,null,null,null,null,null,null,null,null,null,null,null,null,null,null,null,null,null,null,null,null,"SR25B","<.3",66,78,"12.5 Min",91.5,8.5]
[null,null,null,null,null,null,null,null,null,null,null,null,null,null,null,null,null,null,null,null,null,null,null,null,null,null,null,null,null,null,null,null,null,null,null,null,null,null,null,"SR25B",".3 to <3",66,78,"12.5 Min",90.5,9.5]
[null,null,null,null,null,null,null,null,null,null,null,null,null,null,null,null,null,null,null,null,null,null,null,null,null,null,null,null,null,null,null,null,null,null,null,null,null,null,null,"SR25B","3 to <10",66,75,"12.5 Min",89,11]
[null,null,null,null,null,null,null,null,null,null,null,null,null,null,null,null,null,null,null,null,null,null,null,null,null,null,null,null,null,null,null,null,null,null,null,null,null,null,null,"SR25B","10 to <30",66,75,"12.5 Min",89,11]
[null,null,null,null,null,null,null,null,null,null,null,null,null,null,null,null,null,null,null,null,null,null,null,null,null,null,null,null,null,null,null,null,null,null,null,null,null,null,null,"SR25B","3 to <30",66,75,"12.5 Min",89,11]
[null,null,null,null,null,null,null,null,null,null,null,null,null,null,null,null,null,null,null,null,null,null,null,null,null,null,null,null,null,null,null,null,null,null,null,null,null,null,null,"SR25B",">30",66,75,"12.5 Min",89,11]
[null,null,null,null,null,null,null,null,null,null,null,null,null,null,null,null,null,null,null,null,null,null,null,null,null,null,null,null,null,null,null,null,null,null,null,null,null,null,null,"SP19W","<.3",69,78,"13.5 Min",91.5,8.5]
[null,null,null,null,null,null,null,null,null,null,null,null,null,null,null,null,null,null,null,null,null,null,null,null,null,null,null,null,null,null,null,null,null,null,null,null,null,null,null,"SP19W",".3 to <3",69,78,"13.5 Min",90.5,9.5]
[null,null,null,null,null,null,null,null,null,null,null,null,null,null,null,null,null,null,null,null,null,null,null,null,null,null,null,null,null,null,null,null,null,null,null,null,null,null,null,"SP19W","3 to <10",69,75,"13.5 Min",89,11]
[null,null,null,null,null,null,null,null,null,null,null,null,null,null,null,null,null,null,null,null,null,null,null,null,null,null,null,null,null,null,null,null,null,null,null,null,null,null,null,"SP19W","10 to <30",69,75,"13.5 Min",89,11]
[null,null,null,null,null,null,null,null,null,null,null,null,null,null,null,null,null,null,null,null,null,null,null,null,null,null,null,null,null,null,null,null,null,null,null,null,null,null,null,"SP19W","3 to <30",69,75,"13.5 Min",89,11]
[null,null,null,null,null,null,null,null,null,null,null,null,null,null,null,null,null,null,null,null,null,null,null,null,null,null,null,null,null,null,null,null,null,null,null,null,null,null,null,"SP19W",">30",69,75,"13.5 Min",89,11]
[null,null,null,null,null,null,null,null,null,null,null,null,null,null,null,null,null,null,null,null,null,null,null,null,null,null,null,null,null,null,null,null,null,null,null,null,null,null,null,"SR19W","<.3",69,78,"13.5 Min",91.5,8.5]
[null,null,null,null,null,null,null,null,null,null,null,null,null,null,null,null,null,null,null,null,null,null,null,null,null,null,null,null,null,null,null,null,null,null,null,null,null,null,null,"SR19W",".3 to <3",69,78,"13.5 Min",90.5,9.5]
[null,null,null,null,null,null,null,null,null,null,null,null,null,null,null,null,null,null,null,null,null,null,null,null,null,null,null,null,null,null,null,null,null,null,null,null,null,null,null,"SR19W","3 to <10",69,75,"13.5 Min",89,11]
[null,null,null,null,null,null,null,null,null,null,null,null,null,null,null,null,null,null,null,null,null,null,null,null,null,null,null,null,null,null,null,null,null,null,null,null,null,null,null,"SR19W","10 to <30",69,75,"13.5 Min",89,11]
[null,null,null,null,null,null,null,null,null,null,null,null,null,null,null,null,null,null,null,null,null,null,null,null,null,null,null,null,null,null,null,null,null,null,null,null,null,null,null,"SR19W","3 to <30",69,75,"13.5 Min",89,11]
[null,null,null,null,null,null,null,null,null,null,null,null,null,null,null,null,null,null,null,null,null,null,null,null,null,null,null,null,null,null,null,null,null,null,null,null,null,null,null,"SR19W",">30",69,75,"13.5 Min",89,11]
[null,null,null,null,null,null,null,null,null,null,null,null,null,null,null,null,null,null,null,null,null,null,null,null,null,null,null,null,null,null,null,null,null,null,null,null,null,null,null,"SP12.5","<.3",71,78,"14.5 Min",91.5,8.5]
[null,null,null,null,null,null,null,null,null,null,null,null,null,null,null,null,null,null,null,null,null,null,null,null,null,null,null,null,null,null,null,null,null,null,null,null,null,null,null,"SP12.5",".3 to <3",71,78,"14.5 Min",90.5,9.5]
[null,null,null,null,null,null,null,null,null,null,null,null,null,null,null,null,null,null,null,null,null,null,null,null,null,null,null,null,null,null,null,null,null,null,null,null,null,null,null,"SP12.5","3 to <10",71,75,"14.5 Min",89,11]
[null,null,null,null,null,null,null,null,null,null,null,null,null,null,null,null,null,null,null,null,null,null,null,null,null,null,null,null,null,null,null,null,null,null,null,null,null,null,null,"SP12.5","10 to <30",71,75,"14.5 Min",89,11]
[null,null,null,null,null,null,null,null,null,null,null,null,null,null,null,null,null,null,null,null,null,null,null,null,null,null,null,null,null,null,null,null,null,null,null,null,null,null,null,"SP12.5","3 to <30",71,75,"14.5 Min",89,11]
[null,null,null,null,null,null,null,null,null,null,null,null,null,null,null,null,null,null,null,null,null,null,null,null,null,null,null,null,null,null,null,null,null,null,null,null,null,null,null,"SP12.5",">30",71,75,"14.5 Min",89,11]
[null,null,null,null,null,null,null,null,null,null,null,null,null,null,null,null,null,null,null,null,null,null,null,null,null,null,null,null,null,null,null,null,null,null,null,null,null,null,null,"SR12.5","<.3",71,78,"14.5 Min",91.5,8.5]
[null,null,null,null,null,null,null,null,null,null,null,null,null,null,null,null,null,null,null,null,null,null,null,null,null,null,null,null,null,null,null,null,null,null,null,null,null,null,null,"SR12.5",".3 to <3",71,78,"14.5 Min",90.5,9.5]
[null,null,null,null,null,null,null,null,null,null,null,null,null,null,null,null,null,null,null,null,null,null,null,null,null,null,null,null,null,null,null,null,null,null,null,null,null,null,null,"SR12.5","3 to <10",71,75,"14.5 Min",89,11]
[null,null,null,null,null,null,null,null,null,null,null,null,null,null,null,null,null,null,null,null,null,null,null,null,null,null,null,null,null,null,null,null,null,null,null,null,null,null,null,"SR12.5","10 to <30",71,75,"14.5 Min",89,11]
[null,null,null,null,null,null,null,null,null,null,null,null,null,null,null,null,null,null,null,null,null,null,null,null,null,null,null,null,null,null,null,null,null,null,null,null,null,null,null,"SR12.5","3 to <30",71,75,"14.5 Min",89,11]
[null,null,null,null,null,null,null,null,null,null,null,null,null,null,null,null,null,null,null,null,null,null,null,null,null,null,null,null,null,null,null,null,null,null,null,null,null,null,null,"SR12.5",">30",71,75,"14.5 Min",89,11]
[null,null,null,null,null,null,null,null,null,null,null,null,null,null,null,null,null,null,null,null,null,null,null,null,null,null,null,null,null,null,null,null,null,null,null,null,null,null,null,"SP9.5","<.3",70,78,"15.5 Min",91.5,8.5]
[null,null,null,null,null,null,null,null,null,null,null,null,null,null,null,null,null,null,null,null,null,null,null,null,null,null,null,null,null,null,null,null,null,null,null,null,null,null,null,"SP9.5",".3 to <3",65,78,"15.5 Min",90.5,9.5]
[null,null,null,null,null,null,null,null,null,null,null,null,null,null,null,null,null,null,null,null,null,null,null,null,null,null,null,null,null,null,null,null,null,null,null,null,null,null,null,"SP9.5","3 to <10",73,76,"15.5 Min",89,11]
[null,null,null,null,null,null,null,null,null,null,null,null,null,null,null,null,null,null,null,null,null,null,null,null,null,null,null,null,null,null,null,null,null,null,null,null,null,null,null,"SP9.5","10 to <30",73,76,"15.5 Min",89,11]
[null,null,null,null,null,null,null,null,null,null,null,null,null,null,null,null,null,null,null,null,null,null,null,null,null,null,null,null,null,null,null,null,null,null,null,null,null,null,null,"SP9.5","3 to <30",73,76,"15.5 Min",89,11]
[null,null,null,null,null,null,null,null,null,null,null,null,null,null,null,null,null,null,null,null,null,null,null,null,null,null,null,null,null,null,null,null,null,null,null,null,null,null,null,"SP9.5",">30",73,76,"15.5 Min",89,11]
[null,null,null,null,null,null,null,null,null,null,null,null,null,null,null,null,null,null,null,null,null,null,null,null,null,null,null,null,null,null,null,null,null,null,null,null,null,null,null,"SR9.5","<.3",70,78,"15.5 Min",91.5,8.5]
[null,null,null,null,null,null,null,null,null,null,null,null,null,null,null,null,null,null,null,null,null,null,null,null,null,null,null,null,null,null,null,null,null,null,null,null,null,null,null,"SR9.5",".3 to <3",65,78,"15.5 Min",90.5,9.5]
[null,null,null,null,null,null,null,null,null,null,null,null,null,null,null,null,null,null,null,null,null,null,null,null,null,null,null,null,null,null,null,null,null,null,null,null,null,null,null,"SR9.5","3 to <10",73,76,"15.5 Min",89,11]
[null,null,null,null,null,null,null,null,null,null,null,null,null,null,null,null,null,null,null,null,null,null,null,null,null,null,null,null,null,null,null,null,null,null,null,null,null,null,null,"SR9.5","10 to <30",73,76,"15.5 Min",89,11]
[null,null,null,null,null,null,null,null,null,null,null,null,null,null,null,null,null,null,null,null,null,null,null,null,null,null,null,null,null,null,null,null,null,null,null,null,null,null,null,"SR9.5","3 to <30",73,76,"15.5 Min",89,11]
[null,null,null,null,null,null,null,null,null,null,null,null,null,null,null,null,null,null,null,null,null,null,null,null,null,null,null,null,null,null,null,null,null,null,null,null,null,null,null,"SR9.5",">30",73,76,"15.5 Min",89,11]
[null,null,null,null,null,null,null,null,null,null,null,null,null,null,null,null,null,null,null,null,null,null,null,null,null,null,null,null,null,null,null,null,null,null,null,null,null,null,null,"SP4.75","<.3",70,78,"16.0 Min",91.5,8.5]
[null,null,null,null,null,null,null,null,null,null,null,null,null,null,null,null,null,null,null,null,null,null,null,null,null,null,null,null,null,null,null,null,null,null,null,null,null,null,null,"SP4.75",".3 to <3",65,78,"16.0 Min",90.5,9.5]
[null,null,null,null,null,null,null,null,null,null,null,null,null,null,null,null,null,null,null,null,null,null,null,null,null,null,null,null,null,null,null,null,null,null,null,null,null,null,null,"SP4.75","3 to <10",75,78,"16.0 Min",89,11]
[null,null,null,null,null,null,null,null,null,null,null,null,null,null,null,null,null,null,null,null,null,null,null,null,null,null,null,null,null,null,null,null,null,null,null,null,null,null,null,"SP4.75","10 to <30",75,78,"16.0 Min",89,11]
[null,null,null,null,null,null,null,null,null,null,null,null,null,null,null,null,null,null,null,null,null,null,null,null,null,null,null,null,null,null,null,null,null,null,null,null,null,null,null,"SP4.75","3 to <30",75,78,"16.0 Min",89,11]
[null,null,null,null,null,null,null,null,null,null,null,null,null,null,null,null,null,null,null,null,null,null,null,null,null,null,null,null,null,null,null,null,null,null,null,null,null,null,null,"SP4.75",">30",75,78,"16.0 Min",89,11]
[null,null,null,null,null,null,null,null,null,null,null,null,null,null,null,null,null,null,null,null,null,null,null,null,null,null,null,null,null,null,null,null,null,null,null,null,null,null,null,"SR4.75","<.3",70,78,"16.0 Min",91.5,8.5]
[null,null,null,null,null,null,null,null,null,null,null,null,null,null,null,null,null,null,null,null,null,null,null,null,null,null,null,null,null,null,null,null,null,null,null,null,null,null,null,"SR4.75",".3 to <3",65,78,"16.0 Min",90.5,9.5]
[null,null,null,null,null,null,null,null,null,null,null,null,null,null,null,null,null,null,null,null,null,null,null,null,null,null,null,null,null,null,null,null,null,null,null,null,null,null,null,"SR4.75","3 to <10",75,78,"16.0 Min",89,11]
[null,null,null,null,null,null,null,null,null,null,null,null,null,null,null,null,null,null,null,null,null,null,null,null,null,null,null,null,null,null,null,null,null,null,null,null,null,null,null,"SR4.75","10 to <30",75,78,"16.0 Min",89,11]
[null,null,null,null,null,null,null,null,null,null,null,null,null,null,null,null,null,null,null,null,null,null,null,null,null,null,null,null,null,null,null,null,null,null,null,null,null,null,null,"SR4.75","3 to <30",75,78,"16.0 Min",89,11]
[null,null,null,null,null,null,null,null,null,null,null,null,null,null,null,null,null,null,null,null,null,null,null,null,null,null,null,null,null,null,null,null,null,null,null,null,null,null,null,"SR4.75",">30",75,78,"16.0 Min",89,11]
[null,null,null,null,null,null,null,null,null,null,null,null,null,null,null,null,null,null,null,null,null,null,null,null,null,null,null,null,null,null,null,null,null,null,null,null,null,null,null,"SMA95","3 to <10","NA","NA","18.0 Min","NA","NA"]
[null,null,null,null,null,null,null,null,null,null,null,null,null,null,null,null,null,null,null,null,null,null,null,null,null,null,null,null,null,null,null,null,null,null,null,null,null,null,null,"SMA95","10 to <30","NA","NA","18.0 Min","NA","NA"]
[null,null,null,null,null,null,null,null,null,null,null,null,null,null,null,null,null,null,null,null,null,null,null,null,null,null,null,null,null,null,null,null,null,null,null,null,null,null,null,"SMA95","3 to <30","NA","NA","18.0 Min","NA","NA"]
[null,null,null,null,null,null,null,null,null,null,null,null,null,null,null,null,null,null,null,null,null,null,null,null,null,null,null,null,null,null,null,null,null,null,null,null,null,null,null,"SMA95","> 30","NA","NA","18.0 Min","NA","NA"]
[null,null,null,null,null,null,null,null,null,null,null,null,null,null,null,null,null,null,null,null,null,null,null,null,null,null,null,null,null,null,null,null,null,null,null,null,null,null,null,"SMA125","3 to <10","NA","NA","18.0 Min","NA","NA"]
[null,null,null,null,null,null,null,null,null,null,null,null,null,null,null,null,null,null,null,null,null,null,null,null,null,null,null,null,null,null,null,null,null,null,null,null,null,null,null,"SMA125","10 to <30","NA","NA","18.0 Min","NA","NA"]
[null,null,null,null,null,null,null,null,null,null,null,null,null,null,null,null,null,null,null,null,null,null,null,null,null,null,null,null,null,null,null,null,null,null,null,null,null,null,null,"SMA125","3 to <30","NA","NA","18.0 Min","NA","NA"]
[null,null,null,null,null,null,null,null,null,null,null,null,null,null,null,null,null,null,null,null,null,null,null,null,null,null,null,null,null,null,null,null,null,null,null,null,null,null,null,"SMA125","> 30","NA","NA","18.0 Min","NA","NA"]
[null,null,null,null,null,null,null,null,null,null,null,null,null,null,null,null,null,null,null,null,null,null,null,null,null,null,null,null,null,null,null,null,null,null,null,null,null,null,null,"SP25BC","<.3",66,78,"12.5 Min",91.5,8.5]
[null,null,null,null,null,null,null,null,null,null,null,null,null,null,null,null,null,null,null,null,null,null,null,null,null,null,null,null,null,null,null,null,null,null,null,null,null,null,null,"SP25BC",".3 to <3",66,78,"12.5 Min",90.5,9.5]
[null,null,null,null,null,null,null,null,null,null,null,null,null,null,null,null,null,null,null,null,null,null,null,null,null,null,null,null,null,null,null,null,null,null,null,null,null,null,null,"SP25BC","3 to <10",66,75,"12.5 Min",89,11]
[null,null,null,null,null,null,null,null,null,null,null,null,null,null,null,null,null,null,null,null,null,null,null,null,null,null,null,null,null,null,null,null,null,null,null,null,null,null,null,"SP25BC","10 to <30",66,75,"12.5 Min",89,11]
[null,null,null,null,null,null,null,null,null,null,null,null,null,null,null,null,null,null,null,null,null,null,null,null,null,null,null,null,null,null,null,null,null,null,null,null,null,null,null,"SP25BC","3 to <30",66,75,"12.5 Min",89,11]
[null,null,null,null,null,null,null,null,null,null,null,null,null,null,null,null,null,null,null,null,null,null,null,null,null,null,null,null,null,null,null,null,null,null,null,null,null,null,null,"SP25BC",">30",66,75,"12.5 Min",89,11]
[null,null,null,null,null,null,null,null,null,null,null,null,null,null,null,null,null,null,null,null,null,null,null,null,null,null,null,null,null,null,null,null,null,null,null,null,null,null,null,"SR25BC","<.3",66,78,"12.5 Min",91.5,8.5]
[null,null,null,null,null,null,null,null,null,null,null,null,null,null,null,null,null,null,null,null,null,null,null,null,null,null,null,null,null,null,null,null,null,null,null,null,null,null,null,"SR25BC",".3 to <3",66,78,"12.5 Min",90.5,9.5]
[null,null,null,null,null,null,null,null,null,null,null,null,null,null,null,null,null,null,null,null,null,null,null,null,null,null,null,null,null,null,null,null,null,null,null,null,null,null,null,"SR25BC","3 to <10",66,75,"12.5 Min",89,11]
[null,null,null,null,null,null,null,null,null,null,null,null,null,null,null,null,null,null,null,null,null,null,null,null,null,null,null,null,null,null,null,null,null,null,null,null,null,null,null,"SR25BC","10 to <30",66,75,"12.5 Min",89,11]
[null,null,null,null,null,null,null,null,null,null,null,null,null,null,null,null,null,null,null,null,null,null,null,null,null,null,null,null,null,null,null,null,null,null,null,null,null,null,null,"SR25BC","3 to <30",66,75,"12.5 Min",89,11]
[null,null,null,null,null,null,null,null,null,null,null,null,null,null,null,null,null,null,null,null,null,null,null,null,null,null,null,null,null,null,null,null,null,null,null,null,null,null,null,"SR25BC",">30",66,75,"12.5 Min",89,11]
[null,null,null,null,null,null,null,null,null,null,null,null,null,null,null,null,null,null,null,null,null,null,null,null,null,null,null,null,null,null,null,null,null,null,null,null,null,null,null,"SP19B","<.3",69,78,"13.5 Min",91.5,8.5]
[null,null,null,null,null,null,null,null,null,null,null,null,null,null,null,null,null,null,null,null,null,null,null,null,null,null,null,null,null,null,null,null,null,null,null,null,null,null,null,"SP19B",".3 to <3",69,78,"13.5 Min",90.5,9.5]
[null,null,null,null,null,null,null,null,null,null,null,null,null,null,null,null,null,null,null,null,null,null,null,null,null,null,null,null,null,null,null,null,null,null,null,null,null,null,null,"SP19B","3 to <10",69,75,"13.5 Min",89,11]
[null,null,null,null,null,null,null,null,null,null,null,null,null,null,null,null,null,null,null,null,null,null,null,null,null,null,null,null,null,null,null,null,null,null,null,null,null,null,null,"SP19B","10 to <30",69,75,"13.5 Min",89,11]
[null,null,null,null,null,null,null,null,null,null,null,null,null,null,null,null,null,null,null,null,null,null,null,null,null,null,null,null,null,null,null,null,null,null,null,null,null,null,null,"SP19B","3 to <30",69,75,"13.5 Min",89,11]
[null,null,null,null,null,null,null,null,null,null,null,null,null,null,null,null,null,null,null,null,null,null,null,null,null,null,null,null,null,null,null,null,null,null,null,null,null,null,null,"SP19B",">30",69,75,"13.5 Min",89,11]
[null,null,null,null,null,null,null,null,null,null,null,null,null,null,null,null,null,null,null,null,null,null,null,null,null,null,null,null,null,null,null,null,null,null,null,null,null,null,null,"SR19B","<.3",69,78,"13.5 Min",91.5,8.5]
[null,null,null,null,null,null,null,null,null,null,null,null,null,null,null,null,null,null,null,null,null,null,null,null,null,null,null,null,null,null,null,null,null,null,null,null,null,null,null,"SR19B",".3 to <3",69,78,"13.5 Min",90.5,9.5]
[null,null,null,null,null,null,null,null,null,null,null,null,null,null,null,null,null,null,null,null,null,null,null,null,null,null,null,null,null,null,null,null,null,null,null,null,null,null,null,"SR19B","3 to <10",69,75,"13.5 Min",89,11]
[null,null,null,null,null,null,null,null,null,null,null,null,null,null,null,null,null,null,null,null,null,null,null,null,null,null,null,null,null,null,null,null,null,null,null,null,null,null,null,"SR19B","10 to <30",69,75,"13.5 Min",89,11]
[null,null,null,null,null,null,null,null,null,null,null,null,null,null,null,null,null,null,null,null,null,null,null,null,null,null,null,null,null,null,null,null,null,null,null,null,null,null,null,"SR19B","3 to <30",69,75,"13.5 Min",89,11]
[null,null,null,null,null,null,null,null,null,null,null,null,null,null,null,null,null,null,null,null,null,null,null,null,null,null,null,null,null,null,null,null,null,null,null,null,null,null,null,"SR19B",">30",69,75,"13.5 Min",89,11]
[null,null,null,null,null,null,null,null,null,null,null,null,null,null,null,null,null,null,null,null,null,null,null,null,null,null,null,null,null,null,null,null,null,null,null,null,null,null,null,"WM37.5","<.3",64,78,"11.5 Min",91.5,8.5]
[null,null,null,null,null,null,null,null,null,null,null,null,null,null,null,null,null,null,null,null,null,null,null,null,null,null,null,null,null,null,null,null,null,null,null,null,null,null,null,"WM37.5",".3 to <3",64,78,"11.5 Min",90.5,9.5]
[null,null,null,null,null,null,null,null,null,null,null,null,null,null,null,null,null,null,null,null,null,null,null,null,null,null,null,null,null,null,null,null,null,null,null,null,null,null,null,"WM37.5","3 to <10",64,75,"11.5 Min",89,11]
[null,null,null,null,null,null,null,null,null,null,null,null,null,null,null,null,null,null,null,null,null,null,null,null,null,null,null,null,null,null,null,null,null,null,null,null,null,null,null,"WM37.5","10 to <30",64,75,"11.5 Min",89,11]
[null,null,null,null,null,null,null,null,null,null,null,null,null,null,null,null,null,null,null,null,null,null,null,null,null,null,null,null,null,null,null,null,null,null,null,null,null,null,null,"WM37.5","3 to <30",64,75,"11.5 Min",89,11]
[null,null,null,null,null,null,null,null,null,null,null,null,null,null,null,null,null,null,null,null,null,null,null,null,null,null,null,null,null,null,null,null,null,null,null,null,null,null,null,"WM37.5",">30",64,75,"11.5 Min",89,11]
[null,null,null,null,null,null,null,null,null,null,null,null,null,null,null,null,null,null,null,null,null,null,null,null,null,null,null,null,null,null,null,null,null,null,null,null,null,null,null,"WR37.5","<.3",64,78,"11.5 Min",91.5,8.5]
[null,null,null,null,null,null,null,null,null,null,null,null,null,null,null,null,null,null,null,null,null,null,null,null,null,null,null,null,null,null,null,null,null,null,null,null,null,null,null,"WR37.5",".3 to <3",64,78,"11.5 Min",90.5,9.5]
[null,null,null,null,null,null,null,null,null,null,null,null,null,null,null,null,null,null,null,null,null,null,null,null,null,null,null,null,null,null,null,null,null,null,null,null,null,null,null,"WR37.5","3 to <10",64,75,"11.5 Min",89,11]
[null,null,null,null,null,null,null,null,null,null,null,null,null,null,null,null,null,null,null,null,null,null,null,null,null,null,null,null,null,null,null,null,null,null,null,null,null,null,null,"WR37.5","10 to <30",64,75,"11.5 Min",89,11]
[null,null,null,null,null,null,null,null,null,null,null,null,null,null,null,null,null,null,null,null,null,null,null,null,null,null,null,null,null,null,null,null,null,null,null,null,null,null,null,"WR37.5","3 to <30",64,75,"11.5 Min",89,11]
[null,null,null,null,null,null,null,null,null,null,null,null,null,null,null,null,null,null,null,null,null,null,null,null,null,null,null,null,null,null,null,null,null,null,null,null,null,null,null,"WR37.5",">30",64,75,"11.5 Min",89,11]
[null,null,null,null,null,null,null,null,null,null,null,null,null,null,null,null,null,null,null,null,null,null,null,null,null,null,null,null,null,null,null,null,null,null,null,null,null,null,null,"WM12.5","<.3",71,78,"14.5 Min",91.5,8.5]
[null,null,null,null,null,null,null,null,null,null,null,null,null,null,null,null,null,null,null,null,null,null,null,null,null,null,null,null,null,null,null,null,null,null,null,null,null,null,null,"WM12.5",".3 to <3",71,78,"14.5 Min",90.5,9.5]
[null,null,null,null,null,null,null,null,null,null,null,null,null,null,null,null,null,null,null,null,null,null,null,null,null,null,null,null,null,null,null,null,null,null,null,null,null,null,null,"WM12.5","3 to <10",71,75,"14.5 Min",89,11]
[null,null,null,null,null,null,null,null,null,null,null,null,null,null,null,null,null,null,null,null,null,null,null,null,null,null,null,null,null,null,null,null,null,null,null,null,null,null,null,"WM12.5","10 to <30",71,75,"14.5 Min",89,11]
[null,null,null,null,null,null,null,null,null,null,null,null,null,null,null,null,null,null,null,null,null,null,null,null,null,null,null,null,null,null,null,null,null,null,null,null,null,null,null,"WM12.5","3 to <30",71,75,"14.5 Min",89,11]
[null,null,null,null,null,null,null,null,null,null,null,null,null,null,null,null,null,null,null,null,null,null,null,null,null,null,null,null,null,null,null,null,null,null,null,null,null,null,null,"WM12.5",">30",71,75,"14.5 Min",89,11]
[null,null,null,null,null,null,null,null,null,null,null,null,null,null,null,null,null,null,null,null,null,null,null,null,null,null,null,null,null,null,null,null,null,null,null,null,null,null,null,"WR12.5","<.3",71,78,"14.5 Min",91.5,8.5]
[null,null,null,null,null,null,null,null,null,null,null,null,null,null,null,null,null,null,null,null,null,null,null,null,null,null,null,null,null,null,null,null,null,null,null,null,null,null,null,"WR12.5",".3 to <3",71,78,"14.5 Min",90.5,9.5]
[null,null,null,null,null,null,null,null,null,null,null,null,null,null,null,null,null,null,null,null,null,null,null,null,null,null,null,null,null,null,null,null,null,null,null,null,null,null,null,"WR12.5","3 to <10",71,75,"14.5 Min",89,11]
[null,null,null,null,null,null,null,null,null,null,null,null,null,null,null,null,null,null,null,null,null,null,null,null,null,null,null,null,null,null,null,null,null,null,null,null,null,null,null,"WR12.5","10 to <30",71,75,"14.5 Min",89,11]
[null,null,null,null,null,null,null,null,null,null,null,null,null,null,null,null,null,null,null,null,null,null,null,null,null,null,null,null,null,null,null,null,null,null,null,null,null,null,null,"WR12.5","3 to <30",71,75,"14.5 Min",89,11]
[null,null,null,null,null,null,null,null,null,null,null,null,null,null,null,null,null,null,null,null,null,null,null,null,null,null,null,null,null,null,null,null,null,null,null,null,null,null,null,"WR12.5",">30",71,75,"14.5 Min",89,11]
[null,null,null,null,null,null,null,null,null,null,null,null,null,null,null,null,null,null,null,null,null,null,null,null,null,null,null,null,null,null,null,null,null,null,null,null,null,null,null,"WM9.5","<.3",70,78,"15.5 Min",91.5,8.5]
[null,null,null,null,null,null,null,null,null,null,null,null,null,null,null,null,null,null,null,null,null,null,null,null,null,null,null,null,null,null,null,null,null,null,null,null,null,null,null,"WM9.5",".3 to <3",65,78,"15.5 Min",90.5,9.5]
[null,null,null,null,null,null,null,null,null,null,null,null,null,null,null,null,null,null,null,null,null,null,null,null,null,null,null,null,null,null,null,null,null,null,null,null,null,null,null,"WM9.5","3 to <10",73,76,"15.5 Min",89,11]
[null,null,null,null,null,null,null,null,null,null,null,null,null,null,null,null,null,null,null,null,null,null,null,null,null,null,null,null,null,null,null,null,null,null,null,null,null,null,null,"WM9.5","10 to <30",73,76,"15.5 Min",89,11]
[null,null,null,null,null,null,null,null,null,null,null,null,null,null,null,null,null,null,null,null,null,null,null,null,null,null,null,null,null,null,null,null,null,null,null,null,null,null,null,"WM9.5","3 to <30",73,76,"15.5 Min",89,11]
[null,null,null,null,null,null,null,null,null,null,null,null,null,null,null,null,null,null,null,null,null,null,null,null,null,null,null,null,null,null,null,null,null,null,null,null,null,null,null,"WM9.5",">30",73,76,"15.5 Min",89,11]
[null,null,null,null,null,null,null,null,null,null,null,null,null,null,null,null,null,null,null,null,null,null,null,null,null,null,null,null,null,null,null,null,null,null,null,null,null,null,null,"WR9.5","<.3",70,78,"15.5 Min",91.5,8.5]
[null,null,null,null,null,null,null,null,null,null,null,null,null,null,null,null,null,null,null,null,null,null,null,null,null,null,null,null,null,null,null,null,null,null,null,null,null,null,null,"WR9.5",".3 to <3",65,78,"15.5 Min",90.5,9.5]
[null,null,null,null,null,null,null,null,null,null,null,null,null,null,null,null,null,null,null,null,null,null,null,null,null,null,null,null,null,null,null,null,null,null,null,null,null,null,null,"WR9.5","3 to <10",73,76,"15.5 Min",89,11]
[null,null,null,null,null,null,null,null,null,null,null,null,null,null,null,null,null,null,null,null,null,null,null,null,null,null,null,null,null,null,null,null,null,null,null,null,null,null,null,"WR9.5","10 to <30",73,76,"15.5 Min",89,11]
[null,null,null,null,null,null,null,null,null,null,null,null,null,null,null,null,null,null,null,null,null,null,null,null,null,null,null,null,null,null,null,null,null,null,null,null,null,null,null,"WR9.5","3 to <30",73,76,"15.5 Min",89,11]
[null,null,null,null,null,null,null,null,null,null,null,null,null,null,null,null,null,null,null,null,null,null,null,null,null,null,null,null,null,null,null,null,null,null,null,null,null,null,null,"WR9.5",">30",73,76,"15.5 Min",89,11]
[null,null,null,null,null,null,null,null,null,null,null,null,null,null,null,null,null,null,null,null,null,null,null,null,null,null,null,null,null,null,null,null,null,null,null,null,null,null,null,"WM19B","<.3",69,78,"13.5 Min",91.5,8.5]
[null,null,null,null,null,null,null,null,null,null,null,null,null,null,null,null,null,null,null,null,null,null,null,null,null,null,null,null,null,null,null,null,null,null,null,null,null,null,null,"WM19B",".3 to <3",69,78,"13.5 Min",90.5,9.5]
[null,null,null,null,null,null,null,null,null,null,null,null,null,null,null,null,null,null,null,null,null,null,null,null,null,null,null,null,null,null,null,null,null,null,null,null,null,null,null,"WM19B","3 to <10",69,75,"13.5 Min",89,11]
[null,null,null,null,null,null,null,null,null,null,null,null,null,null,null,null,null,null,null,null,null,null,null,null,null,null,null,null,null,null,null,null,null,null,null,null,null,null,null,"WM19B","10 to <30",69,75,"13.5 Min",89,11]
[null,null,null,null,null,null,null,null,null,null,null,null,null,null,null,null,null,null,null,null,null,null,null,null,null,null,null,null,null,null,null,null,null,null,null,null,null,null,null,"WM19B","3 to <30",69,75,"13.5 Min",89,11]
[null,null,null,null,null,null,null,null,null,null,null,null,null,null,null,null,null,null,null,null,null,null,null,null,null,null,null,null,null,null,null,null,null,null,null,null,null,null,null,"WM19B",">30",69,75,"13.5 Min",89,11]
[null,null,null,null,null,null,null,null,null,null,null,null,null,null,null,null,null,null,null,null,null,null,null,null,null,null,null,null,null,null,null,null,null,null,null,null,null,null,null,"WR19B","<.3",69,78,"13.5 Min",91.5,8.5]
[null,null,null,null,null,null,null,null,null,null,null,null,null,null,null,null,null,null,null,null,null,null,null,null,null,null,null,null,null,null,null,null,null,null,null,null,null,null,null,"WR19B",".3 to <3",69,78,"13.5 Min",90.5,9.5]
[null,null,null,null,null,null,null,null,null,null,null,null,null,null,null,null,null,null,null,null,null,null,null,null,null,null,null,null,null,null,null,null,null,null,null,null,null,null,null,"WR19B","3 to <10",69,75,"13.5 Min",89,11]
[null,null,null,null,null,null,null,null,null,null,null,null,null,null,null,null,null,null,null,null,null,null,null,null,null,null,null,null,null,null,null,null,null,null,null,null,null,null,null,"WR19B","10 to <30",69,75,"13.5 Min",89,11]
[null,null,null,null,null,null,null,null,null,null,null,null,null,null,null,null,null,null,null,null,null,null,null,null,null,null,null,null,null,null,null,null,null,null,null,null,null,null,null,"WR19B","3 to <30",69,75,"13.5 Min",89,11]
[null,null,null,null,null,null,null,null,null,null,null,null,null,null,null,null,null,null,null,null,null,null,null,null,null,null,null,null,null,null,null,null,null,null,null,null,null,null,null,"WR19B",">30",69,75,"13.5 Min",89,11]
[null,null,null,null,null,null,null,null,null,null,null,null,null,null,null,null,null,null,null,null,null,null,null,null,null,null,null,null,null,null,null,null,null,null,null,null,null,null,null,"WM19W","<.3",69,78,"13.5 Min",91.5,8.5]
[null,null,null,null,null,null,null,null,null,null,null,null,null,null,null,null,null,null,null,null,null,null,null,null,null,null,null,null,null,null,null,null,null,null,null,null,null,null,null,"WM19W",".3 to <3",69,78,"13.5 Min",90.5,9.5]
[null,null,null,null,null,null,null,null,null,null,null,null,null,null,null,null,null,null,null,null,null,null,null,null,null,null,null,null,null,null,null,null,null,null,null,null,null,null,null,"WM19W","3 to <10",69,75,"13.5 Min",89,11]
[null,null,null,null,null,null,null,null,null,null,null,null,null,null,null,null,null,null,null,null,null,null,null,null,null,null,null,null,null,null,null,null,null,null,null,null,null,null,null,"WM19W","10 to <30",69,75,"13.5 Min",89,11]
[null,null,null,null,null,null,null,null,null,null,null,null,null,null,null,null,null,null,null,null,null,null,null,null,null,null,null,null,null,null,null,null,null,null,null,null,null,null,null,"WM19W","3 to <30",69,75,"13.5 Min",89,11]
[null,null,null,null,null,null,null,null,null,null,null,null,null,null,null,null,null,null,null,null,null,null,null,null,null,null,null,null,null,null,null,null,null,null,null,null,null,null,null,"WM19W",">30",69,75,"13.5 Min",89,11]
[null,null,null,null,null,null,null,null,null,null,null,null,null,null,null,null,null,null,null,null,null,null,null,null,null,null,null,null,null,null,null,null,null,null,null,null,null,null,null,"WR19W","<.3",69,78,"13.5 Min",91.5,8.5]
[null,null,null,null,null,null,null,null,null,null,null,null,null,null,null,null,null,null,null,null,null,null,null,null,null,null,null,null,null,null,null,null,null,null,null,null,null,null,null,"WR19W",".3 to <3",69,78,"13.5 Min",90.5,9.5]
[null,null,null,null,null,null,null,null,null,null,null,null,null,null,null,null,null,null,null,null,null,null,null,null,null,null,null,null,null,null,null,null,null,null,null,null,null,null,null,"WR19W","3 to <10",69,75,"13.5 Min",89,11]
[null,null,null,null,null,null,null,null,null,null,null,null,null,null,null,null,null,null,null,null,null,null,null,null,null,null,null,null,null,null,null,null,null,null,null,null,null,null,null,"WR19W","10 to <30",69,75,"13.5 Min",89,11]
[null,null,null,null,null,null,null,null,null,null,null,null,null,null,null,null,null,null,null,null,null,null,null,null,null,null,null,null,null,null,null,null,null,null,null,null,null,null,null,"WR19W","3 to <30",69,75,"13.5 Min",89,11]
[null,null,null,null,null,null,null,null,null,null,null,null,null,null,null,null,null,null,null,null,null,null,null,null,null,null,null,null,null,null,null,null,null,null,null,null,null,null,null,"WR19W",">30",69,75,"13.5 Min",89,11]
[null,null,null,null,null,null,null,null,null,null,null,null,null,null,null,null,null,null,null,null,null,null,null,null,null,null,null,null,null,null,null,null,null,null,null,null,null,null,null,"WM25BC","<.3",66,78,"12.5 Min",91.5,8.5]
[null,null,null,null,null,null,null,null,null,null,null,null,null,null,null,null,null,null,null,null,null,null,null,null,null,null,null,null,null,null,null,null,null,null,null,null,null,null,null,"WM25BC",".3 to <3",66,78,"12.5 Min",90.5,9.5]
[null,null,null,null,null,null,null,null,null,null,null,null,null,null,null,null,null,null,null,null,null,null,null,null,null,null,null,null,null,null,null,null,null,null,null,null,null,null,null,"WM25BC","3 to <10",66,75,"12.5 Min",89,11]
[null,null,null,null,null,null,null,null,null,null,null,null,null,null,null,null,null,null,null,null,null,null,null,null,null,null,null,null,null,null,null,null,null,null,null,null,null,null,null,"WM25BC","10 to <30",66,75,"12.5 Min",89,11]
[null,null,null,null,null,null,null,null,null,null,null,null,null,null,null,null,null,null,null,null,null,null,null,null,null,null,null,null,null,null,null,null,null,null,null,null,null,null,null,"WM25BC","3 to <30",66,75,"12.5 Min",89,11]
[null,null,null,null,null,null,null,null,null,null,null,null,null,null,null,null,null,null,null,null,null,null,null,null,null,null,null,null,null,null,null,null,null,null,null,null,null,null,null,"WM25BC",">30",66,75,"12.5 Min",89,11]
[null,null,null,null,null,null,null,null,null,null,null,null,null,null,null,null,null,null,null,null,null,null,null,null,null,null,null,null,null,null,null,null,null,null,null,null,null,null,null,"WR25BC","<.3",66,78,"12.5 Min",91.5,8.5]
[null,null,null,null,null,null,null,null,null,null,null,null,null,null,null,null,null,null,null,null,null,null,null,null,null,null,null,null,null,null,null,null,null,null,null,null,null,null,null,"WR25BC",".3 to <3",66,78,"12.5 Min",90.5,9.5]
[null,null,null,null,null,null,null,null,null,null,null,null,null,null,null,null,null,null,null,null,null,null,null,null,null,null,null,null,null,null,null,null,null,null,null,null,null,null,null,"WR25BC","3 to <10",66,75,"12.5 Min",89,11]
[null,null,null,null,null,null,null,null,null,null,null,null,null,null,null,null,null,null,null,null,null,null,null,null,null,null,null,null,null,null,null,null,null,null,null,null,null,null,null,"WR25BC","10 to <30",66,75,"12.5 Min",89,11]
[null,null,null,null,null,null,null,null,null,null,null,null,null,null,null,null,null,null,null,null,null,null,null,null,null,null,null,null,null,null,null,null,null,null,null,null,null,null,null,"WR25BC","3 to <30",66,75,"12.5 Min",89,11]
[null,null,null,null,null,null,null,null,null,null,null,null,null,null,null,null,null,null,null,null,null,null,null,null,null,null,null,null,null,null,null,null,null,null,null,null,null,null,null,"WR25BC",">30",66,75,"12.5 Min",89,11]
[null,null,null,null,null,null,null,null,null,null,null,null,null,null,null,null,null,null,null,null,null,null,null,null,null,null,null,null,null,null,null,null,null,null,null,null,null,null,null,"WM25B","<.3",66,78,"12.5 Min",91.5,8.5]
[null,null,null,null,null,null,null,null,null,null,null,null,null,null,null,null,null,null,null,null,null,null,null,null,null,null,null,null,null,null,null,null,null,null,null,null,null,null,null,"WM25B",".3 to <3",66,78,"12.5 Min",90.5,9.5]
[null,null,null,null,null,null,null,null,null,null,null,null,null,null,null,null,null,null,null,null,null,null,null,null,null,null,null,null,null,null,null,null,null,null,null,null,null,null,null,"WM25B","3 to <10",66,75,"12.5 Min",89,11]
[null,null,null,null,null,null,null,null,null,null,null,null,null,null,null,null,null,null,null,null,null,null,null,null,null,null,null,null,null,null,null,null,null,null,null,null,null,null,null,"WM25B","10 to <30",66,75,"12.5 Min",89,11]
[null,null,null,null,null,null,null,null,null,null,null,null,null,null,null,null,null,null,null,null,null,null,null,null,null,null,null,null,null,null,null,null,null,null,null,null,null,null,null,"WM25B","3 to <30",66,75,"12.5 Min",89,11]
[null,null,null,null,null,null,null,null,null,null,null,null,null,null,null,null,null,null,null,null,null,null,null,null,null,null,null,null,null,null,null,null,null,null,null,null,null,null,null,"WM25B",">30",66,75,"12.5 Min",89,11]
[null,null,null,null,null,null,null,null,null,null,null,null,null,null,null,null,null,null,null,null,null,null,null,null,null,null,null,null,null,null,null,null,null,null,null,null,null,null,null,"WR25B","<.3",66,78,"12.5 Min",91.5,8.5]
[null,null,null,null,null,null,null,null,null,null,null,null,null,null,null,null,null,null,null,null,null,null,null,null,null,null,null,null,null,null,null,null,null,null,null,null,null,null,null,"WR25B",".3 to <3",66,78,"12.5 Min",90.5,9.5]
[null,null,null,null,null,null,null,null,null,null,null,null,null,null,null,null,null,null,null,null,null,null,null,null,null,null,null,null,null,null,null,null,null,null,null,null,null,null,null,"WR25B","3 to <10",66,75,"12.5 Min",89,11]
[null,null,null,null,null,null,null,null,null,null,null,null,null,null,null,null,null,null,null,null,null,null,null,null,null,null,null,null,null,null,null,null,null,null,null,null,null,null,null,"WR25B","10 to <30",66,75,"12.5 Min",89,11]
[null,null,null,null,null,null,null,null,null,null,null,null,null,null,null,null,null,null,null,null,null,null,null,null,null,null,null,null,null,null,null,null,null,null,null,null,null,null,null,"WR25B","3 to <30",66,75,"12.5 Min",89,11]
[null,null,null,null,null,null,null,null,null,null,null,null,null,null,null,null,null,null,null,null,null,null,null,null,null,null,null,null,null,null,null,null,null,null,null,null,null,null,null,"WR25B",">30",66,75,"12.5 Min",89,11]
[null,null,null,null,null,null,null,null,null,null,null,null,null,null,null,null,null,null,null,null,null,null,null,null,null,null,null,null,null,null,null,null,null,null,null,null,null,null,null,"SP19W / SP19B","<.3",69,78,"13.5 Min",91.5,8.5]
[null,null,null,null,null,null,null,null,null,null,null,null,null,null,null,null,null,null,null,null,null,null,null,null,null,null,null,null,null,null,null,null,null,null,null,null,null,null,null,"SP19W / SP19B",".3 to <3",69,78,"13.5 Min",90.5,9.5]
[null,null,null,null,null,null,null,null,null,null,null,null,null,null,null,null,null,null,null,null,null,null,null,null,null,null,null,null,null,null,null,null,null,null,null,null,null,null,null,"SP19W / SP19B","3 to <10",69,75,"13.5 Min",89,11]
[null,null,null,null,null,null,null,null,null,null,null,null,null,null,null,null,null,null,null,null,null,null,null,null,null,null,null,null,null,null,null,null,null,null,null,null,null,null,null,"SP19W / SP19B","10 to <30",69,75,"13.5 Min",89,11]
[null,null,null,null,null,null,null,null,null,null,null,null,null,null,null,null,null,null,null,null,null,null,null,null,null,null,null,null,null,null,null,null,null,null,null,null,null,null,null,"SP19W / SP19B","3 to <30",69,75,"13.5 Min",89,11]
[null,null,null,null,null,null,null,null,null,null,null,null,null,null,null,null,null,null,null,null,null,null,null,null,null,null,null,null,null,null,null,null,null,null,null,null,null,null,null,"SP19W / SP19B",">30",69,75,"13.5 Min",89,11]
[null,null,null,null,null,null,null,null,null,null,null,null,null,null,null,null,null,null,null,null,null,null,null,null,null,null,null,null,null,null,null,null,null,null,null,null,null,null,null,"SR19W / SR19B","<.3",69,78,"13.5 Min",91.5,8.5]
[null,null,null,null,null,null,null,null,null,null,null,null,null,null,null,null,null,null,null,null,null,null,null,null,null,null,null,null,null,null,null,null,null,null,null,null,null,null,null,"SR19W / SR19B",".3 to <3",69,78,"13.5 Min",90.5,9.5]
[null,null,null,null,null,null,null,null,null,null,null,null,null,null,null,null,null,null,null,null,null,null,null,null,null,null,null,null,null,null,null,null,null,null,null,null,null,null,null,"SR19W / SR19B","3 to <10",69,75,"13.5 Min",89,11]
[null,null,null,null,null,null,null,null,null,null,null,null,null,null,null,null,null,null,null,null,null,null,null,null,null,null,null,null,null,null,null,null,null,null,null,null,null,null,null,"SR19W / SR19B","10 to <30",69,75,"13.5 Min",89,11]
[null,null,null,null,null,null,null,null,null,null,null,null,null,null,null,null,null,null,null,null,null,null,null,null,null,null,null,null,null,null,null,null,null,null,null,null,null,null,null,"SR19W / SR19B","3 to <30",69,75,"13.5 Min",89,11]
[null,null,null,null,null,null,null,null,null,null,null,null,null,null,null,null,null,null,null,null,null,null,null,null,null,null,null,null,null,null,null,null,null,null,null,null,null,null,null,"SR19W / SR19B",">30",69,75,"13.5 Min",89,11]
[null,null,null,null,null,null,null,null,null,null,null,null,null,null,null,null,null,null,null,null,null,null,null,null,null,null,null,null,null,null,null,null,null,null,null,null,null,null,null,"SP25B / SP25BC","<.3",66,78,"12.5 Min",91.5,8.5]
[null,null,null,null,null,null,null,null,null,null,null,null,null,null,null,null,null,null,null,null,null,null,null,null,null,null,null,null,null,null,null,null,null,null,null,null,null,null,null,"SP25B / SP25BC",".3 to <3",66,78,"12.5 Min",90.5,9.5]
[null,null,null,null,null,null,null,null,null,null,null,null,null,null,null,null,null,null,null,null,null,null,null,null,null,null,null,null,null,null,null,null,null,null,null,null,null,null,null,"SP25B / SP25BC","3 to <10",66,75,"12.5 Min",89,11]
[null,null,null,null,null,null,null,null,null,null,null,null,null,null,null,null,null,null,null,null,null,null,null,null,null,null,null,null,null,null,null,null,null,null,null,null,null,null,null,"SP25B / SP25BC","10 to <30",66,75,"12.5 Min",89,11]
[null,null,null,null,null,null,null,null,null,null,null,null,null,null,null,null,null,null,null,null,null,null,null,null,null,null,null,null,null,null,null,null,null,null,null,null,null,null,null,"SP25B / SP25BC","3 to <30",66,75,"12.5 Min",89,11]
[null,null,null,null,null,null,null,null,null,null,null,null,null,null,null,null,null,null,null,null,null,null,null,null,null,null,null,null,null,null,null,null,null,null,null,null,null,null,null,"SP25B / SP25BC",">30",66,75,"12.5 Min",89,11]
[null,null,null,null,null,null,null,null,null,null,null,null,null,null,null,null,null,null,null,null,null,null,null,null,null,null,null,null,null,null,null,null,null,null,null,null,null,null,null,"SR25B / SR25BC","<.3",66,78,"12.5 Min",91.5,8.5]
[null,null,null,null,null,null,null,null,null,null,null,null,null,null,null,null,null,null,null,null,null,null,null,null,null,null,null,null,null,null,null,null,null,null,null,null,null,null,null,"SR25B / SR25BC",".3 to <3",66,78,"12.5 Min",90.5,9.5]
[null,null,null,null,null,null,null,null,null,null,null,null,null,null,null,null,null,null,null,null,null,null,null,null,null,null,null,null,null,null,null,null,null,null,null,null,null,null,null,"SR25B / SR25BC","3 to <10",66,75,"12.5 Min",89,11]
[null,null,null,null,null,null,null,null,null,null,null,null,null,null,null,null,null,null,null,null,null,null,null,null,null,null,null,null,null,null,null,null,null,null,null,null,null,null,null,"SR25B / SR25BC","10 to <30",66,75,"12.5 Min",89,11]
[null,null,null,null,null,null,null,null,null,null,null,null,null,null,null,null,null,null,null,null,null,null,null,null,null,null,null,null,null,null,null,null,null,null,null,null,null,null,null,"SR25B / SR25BC","3 to <30",66,75,"12.5 Min",89,11]
[null,null,null,null,null,null,null,null,null,null,null,null,null,null,null,null,null,null,null,null,null,null,null,null,null,null,null,null,null,null,null,null,null,null,null,null,null,null,null,"SR25B / SR25BC",">30",66,75,"12.5 Min",89,11]
[null,null,null,null,null,null,null,null,null,null,null,null,null,null,null,null,null,null,null,null,null,null,null,null,null,null,null,null,null,null,null,null,null,null,null,null,null,null,null,"WM19W / WM19B","<.3",69,78,"13.5 Min",91.5,8.5]
[null,null,null,null,null,null,null,null,null,null,null,null,null,null,null,null,null,null,null,null,null,null,null,null,null,null,null,null,null,null,null,null,null,null,null,null,null,null,null,"WM19W / WM19B",".3 to <3",69,78,"13.5 Min",90.5,9.5]
[null,null,null,null,null,null,null,null,null,null,null,null,null,null,null,null,null,null,null,null,null,null,null,null,null,null,null,null,null,null,null,null,null,null,null,null,null,null,null,"WM19W / WM19B","3 to <10",69,75,"13.5 Min",89,11]
[null,null,null,null,null,null,null,null,null,null,null,null,null,null,null,null,null,null,null,null,null,null,null,null,null,null,null,null,null,null,null,null,null,null,null,null,null,null,null,"WM19W / WM19B","10 to <30",69,75,"13.5 Min",89,11]
[null,null,null,null,null,null,null,null,null,null,null,null,null,null,null,null,null,null,null,null,null,null,null,null,null,null,null,null,null,null,null,null,null,null,null,null,null,null,null,"WM19W / WM19B","3 to <30",69,75,"13.5 Min",89,11]
[null,null,null,null,null,null,null,null,null,null,null,null,null,null,null,null,null,null,null,null,null,null,null,null,null,null,null,null,null,null,null,null,null,null,null,null,null,null,null,"WM19W / WM19B",">30",69,75,"13.5 Min",89,11]
[null,null,null,null,null,null,null,null,null,null,null,null,null,null,null,null,null,null,null,null,null,null,null,null,null,null,null,null,null,null,null,null,null,null,null,null,null,null,null,"WR19W /WR19B","<.3",69,78,"13.5 Min",91.5,8.5]
[null,null,null,null,null,null,null,null,null,null,null,null,null,null,null,null,null,null,null,null,null,null,null,null,null,null,null,null,null,null,null,null,null,null,null,null,null,null,null,"WR19W /WR19B",".3 to <3",69,78,"13.5 Min",90.5,9.5]
[null,null,null,null,null,null,null,null,null,null,null,null,null,null,null,null,null,null,null,null,null,null,null,null,null,null,null,null,null,null,null,null,null,null,null,null,null,null,null,"WR19W /WR19B","3 to <10",69,75,"13.5 Min",89,11]
[null,null,null,null,null,null,null,null,null,null,null,null,null,null,null,null,null,null,null,null,null,null,null,null,null,null,null,null,null,null,null,null,null,null,null,null,null,null,null,"WR19W /WR19B","10 to <30",69,75,"13.5 Min",89,11]
[null,null,null,null,null,null,null,null,null,null,null,null,null,null,null,null,null,null,null,null,null,null,null,null,null,null,null,null,null,null,null,null,null,null,null,null,null,null,null,"WR19W /WR19B","3 to <30",69,75,"13.5 Min",89,11]
[null,null,null,null,null,null,null,null,null,null,null,null,null,null,null,null,null,null,null,null,null,null,null,null,null,null,null,null,null,null,null,null,null,null,null,null,null,null,null,"WR19W /WR19B",">30",69,75,"13.5 Min",89,11]
[null,null,null,null,null,null,null,null,null,null,null,null,null,null,null,null,null,null,null,null,null,null,null,null,null,null,null,null,null,null,null,null,null,null,null,null,null,null,null,"WM25B / WM25BC","<.3",66,78,"12.5 Min",91.5,8.5]
[null,null,null,null,null,null,null,null,null,null,null,null,null,null,null,null,null,null,null,null,null,null,null,null,null,null,null,null,null,null,null,null,null,null,null,null,null,null,null,"WM25B / WM25BC",".3 to <3",66,78,"12.5 Min",90.5,9.5]
[null,null,null,null,null,null,null,null,null,null,null,null,null,null,null,null,null,null,null,null,null,null,null,null,null,null,null,null,null,null,null,null,null,null,null,null,null,null,null,"WM25B / WM25BC","3 to <10",66,75,"12.5 Min",89,11]
[null,null,null,null,null,null,null,null,null,null,null,null,null,null,null,null,null,null,null,null,null,null,null,null,null,null,null,null,null,null,null,null,null,null,null,null,null,null,null,"WM25B / WM25BC","10 to <30",66,75,"12.5 Min",89,11]
[null,null,null,null,null,null,null,null,null,null,null,null,null,null,null,null,null,null,null,null,null,null,null,null,null,null,null,null,null,null,null,null,null,null,null,null,null,null,null,"WM25B / WM25BC","3 to <30",66,75,"12.5 Min",89,11]
[null,null,null,null,null,null,null,null,null,null,null,null,null,null,null,null,null,null,null,null,null,null,null,null,null,null,null,null,null,null,null,null,null,null,null,null,null,null,null,"WM25B / WM25BC",">30",66,75,"12.5 Min",89,11]
[null,null,null,null,null,null,null,null,null,null,null,null,null,null,null,null,null,null,null,null,null,null,null,null,null,null,null,null,null,null,null,null,null,null,null,null,null,null,null,"WR25B / WR25BC","<.3",66,78,"12.5 Min",91.5,8.5]
[null,null,null,null,null,null,null,null,null,null,null,null,null,null,null,null,null,null,null,null,null,null,null,null,null,null,null,null,null,null,null,null,null,null,null,null,null,null,null,"WR25B / WR25BC",".3 to <3",66,78,"12.5 Min",90.5,9.5]
[null,null,null,null,null,null,null,null,null,null,null,null,null,null,null,null,null,null,null,null,null,null,null,null,null,null,null,null,null,null,null,null,null,null,null,null,null,null,null,"WR25B / WR25BC","3 to <10",66,75,"12.5 Min",89,11]
[null,null,null,null,null,null,null,null,null,null,null,null,null,null,null,null,null,null,null,null,null,null,null,null,null,null,null,null,null,null,null,null,null,null,null,null,null,null,null,"WR25B / WR25BC","10 to <30",66,75,"12.5 Min",89,11]
[null,null,null,null,null,null,null,null,null,null,null,null,null,null,null,null,null,null,null,null,null,null,null,null,null,null,null,null,null,null,null,null,null,null,null,null,null,null,null,"WR25B / WR25BC","3 to <30",66,75,"12.5 Min",89,11]
[null,null,null,null,null,null,null,null,null,null,null,null,null,null,null,null,null,null,null,null,null,null,null,null,null,null,null,null,null,null,null,null,null,null,null,null,null,null,null,"WR25B / WR25BC",">30",66,75,"12.5 Min",89,11]
[null,null,null,null,null,null,null,null,null,null,null,null,null,null,null,null,null,null,null,null,null,null,null,null,null,null,null,null,null,null,null,null,null,null,null,null,null,null,null,"SP6.33",".3 to <3",75,81,"16.5 Min",90.5,9.5]
[null,null,null,null,null,null,null,null,null,null,null,null,null,null,null,null,null,null,null,null,null,null,null,null,null,null,null,null,null,null,null,null,null,null,null,null,null,null,null,"WM6.33",".3 to <3",75,81,"16.5 Min",90.5,9.5]

{"sheet":"AC Charts","index":12,"n_rows":16,"n_cols":36,"rows_kept":16,"cut":false,"hidden":false,"merged":[[3,29,3,31],[4,29,4,31],[5,29,5,31],[6,29,6,31],[5,22,5,23],[4,2,4,4],[13,29,13,31],[14,29,14,31],[15,29,15,31],[7,29,7,31],[8,29,8,31],[9,29,9,31],[11,29,11,31],[12,29,12,31],[5,2,5,4],[5,5,5,7],[5,9,5,14],[5,15,5,17],[5,19,5,21],[4,5,4,8],[4,9,4,14],[0,1,0,2],[3,2,3,4],[3,5,3,8],[3,9,3,14],[2,1,2,24],[3,19,3,21],[3,22,3,23],[3,15,3,18],[4,15,4,17],[4,20,4,21],[7,10,7,14],[7,16,7,24],[4,22,4,23]]}
[null,{"$f":"Setup!A2","v":"ESB-21"}]
[]
[null,"Varying Asphalt Content Charts"]
[null,null,"Producer;",null,null,{"$f":"Setup!E7","v":0},null,null,null,"Material Class:",null,null,null,null,null,{"$f":"Setup!E11","v":0},null,null,null,"JMF",null,null,{"$f":"Setup!E5","v":0},null,null,null,null,null,null,"AC Content",null,null,{"$f":"'AC Trials'!H41","v":-0.5},{"$f":"'AC Trials'!K41","v":0},{"$f":"'AC Trials'!N41","v":0.5},{"$f":"'AC Trials'!Q41","v":1}]
[null,null,"Designed By:",null,null,{"$f":"Setup!E9","v":0},null,null,null,"Esals:",null,null,null,null,null,{"$f":"Setup!E13","v":0},null,null,null,null,"SRL:",null,{"$f":"Setup!E12","v":0},null,null,null,null,null,null,"Gmb @ Ndes",null,null,{"$f":"'AC Trials'!H43","v":""},{"$f":"'AC Trials'!K43","v":""},{"$f":"'AC Trials'!N43","v":""},{"$f":"'AC Trials'!Q43","v":""}]
[null,null,"Date:",null,null,{"$f":"Setup!E6","v":"00:00:00"},null,null,null,"Rap:",null,null,null,null,null,{"$f":"Setup!E18","v":0},null,null,null,"PG Grade:",null,null,{"$f":"Setup!E15","v":0},null,null,null,null,null,null,"Voids @ Ndes",null,null,{"$f":"'AC Trials'!H44","v":""},{"$f":"'AC Trials'!K44","v":""},{"$f":"'AC Trials'!N44","v":""},{"$f":"'AC Trials'!Q44","v":""}]
[null,null,null,null,null,null,null,null,null,null,null,null,null,null,null,null,null,null,null,null,null,null,null,null,null,null,null,null,null,"Voids @ Nini",null,null,{"$f":"'AC Trials'!H48","v":""},{"$f":"'AC Trials'!K48","v":""},{"$f":"'AC Trials'!N48","v":""},{"$f":"'AC Trials'!Q48","v":""}]
[null,null,null,null,null,null,null,null,null,null,"Varying AC Charts",null,null,null,null,null,"Click on sheet to set up charts",null,null,null,null,null,null,null,null,null,null,null,null,"Vma",null,null,{"$f":"'AC Trials'!H45","v":""},{"$f":"'AC Trials'!K45","v":""},{"$f":"'AC Trials'!N45","v":""},{"$f":"'AC Trials'!Q45","v":""}]
[null,null,null,null,null,null,null,null,null,null,null,null,null,null,null,null,null,null,null,null,null,null,null,null,null,null,null,null,null,"VFA",null,null,{"$f":"'AC Trials'!H46","v":""},{"$f":"'AC Trials'!K46","v":""},{"$f":"'AC Trials'!N46","v":""},{"$f":"'AC Trials'!Q46","v":""}]
[null,null,null,null,null,null,null,null,null,null,null,null,null,null,null,null,null,null,null,null,null,null,null,null,null,null,null,null,null,"D/A",null,null,{"$f":"'AC Trials'!H50","v":""},{"$f":"'AC Trials'!K50","v":""},{"$f":"'AC Trials'!N50","v":""},{"$f":"'AC Trials'!Q50","v":""}]
[null,null,null,null,null,null,null,null,null,null,null,null,null,null,null,null,null,null,null,null,null,null,null,null,null,null,null,null,null,null,null,null,"Max","Min"]
[null,null,null,null,null,null,null,null,null,null,null,null,null,null,null,null,null,null,null,null,null,null,null,null,null,null,null,null,null,"Gmb",null,null,{"$f":"MIN(AG5:AJ5)-0.01","v":-0.01},{"$f":"MAX(AG5:AJ5)+0.01","v":0.01}]
[null,null,null,null,null,null,null,null,null,null,null,null,null,null,null,null,null,null,null,null,null,null,null,null,null,null,null,null,null,"Voids @ Ndes",null,null,{"$f":"MIN(AG6:AJ6)-1","v":-1},{"$f":"MAX(AG6:AJ6)+1","v":1}]
[null,null,null,null,null,null,null,null,null,null,null,null,null,null,null,null,null,null,null,null,null,null,null,null,null,null,null,null,null,"Voids @ Nini",null,null,{"$f":"MIN(AG7:AJ7)-1","v":-1},{"$f":"MAX(AG7:AJ7)+1","v":1}]
[null,null,null,null,null,null,null,null,null,null,null,null,null,null,null,null,null,null,null,null,null,null,null,null,null,null,null,null,null,"VMA",null,null,{"$f":"MIN(AG8:AJ8)-1.5","v":-1.5},{"$f":"MAX(AG8:AJ8)+1.5","v":1.5}]
[null,null,null,null,null,null,null,null,null,null,null,null,null,null,null,null,null,null,null,null,null,null,null,null,null,null,null,null,null,"VFA",null,null,{"$f":"5*ROUND(MIN(AG9:AJ9)/5-1,0)","v":-5},{"$f":"5*ROUND(MAX(AE9:AJ9)/5+1,0)","v":5}]

{"sheet":"Nmax","index":13,"n_rows":24,"n_cols":36,"rows_kept":24,"cut":false,"hidden":false,"merged":[[0,1,0,2],[2,1,2,24],[3,2,3,4],[3,5,3,8],[3,9,3,14],[3,19,3,21],[3,22,3,23],[3,15,3,18],[5,22,5,23],[4,2,4,4],[4,5,4,8],[4,9,4,14],[4,15,4,17],[4,20,4,21],[4,22,4,23],[7,20,7,21],[5,2,5,4],[5,5,5,7],[5,9,5,14],[5,15,5,17],[5,19,5,21],[11,1,11,2],[11,3,11,10],[11,23,11,24],[11,17,11,22],[11,11,11,16],[12,21,13,22],[12,1,13,2],[12,3,13,4],[12,5,13,8],[12,9,13,10],[12,11,13,12],[12,23,13,24],[14,1,14,2],[14,3,14,4],[14,5,14,8],[14,9,14,10],[14,11,14,12],[14,13,14,14],[14,15,14,16],[14,17,14,18],[14,19,14,20],[14,21,14,22],[14,23,14,24],[12,13,13,14],[12,15,13,16],[12,17,13,18],[12,19,13,20],[15,1,15,2],[15,3,15,4],[15,5,15,8],[15,9,15,10],[15,11,15,12],[16,5,17,8],[16,19,16,20],[16,21,16,22],[16,23,16,24],[16,17,16,18],[23,13,23,14],[22,13,22,14],[21,13,21,14],[23,11,23,12],[15,23,15,24],[15,13,15,14],[15,15,15,16],[15,17,15,18],[15,19,15,20],[15,21,15,22],[23,7,23,8],[7,4,7,19],[9,0,9,25],[22,11,22,12],[21,11,21,12],[23,9,23,10],[22,9,22,10],[21,9,21,10],[19,9,19,16],[20,9,20,10],[20,11,20,12],[20,13,20,14],[20,15,20,16],[23,15,23,16],[22,15,22,16],[21,15,21,16]]}
[null,{"$f":"Setup!A2","v":"ESB-21"},null,null,null,null,null,null,null,null,null,null,null,null,null,null,null,null,null,null,null,null,null,null,null,null,null,null,null,{"$f":"Setup!F24","v":0},null,"Vol Cal.",{"$f":"Setup!F21","v":0}]
[null,null,null,null,null,null,null,null,null,null,null,null,null,null,null,null,null,null,null,null,null,null,null,null,null,null,null,null,null,{"$f":"Setup!F25","v":0},null,"GsbNdes",{"$f":"'Design Agg'!Y22","v":false},null,{"$f":"'Trial Blends'!N42","v":0},"TB selected"]
[null,"Optimum Asphalt Content Compacted to Nmax",null,null,null,null,null,null,null,null,null,null,null,null,null,null,null,null,null,null,null,null,null,null,null,null,null,null,null,null,null,"Esals",{"$f":"Setup!E13","v":0},null,{"$f":"IF(AI2=1,'Agg Blends'!L36,IF(AI2=2,'Agg Blends'!M36,IF(AI2=3,'Agg Blends'!N36)))","v":false},"TB Gsb"]
[null,null,"Producer;",null,null,{"$f":"Setup!E7","v":0},null,null,null,"Material Class:",null,null,null,null,null,{"$f":"Setup!E11","v":0},null,null,null,"JMF",null,null,{"$f":"Setup!E5","v":0}]
[null,null,"Designed By:",null,null,{"$f":"Setup!E9","v":0},null,null,null,"Esals:",null,null,null,null,null,{"$f":"Setup!E13","v":0},null,null,null,null,"SRL:",null,{"$f":"Setup!E12","v":0}]
[null,null,"Date:",null,null,{"$f":"Setup!E6","v":"00:00:00"},null,null,null,"Rap:",null,null,null,null,null,{"$f":"Setup!E18","v":0},null,null,null,"PG Grade:",null,null,{"$f":"Setup!E15","v":0}]
[]
[null,null,null,null,"Based on the AC charts, the optimum asphalt @ 4.0% air voids at Ndes will be"]
[]
["Specimens compacted to Nmax",null,null,null,null,null,null,null,null,null,null,null,null,null,null,null,null,null,null,null,null,null,null,null,null,null,null,null,null,null,null,null,{"$f":"IF($AG$3=\"<.3\",6,IF($AG$3=\".3 to <3\",7,8))","v":8}]
[null,null,null,null,null,null,null,null,null,null,null,null,null,null,null,null,null,null,null,null,null,null,null,null,null,null,null,null,null,null,null,null,{"$f":"IF($AG$3=\"<.3\",50,IF($AG$3=\".3 to <3\",75,100))","v":100}]
[null,{"$f":"U8","v":0},null,"Asphalt Content",null,null,null,null,null,null,null,"Samp Ht.",null,null,null,null,null,"Maximum Theoretical Gravity",null,null,null,null,null,null,null,null,null,null,null,null,null,null,{"$f":"IF($AG$3=\"<.3\",75,IF($AG$3=\".3 to <3\",115,160))","v":160}]
[null,null,null,"Dry Weight",null,{"$f":"IF(Setup!$F$20=\"Suspension\",\"Mass Spec. in H2O\",\"Mass Pyc + Specimen + Water\")","v":"Mass Pyc + Specimen + Water"},null,null,null,"SSD Weight",null,"Height @ Nini",null,"Height @ Ndes",null,"Height @ Nmax",null,"Gmb @ Nmax",null,"%Gmm @ Nini",null,"%Gmm @ Ndes",null,"%Gmm @ Nmax"]
[null,null,null,null,null,{"$f":"IF(Setup!#REF!=\"Suspension\",\"Mass samp+Pyc in H2O\",\"Mass Pyc + Mix + Water\")","v":{"$error":"#REF!"}}]
[null,"Spec. 1",null,null,null,null,null,null,null,null,null,null,null,null,null,null,null,{"$f":"IF($AD$1=\"Suspension\",ROUND(D15/(J15-F15),3),IF($AD$1=\"Volumeter\",ROUND(D15/(J15-(F15-$AD$2)),3),\" \"))","v":" "},null,{"$f":"IF(D15,ROUND(P15/L15*X15,1),\" \")","v":" "},null,{"$f":"IF(D15,ROUND(P15/N15*X15,1),\" \")","v":" "},null,{"$f":"IF(D15,R15/$X$12*100,\" \")","v":" "}]
[null,"Spec. 2",null,null,null,null,null,null,null,null,null,null,null,null,null,null,null,{"$f":"IF($AD$1=\"Suspension\",ROUND(D16/(J16-F16),3),IF($AD$1=\"Volumeter\",ROUND(D16/(J16-(F16-$AD$2)),3),\" \"))","v":" "},null,{"$f":"IF(D16,ROUND(P16/L16*X16,1),\" \")","v":" "},null,{"$f":"IF(D16,ROUND(P16/N16*X16,1),\" \")","v":" "},null,{"$f":"IF(D16,R16/$X$12*100,\" \")","v":" "}]
[null,null,null,null,null,null,null,null,null,null,null,null,null,null,null,null,null,{"$f":"IF(D15,ROUND(AVERAGE(R15:S16),3),\"\")","v":""},null,{"$f":"IF(J15,ROUND(AVERAGE(T15:T16),2),\"\")","v":""},null,{"$f":"IF(J15,ROUND(AVERAGE(V15:V16),2),\"\")","v":""},null,{"$f":"IF(J15,ROUND(AVERAGE(X15:X16),2),\"\")","v":""}]
[null,null,null,null,null,null,null,null,null,null,null,null,null,null,null,null,null,null,null,null,null,null,null,null,null,null,null,null,{"$f":"T17","v":""},null,{"$f":"IF($AG$3=\"<.3\",91.5,IF($AG$3=\"0.3 to <3\",90.5,89))","v":89},96,98]
[null,null,null,null,null,null,null,null,null,null,null,null,null,null,null,null,null,null,null,null,null,null,null,null,null,null,null,null,{"$f":"V17","v":""},null,89,96,98]
[null,null,null,null,null,null,null,null,null,"Properties Calculated @ Ndes",null,null,null,null,null,null,null,null,null,null,null,null,null,null,null,null,null,null,{"$f":"X17","v":""},null,89,96,98]
[null,null,null,null,null,null,null,null,null,"Voids",null,"Gmb",null,"VMA",null,"VFA",null,null,null,null,null,null,null,null,null,null,null,null,null,null,89,96,98]
[null,null,null,null,null,null,null,null,null,{"$f":"IF(D15,100-V15,\" \")","v":" "},null,{"$f":"IF(D15,ROUND(X12*V15/100,3),\" \")","v":" "},null,{"$f":"IF(D15,100-((L22*(100-B12))/AI3),\"\")","v":""},null,{"$f":"IF(D15,(N22-J22)/N22*100,\" \")","v":" "},null,null,null,null,null,null,null,null,null,null,null,null,null,null,89,96,98]
[null,null,null,null,null,null,null,null,null,{"$f":"IF(D16,100-V16,\" \")","v":" "},null,{"$f":"IF(D16,ROUND(X12*V16/100,3),\" \")","v":" "},null,{"$f":"IF(D16,100-((L23*(100-B12))/AI3),\"\")","v":""},null,{"$f":"IF(D16,(N23-J23)/N23*100,\" \")","v":" "},null,null,null,null,null,null,null,null,null,null,null,null,null,null,89,96,98]
[null,null,null,null,null,null,null,"Avg.",null,{"$f":"IF(ISTEXT(J22),\"\",AVERAGE(J22:K23))","v":""},null,{"$f":"IF(ISTEXT(L22),\"\",AVERAGE(L22:M23))","v":""},null,{"$f":"IF(ISTEXT(N22),\"\",AVERAGE(N22:O23))","v":""},null,{"$f":"IF(ISTEXT(P22),\"\",AVERAGE(P22:Q23))","v":""}]

{"sheet":"Drain Down","index":14,"n_rows":27,"n_cols":23,"rows_kept":27,"cut":false,"hidden":false,"merged":[[11,16,11,17],[11,14,11,15],[25,14,25,15],[25,16,25,17],[26,9,26,13],[26,14,26,17],[22,14,22,15],[22,16,22,17],[23,14,23,15],[23,16,23,17],[24,14,24,15],[24,16,24,17],[19,9,19,17],[20,14,20,15],[20,16,20,17],[21,14,21,15],[13,16,13,17],[13,14,13,15],[21,16,21,17],[12,16,12,17],[12,14,12,15],[16,9,16,13],[16,14,16,17],[15,16,15,17],[15,14,15,15],[14,16,14,17],[14,14,14,15],[4,9,4,14],[10,16,10,17],[10,14,10,15],[7,1,7,24],[9,9,9,17],[4,15,4,17],[4,20,4,21],[4,22,4,23],[0,1,0,2],[5,2,5,4],[5,5,5,7],[5,9,5,14],[5,15,5,17],[2,1,2,24],[3,2,3,4],[3,5,3,8],[3,9,3,14],[3,15,3,18],[3,19,3,21],[3,22,3,23],[5,19,5,21],[5,22,5,23],[4,2,4,4],[4,5,4,8]]}
[null,{"$f":"Setup!A2","v":"ESB-21"}]
[]
[null,"Draindown AASHTO T305"]
[null,null,"Producer;",null,null,{"$f":"Setup!E7","v":0},null,null,null,"Material Class:",null,null,null,null,null,{"$f":"Setup!E11","v":0},null,null,null,"JMF",null,null,{"$f":"Setup!E5","v":0}]
[null,null,"Designed By:",null,null,{"$f":"Setup!E9","v":0},null,null,null,"Esals:",null,null,null,null,null,{"$f":"Setup!E13","v":0},null,null,null,null,"SRL:",null,{"$f":"Setup!E12","v":0}]
[null,null,"Date:",null,null,{"$f":"Setup!E6","v":"00:00:00"},null,null,null,"Rap:",null,null,null,null,null,{"$f":"Setup!E18","v":0},null,null,null,"PG Grade:",null,null,{"$f":"Setup!E15","v":0}]
[]
[null,"AASHTO T305 is to be determine for 6.33mm mixes with greater than 7.0% asphalt content and all SMA mixes"]
[]
[null,null,null,null,null,null,null,null,null,"Anticipated Plant Production Temperature"]
[null,null,null,null,null,null,null,null,null,"Sample No.",null,null,null,null,1,null,2]
[null,null,null,null,null,null,null,null,null,"Temperature of Sample"]
[null,null,null,null,null,null,null,null,null,"Initial Wt of Sample"]
[null,null,null,null,null,null,null,null,null,"Wt. of sample after 1 hour"]
[null,null,null,null,null,null,null,null,null,"Wt. of draindown",null,null,null,null,{"$f":"IF(O14,O13-O14,\"\")","v":""},null,{"$f":"IF(Q14,Q13-Q14,\"\")","v":""}]
[null,null,null,null,null,null,null,null,null,"% Draindown",null,null,null,null,{"$f":"(O15/O13)*100","v":{"$error":"#VALUE!"}},null,{"$f":"(Q15/Q13)*100","v":{"$error":"#VALUE!"}}]
[null,null,null,null,null,null,null,null,null,"Average draindown",null,null,null,null,{"$f":"AVERAGE(O16:R16)","v":{"$error":"#VALUE!"}}]
[]
[]
[null,null,null,null,null,null,null,null,null,"Elevated Temperature (+27 F)"]
[null,null,null,null,null,null,null,null,null,"Sample No.",null,null,null,null,1,null,2]
[null,null,null,null,null,null,null,null,null,"Temperature of Sample"]
[null,null,null,null,null,null,null,null,null,"Initial Wt of Sample"]
[null,null,null,null,null,null,null,null,null,"Wt. of sample after 1 hour"]
[null,null,null,null,null,null,null,null,null,"Wt. of draindown",null,null,null,null,{"$f":"IF(O24,O23-O24,\"\")","v":""},null,{"$f":"IF(Q24,Q23-Q24,\"\")","v":""}]
[null,null,null,null,null,null,null,null,null,"% Draindown",null,null,null,null,{"$f":"(O25/O23)*100","v":{"$error":"#VALUE!"}},null,{"$f":"(Q25/Q23)*100","v":{"$error":"#VALUE!"}}]
[null,null,null,null,null,null,null,null,null,"Average draindown",null,null,null,null,{"$f":"AVERAGE(O26:R26)","v":{"$error":"#VALUE!"}}]

{"sheet":"T-283","index":15,"n_rows":185,"n_cols":39,"rows_kept":185,"cut":false,"hidden":false,"merged":[[43,0,43,3],[43,4,43,6],[3,15,3,18],[48,21,48,23],[48,18,48,20],[48,15,48,17],[48,12,48,14],[48,9,48,11],[48,6,48,8],[48,0,48,5],[44,11,44,17],[7,21,7,23],[14,12,14,14],[14,15,14,17],[14,18,14,20],[14,21,14,23],[12,21,12,23],[10,12,10,14],[10,15,10,17],[10,18,10,20],[10,21,10,23],[11,21,11,23],[8,12,8,14],[11,2,11,5],[49,6,49,8],[49,9,49,11],[49,12,49,14],[49,15,49,17],[49,18,49,20],[49,21,49,23],[49,0,49,5],[46,6,46,14],[46,15,46,23],[47,6,47,8],[47,9,47,11],[47,12,47,14],[47,15,47,17],[47,18,47,20],[47,21,47,23],[12,2,12,5],[15,21,15,23],[14,2,14,5],[15,2,15,5],[13,21,13,23],[13,18,13,20],[13,15,13,17],[13,12,13,14],[13,9,13,11],[13,6,13,8],[14,6,14,8],[14,9,14,11],[13,2,13,5],[15,6,15,8],[15,9,15,11],[15,12,15,14],[15,15,15,17],[15,18,15,20],[8,21,8,23],[10,6,10,8],[10,9,10,11],[12,6,12,8],[12,9,12,11],[12,12,12,14],[12,15,12,17],[12,18,12,20],[9,21,9,23],[9,18,9,20],[9,15,9,17],[9,12,9,14],[11,6,11,8],[11,9,11,11],[11,12,11,14],[11,15,11,17],[11,18,11,20],[8,9,8,11],[9,9,9,11],[9,6,9,8],[8,15,8,17],[8,18,8,20],[5,2,5,4],[5,5,5,7],[5,9,5,14],[8,2,8,5],[9,2,9,5],[10,2,10,5],[7,13,7,20],[0,1,0,2],[2,1,2,24],[3,2,3,4],[3,5,3,8],[3,9,3,14],[3,19,3,21],[3,22,3,23],[5,15,5,17],[5,19,5,21],[5,22,5,23],[4,2,4,4],[4,5,4,8],[4,9,4,14],[4,15,4,17],[4,20,4,21],[4,22,4,23],[8,6,8,8],[19,15,19,23],[22,6,22,8],[22,15,22,17],[22,3,22,5],[21,12,21,14],[21,15,21,17],[21,18,21,20],[21,21,21,23],[20,3,20,5],[21,3,21,5],[20,21,20,23],[20,18,20,20],[20,15,20,17],[20,12,20,14],[20,9,20,11],[20,6,20,8],[21,6,21,8],[21,9,21,11],[19,6,19,14],[27,3,27,14],[28,3,28,14],[29,3,29,14],[30,4,30,14],[24,15,24,23],[26,15,26,23],[27,21,27,23],[27,18,27,20],[27,15,27,17],[30,21,30,23],[30,18,30,20],[30,15,30,17],[29,21,29,23],[29,18,29,20],[29,15,29,17],[28,21,28,23],[28,18,28,20],[28,15,28,17],[36,15,36,17],[34,6,34,14],[34,15,34,23],[35,6,35,8],[35,9,35,11],[35,12,35,14],[35,15,35,17],[35,18,35,20],[35,21,35,23],[17,2,18,23],[32,6,32,23],[39,15,39,23],[39,6,39,14],[39,1,39,5],[41,14,41,15],[41,8,41,13],[35,1,35,5],[38,1,38,5],[37,1,37,5],[36,1,36,5],[38,6,38,14],[38,15,38,23],[36,18,36,20],[36,21,36,23],[37,6,37,8],[37,15,37,17],[37,9,37,11],[37,12,37,14],[37,18,37,20],[37,21,37,23],[36,6,36,8],[36,9,36,11],[36,12,36,14],[52,13,52,20],[52,21,52,23],[53,2,53,5],[53,6,53,8],[53,9,53,11],[53,12,53,14],[53,15,53,17],[53,18,53,20],[53,21,53,23],[52,2,52,8],[52,9,52,12],[54,2,54,5],[54,6,54,8],[54,9,54,11],[54,12,54,14],[54,15,54,17],[54,18,54,20],[54,21,54,23],[55,2,55,5],[55,6,55,8],[55,9,55,11],[55,12,55,14],[55,15,55,17],[55,18,55,20],[55,21,55,23],[56,2,56,5],[56,6,56,8],[56,9,56,11],[56,12,56,14],[56,15,56,17],[56,18,56,20],[56,21,56,23],[57,2,57,5],[57,6,57,8],[57,9,57,11],[57,12,57,14],[57,15,57,17],[57,18,57,20],[57,21,57,23],[58,2,58,5],[58,6,58,8],[58,9,58,11],[58,12,58,14],[58,15,58,17],[58,18,58,20],[58,21,58,23],[59,2,59,5],[59,6,59,8],[59,9,59,11],[59,12,59,14],[59,15,59,17],[59,18,59,20],[59,21,59,23],[60,2,60,5],[60,6,60,8],[60,9,60,11],[60,12,60,14],[60,15,60,17],[60,18,60,20],[60,21,60,23],[62,2,63,23],[64,6,64,14],[64,15,64,23],[65,3,65,5],[65,6,65,8],[65,9,65,11],[65,12,65,14],[65,15,65,17],[65,18,65,20],[65,21,65,23],[66,3,66,5],[66,6,66,8],[66,9,66,11],[66,12,66,14],[66,15,66,17],[66,18,66,20],[66,21,66,23],[67,3,67,5],[67,6,67,8],[67,15,67,17],[69,15,69,23],[71,15,71,23],[72,3,72,14],[72,15,72,17],[72,18,72,20],[72,21,72,23],[73,3,73,14],[73,15,73,17],[73,18,73,20],[73,21,73,23],[74,3,74,14],[74,15,74,17],[74,18,74,20],[74,21,74,23],[75,4,75,14],[75,15,75,17],[75,18,75,20],[75,21,75,23],[77,6,77,23],[79,6,79,14],[79,15,79,23],[80,1,80,5],[80,6,80,8],[80,9,80,11],[80,12,80,14],[80,15,80,17],[80,18,80,20],[80,21,80,23],[81,1,81,5],[81,6,81,8],[81,9,81,11],[81,12,81,14],[81,15,81,17],[81,18,81,20],[81,21,81,23],[82,1,82,5],[82,6,82,8],[82,9,82,11],[82,12,82,14],[82,15,82,17],[82,18,82,20],[82,21,82,23],[83,1,83,5],[83,6,83,14],[83,15,83,23],[84,1,84,5],[84,6,84,14],[84,15,84,23],[86,8,86,13],[86,14,86,15],[88,0,88,3],[88,4,88,6],[89,11,89,17],[91,6,91,14],[91,15,91,23],[92,6,92,8],[92,9,92,11],[92,12,92,14],[92,15,92,17],[92,18,92,20],[92,21,92,23],[93,0,93,5],[93,6,93,8],[93,9,93,11],[93,12,93,14],[93,15,93,17],[93,18,93,20],[93,21,93,23],[94,0,94,5],[94,6,94,8],[94,9,94,11],[94,12,94,14],[94,15,94,17],[94,18,94,20],[94,21,94,23],[97,13,97,20],[97,21,97,23],[98,2,98,5],[98,6,98,8],[98,9,98,11],[98,12,98,14],[98,15,98,17],[98,18,98,20],[98,21,98,23],[97,2,97,8],[97,9,97,12],[99,2,99,5],[99,6,99,8],[99,9,99,11],[99,12,99,14],[99,15,99,17],[99,18,99,20],[99,21,99,23],[100,2,100,5],[100,6,100,8],[100,9,100,11],[100,12,100,14],[100,15,100,17],[100,18,100,20],[100,21,100,23],[101,2,101,5],[101,6,101,8],[101,9,101,11],[101,12,101,14],[101,15,101,17],[101,18,101,20],[101,21,101,23],[102,2,102,5],[102,6,102,8],[102,9,102,11],[102,12,102,14],[102,15,102,17],[102,18,102,20],[102,21,102,23],[103,2,103,5],[103,6,103,8],[103,9,103,11],[103,12,103,14],[103,15,103,17],[103,18,103,20],[103,21,103,23],[104,2,104,5],[104,6,104,8],[104,9,104,11],[104,12,104,14],[104,15,104,17],[104,18,104,20],[104,21,104,23],[105,2,105,5],[105,6,105,8],[105,9,105,11],[105,12,105,14],[105,15,105,17],[105,18,105,20],[105,21,105,23],[107,2,108,23],[109,6,109,14],[109,15,109,23],[110,3,110,5],[110,6,110,8],[110,9,110,11],[110,12,110,14],[110,15,110,17],[110,18,110,20],[110,21,110,23],[111,3,111,5],[111,6,111,8],[111,9,111,11],[111,12,111,14],[111,15,111,17],[111,18,111,20],[111,21,111,23],[112,3,112,5],[112,6,112,8],[112,15,112,17],[114,15,114,23],[116,15,116,23],[117,3,117,14],[117,15,117,17],[117,18,117,20],[117,21,117,23],[118,3,118,14],[118,15,118,17],[118,18,118,20],[118,21,118,23],[119,3,119,14],[119,15,119,17],[119,18,119,20],[119,21,119,23],[120,4,120,14],[120,15,120,17],[120,18,120,20],[120,21,120,23],[122,6,122,23],[124,6,124,14],[124,15,124,23],[125,1,125,5],[125,6,125,8],[125,9,125,11],[125,12,125,14],[125,15,125,17],[125,18,125,20],[125,21,125,23],[126,1,126,5],[126,6,126,8],[126,9,126,11],[126,12,126,14],[126,15,126,17],[126,18,126,20],[126,21,126,23],[127,1,127,5],[127,6,127,8],[127,9,127,11],[127,12,127,14],[127,15,127,17],[127,18,127,20],[127,21,127,23],[128,1,128,5],[128,6,128,14],[128,15,128,23],[129,1,129,5],[129,6,129,14],[129,15,129,23],[131,8,131,13],[131,14,131,15],[133,0,133,3],[133,4,133,6],[134,11,134,17],[136,6,136,14],[136,15,136,23],[137,6,137,8],[137,9,137,11],[137,12,137,14],[137,15,137,17],[137,18,137,20],[137,21,137,23],[138,0,138,5],[138,6,138,8],[138,9,138,11],[138,12,138,14],[138,15,138,17],[138,18,138,20],[138,21,138,23],[139,0,139,5],[139,6,139,8],[139,9,139,11],[139,12,139,14],[139,15,139,17],[139,18,139,20],[139,21,139,23],[142,13,142,20],[142,21,142,23],[143,2,143,5],[143,6,143,8],[143,9,143,11],[143,12,143,14],[143,15,143,17],[143,18,143,20],[143,21,143,23],[142,2,142,8],[142,9,142,12],[144,2,144,5],[144,6,144,8],[144,9,144,11],[144,12,144,14],[144,15,144,17],[144,18,144,20],[144,21,144,23],[145,2,145,5],[145,6,145,8],[145,9,145,11],[145,12,145,14],[145,15,145,17],[145,18,145,20],[145,21,145,23],[146,2,146,5],[146,6,146,8],[146,9,146,11],[146,12,146,14],[146,15,146,17],[146,18,146,20],[146,21,146,23],[147,2,147,5],[147,6,147,8],[147,9,147,11],[147,12,147,14],[147,15,147,17],[147,18,147,20],[147,21,147,23],[148,2,148,5],[148,6,148,8],[148,9,148,11],[148,12,148,14],[148,15,148,17],[148,18,148,20],[148,21,148,23],[149,2,149,5],[149,6,149,8],[149,9,149,11],[149,12,149,14],[149,15,149,17],[149,18,149,20],[149,21,149,23],[150,2,150,5],[150,6,150,8],[150,9,150,11],[150,12,150,14],[150,15,150,17],[150,18,150,20],[150,21,150,23],[152,2,153,23],[154,6,154,14],[154,15,154,23],[155,3,155,5],[155,6,155,8],[155,9,155,11],[155,12,155,14],[155,15,155,17],[155,18,155,20],[155,21,155,23],[156,3,156,5],[156,6,156,8],[156,9,156,11],[156,12,156,14],[156,15,156,17],[156,18,156,20],[156,21,156,23],[157,3,157,5],[157,6,157,8],[157,15,157,17],[159,15,159,23],[161,15,161,23],[162,3,162,14],[162,15,162,17],[162,18,162,20],[162,21,162,23],[163,3,163,14],[163,15,163,17],[163,18,163,20],[163,21,163,23],[164,3,164,14],[164,15,164,17],[164,18,164,20],[164,21,164,23],[165,4,165,14],[165,15,165,17],[165,18,165,20],[165,21,165,23],[167,6,167,23],[169,6,169,14],[169,15,169,23],[170,1,170,5],[170,6,170,8],[170,9,170,11],[170,12,170,14],[170,15,170,17],[170,18,170,20],[170,21,170,23],[171,18,171,20],[171,21,171,23],[172,1,172,5],[172,6,172,8],[172,9,172,11],[172,12,172,14],[172,15,172,17],[172,18,172,20],[172,21,172,23],[183,21,183,23],[184,0,184,5],[184,6,184,8],[184,9,184,11],[184,12,184,14],[184,15,184,17],[184,18,184,20],[184,21,184,23],[179,11,179,17],[181,6,181,14],[181,15,181,23],[182,6,182,8],[182,9,182,11],[182,12,182,14],[182,15,182,17],[182,18,182,20],[182,21,182,23],[51,12,51,14],[96,12,96,14],[141,12,141,14],[183,0,183,5],[183,6,183,8],[183,9,183,11],[183,12,183,14],[183,15,183,17],[183,18,183,20],[173,1,173,5],[173,6,173,14],[173,15,173,23],[174,1,174,5],[174,6,174,14],[174,15,174,23],[176,8,176,13],[176,14,176,15],[178,0,178,3],[178,4,178,6],[171,1,171,5],[171,6,171,8],[171,9,171,11],[171,12,171,14],[171,15,171,17]]}
[null,{"$f":"Setup!A2","v":"ESB-21"}]
[]
[null,"AASHTO T 283"]
[null,null,"Producer;",null,null,{"$f":"Setup!E7","v":0},null,null,null,"Material Class:",null,null,null,null,null,{"$f":"Setup!E11","v":0},null,null,null,"JMF",null,null,{"$f":"Setup!E5","v":0}]
[null,null,"Designed By:",null,null,{"$f":"Setup!E9","v":0},null,null,null,"Esals:",null,null,null,null,null,{"$f":"Setup!E13","v":0},null,null,null,null,"SRL:",null,{"$f":"Setup!E12","v":0}]
[null,null,"Date:",null,null,{"$f":"Setup!E6","v":"00:00:00"},null,null,null,"Rap:",null,null,null,null,null,{"$f":"Setup!E18","v":0},null,null,null,"PG Grade:",null,null,{"$f":"Setup!E15","v":0}]
[]
[null,null,null,null,null,null,null,null,null,null,null,null,null,"Maximum Theoretical Gravity (Gmm) ="]
[null,null,"Specimen No.",null,null,null,1,null,null,2,null,null,3,null,null,4,null,null,5,null,null,6]
[null,null,"Height of Specimen"]
[null,null,"Mass in Air"]
[null,null,"Mass in H2O"]
[null,null,"Mass at SSD"]
[null,null,"Bulk Sp. Gr.",null,null,null,{"$f":"IF(G13,ROUND(G11/(G13-G12),3),\" \")","v":" "},null,null,{"$f":"IF(J13,ROUND(J11/(J13-J12),3),\" \")","v":" "},null,null,{"$f":"IF(M13,ROUND(M11/(M13-M12),3),\" \")","v":" "},null,null,{"$f":"IF(P13,ROUND(P11/(P13-P12),3),\" \")","v":" "},null,null,{"$f":"IF(S13,ROUND(S11/(S13-S12),3),\" \")","v":" "},null,null,{"$f":"IF(V13,ROUND(V11/(V13-V12),3),\" \")","v":" "}]
[null,null,"Voids ",null,null,null,{"$f":"IF(G13,ROUND(100-(G14/$V$8*100),1),\" \")","v":" "},null,null,{"$f":"IF(J13,ROUND(100-(J14/$V$8*100),1),\" \")","v":" "},null,null,{"$f":"IF(M13,ROUND(100-(M14/$V$8*100),1),\" \")","v":" "},null,null,{"$f":"IF(P13,ROUND(100-(P14/$V$8*100),1),\" \")","v":" "},null,null,{"$f":"IF(S13,ROUND(100-(S14/$V$8*100),1),\" \")","v":" "},null,null,{"$f":"IF(V13,ROUND(100-(V14/$V$8*100),1),\" \")","v":" "}]
[null,null,"Volume of Air Voids",null,null,null,{"$f":"IF(G13,(G13-G12)-(G11/$V$8),\"\")","v":""},null,null,{"$f":"IF(J13,(J13-J12)-(J11/$V$8),\"\")","v":""},null,null,{"$f":"IF(M13,(M13-M12)-(M11/$V$8),\"\")","v":""},null,null,{"$f":"IF(P13,(P13-P12)-(P11/$V$8),\"\")","v":""},null,null,{"$f":"IF(S13,(S13-S12)-(S11/$V$8),\"\")","v":""},null,null,{"$f":"IF(V13,(V13-V12)-(V11/$V$8),\"\")","v":""}]
[]
[null,null,"Group specimens into 2 subsets of 3 specimens each, so the average voids of the 2 subset are approx. equal"]
[]
[null,null,null,null,null,null,"Unconditioned Set",null,null,null,null,null,null,null,null,"Conditioned Set"]
[null,null,null,"Specimen No."]
[null,null,null,"Voids",null,null,{"$f":"IF(G21,CHOOSE(G21,$G$15,$J$15,$M$15,$P$15,$S$15,$V$15),\" \")","v":" "},null,null,{"$f":"IF(J21,CHOOSE(J21,$G$15,$J$15,$M$15,$P$15,$S$15,$V$15),\" \")","v":" "},null,null,{"$f":"IF(M21,CHOOSE(M21,$G$15,$J$15,$M15,$P$15,$S$15,$V$15),\" \")","v":" "},null,null,{"$f":"IF(P21,CHOOSE(P21,$G$15,$J$15,$M15,$P$15,$S$15,$V$15),\" \")","v":" "},null,null,{"$f":"IF(S21,CHOOSE(S21,$G$15,$J$15,$M15,$P$15,$S$15,$V$15),\" \")","v":" "},null,null,{"$f":"IF(V21,CHOOSE(V21,$G$15,$J$15,$M15,$P$15,$S$15,$V$15),\" \")","v":" "}]
[null,null,null,"Average voids",null,null,{"$f":"IF(ISTEXT(G22),\"\",AVERAGE(G22:O22))","v":""},null,null,null,null,null,null,null,null,{"$f":"IF(ISTEXT(P22),\"\",AVERAGE(P22:X22))","v":""}]
[]
[null,null,null,null,null,null,null,null,null,null,null,null,null,null,null,"Saturation of Conditioned Set"]
[]
[null,null,null,null,null,null,null,null,null,null,null,null,null,null,null,"Conditioned Set"]
[null,null,null,"Specimen number",null,null,null,null,null,null,null,null,null,null,null,{"$f":"IF(P21,P21,\"\")","v":""},null,null,{"$f":"IF(S21,S21,\"\")","v":""},null,null,{"$f":"IF(V21,V21,\"\")","v":""}]
[null,null,null,"SSD Mass After Partial Vacuum"]
[null,null,null,"Volume of Water Absorbed (cc)",null,null,null,null,null,null,null,null,null,null,null,{"$f":"IF(P29,P29-CHOOSE(P21,$G$11,$J$11,$M$11,$P$11,$S$11,$V$11,),\" \")","v":" "},null,null,{"$f":"IF(S29,S29-CHOOSE(S21,$G$11,$J$11,$M$11,$P$11,$S$11,$V$11,),\" \")","v":" "},null,null,{"$f":"IF(V29,V29-CHOOSE(V21,$G$11,$J$11,$M$11,$P$11,$S$11,$V$11,),\" \")","v":" "}]
[null,null,null,null,"% Saturation",null,null,null,null,null,null,null,null,null,null,{"$f":"IF(P29,100*P30/CHOOSE(P21,$G$16,$J$16,$M$16,$P$16,$S$16,$V$16,),\" \")","v":" "},null,null,{"$f":"IF(S29,100*S30/CHOOSE(S21,$G$16,$J$16,$M$16,$P$16,$S$16,$V$16,),\" \")","v":" "},null,null,{"$f":"IF(V29,100*V30/CHOOSE(V21,$G$16,$J$16,$M$16,$P$16,$S$16,$V$16,),\" \")","v":" "}]
[]
[null,null,null,null,null,null,"Tensile Strength Ratio"]
[]
[null,null,null,null,null,null,"Unconditioned Set",null,null,null,null,null,null,null,null,"Conditioned Set"]
[null,"Specimen No.",null,null,null,null,{"$f":"IF(G21,G21,\"\")","v":""},null,null,{"$f":"IF(J21,J21,\"\")","v":""},null,null,{"$f":"IF(M21,M21,\"\")","v":""},null,null,{"$f":"IF(P21,P21,\"\")","v":""},null,null,{"$f":"IF(S21,S21,\"\")","v":""},null,null,{"$f":"IF(V21,V21,\"\")","v":""}]
[null,"Load (lbs)"]
[null,"Tensile Strength (psi)",null,null,null,null,{"$f":"IF(G37,2*G37/(CHOOSE(G36,$G$10,$J$10,$M$10,$P$10,$S$10,$V$10,)*3.141592654/25.4*6),\" \")","v":" "},null,null,{"$f":"IF(J37,2*J37/(CHOOSE(J36,$G$10,$J$10,$M$10,$P$10,$S$10,$V$10,)*3.141592654/25.4*6),\" \")","v":" "},null,null,{"$f":"IF(M37,2*M37/(CHOOSE(M36,$G$10,$J$10,$M$10,$P$10,$S$10,$V$10,)*3.141592654/25.4*6),\" \")","v":" "},null,null,{"$f":"IF(P37,2*P37/(CHOOSE(P36,$G$10,$J$10,$M$10,$P$10,$S$10,$V$10,)*3.141592654/25.4*6),\" \")","v":" "},null,null,{"$f":"IF(S37,2*S37/(CHOOSE(S36,$G$10,$J$10,$M$10,$P$10,$S$10,$V$10,)*3.141592654/25.4*6),\" \")","v":" "},null,null,{"$f":"IF(V37,2*V37/(CHOOSE(V36,$G$10,$J$10,$M$10,$P$10,$S$10,$V$10,)*3.141592654/25.4*6),\" \")","v":" "}]
[null,"Average psi",null,null,null,null,{"$f":"IF(G37,AVERAGE(G38:O38),\"\")","v":""},null,null,null,null,null,null,null,null,{"$f":"IF(P37,AVERAGE(P38:X38),\"\")","v":""}]
[null,"Coefficient of Variation",null,null,null,null,{"$f":"IF(G37,STDEV(G38:O38)/G39,\" \")","v":" "},null,null,null,null,null,null,null,null,{"$f":"IF(P37,STDEV(P38:X38)/P39,\" \")","v":" "}]
[]
[null,null,null,null,null,null,null,null,"Tensile Strength Ratio=",null,null,null,null,null,{"$f":"IF(G37,100*(P39/G39),\" \")","v":" "}]
[]
["Date of Breaks"]
[null,null,null,null,null,null,null,null,null,null,null,"Visual Observations"]
[]
[null,null,null,null,null,null,"Unconditioned Set",null,null,null,null,null,null,null,null,"Conditioned Set"]
[null,null,null,null,null,null,{"$f":"IF(G21,G21,\"\")","v":""},null,null,{"$f":"IF(J21,J21,\"\")","v":""},null,null,{"$f":"IF(M21,M21,\"\")","v":""},null,null,{"$f":"IF(P21,P21,\"\")","v":""},null,null,{"$f":"IF(S21,S21,\"\")","v":""},null,null,{"$f":"IF(V21,V21,\"\")","v":""}]
["Visual Damage (0 to 5 rating)",null,null,null,null,null,null,null,null,null,null,null,null,null,null,null,null,null,null,null,null,null,null,null,null,null,null,null,null,null,null,null,null,null,null,null,0]
["Cracked / Broken Agg.",null,null,null,null,null,null,null,null,null,null,null,null,null,null,null,null,null,null,null,null,null,null,null,null,null,null,null,null,null,null,null,null,null,null,null,1,null,"Yes "]
[null,null,null,null,null,null,null,null,null,null,null,null,null,null,null,null,null,null,null,null,null,null,null,null,null,null,null,null,null,null,null,null,null,null,null,null,2,null,"No"]
[null,null,null,null,null,null,null,null,null,null,null,null,"TSR's 2",null,null,null,null,null,null,null,null,null,null,null,null,null,null,null,null,null,null,null,null,null,null,null,3]
[null,null,"Asphalt Supplier Code",null,null,null,null,null,null,null,null,null,null,"Maximum Theoretical Gravity (Gmm) =",null,null,null,null,null,null,null,null,null,null,null,null,null,null,null,null,null,null,null,null,null,null,4]
[null,null,"Specimen No.",null,null,null,1,null,null,2,null,null,3,null,null,4,null,null,5,null,null,6,null,null,null,null,null,null,null,null,null,null,null,null,null,null,5]
[null,null,"Height of Specimen"]
[null,null,"Mass in Air"]
[null,null,"Mass in H2O"]
[null,null,"Mass at SSD"]
[null,null,"Bulk Sp. Gr.",null,null,null,{"$f":"IF(G58,ROUND(G56/(G58-G57),3),\" \")","v":" "},null,null,{"$f":"IF(J58,ROUND(J56/(J58-J57),3),\" \")","v":" "},null,null,{"$f":"IF(M58,ROUND(M56/(M58-M57),3),\" \")","v":" "},null,null,{"$f":"IF(P58,ROUND(P56/(P58-P57),3),\" \")","v":" "},null,null,{"$f":"IF(S58,ROUND(S56/(S58-S57),3),\" \")","v":" "},null,null,{"$f":"IF(V58,ROUND(V56/(V58-V57),3),\" \")","v":" "}]
[null,null,"Voids ",null,null,null,{"$f":"IF(G58,ROUND(100-(G59/$V$8*100),1),\" \")","v":" "},null,null,{"$f":"IF(J58,ROUND(100-(J59/$V$8*100),1),\" \")","v":" "},null,null,{"$f":"IF(M58,ROUND(100-(M59/$V$8*100),1),\" \")","v":" "},null,null,{"$f":"IF(P58,ROUND(100-(P59/$V$8*100),1),\" \")","v":" "},null,null,{"$f":"IF(S58,ROUND(100-(S59/$V$8*100),1),\" \")","v":" "},null,null,{"$f":"IF(V58,ROUND(100-(V59/$V$8*100),1),\" \")","v":" "}]
[null,null,"Volume of Air Voids",null,null,null,{"$f":"IF(G58,(G58-G57)-(G56/$V$8),\"\")","v":""},null,null,{"$f":"IF(J58,(J58-J57)-(J56/$V$8),\"\")","v":""},null,null,{"$f":"IF(M58,(M58-M57)-(M56/$V$8),\"\")","v":""},null,null,{"$f":"IF(P58,(P58-P57)-(P56/$V$8),\"\")","v":""},null,null,{"$f":"IF(S58,(S58-S57)-(S56/$V$8),\"\")","v":""},null,null,{"$f":"IF(V58,(V58-V57)-(V56/$V$8),\"\")","v":""}]
[]
[null,null,"Group specimens into 2 subsets of 3 specimens each, so the average voids of the 2 subset are approx. equal"]
[]
[null,null,null,null,null,null,"Unconditioned Set",null,null,null,null,null,null,null,null,"Conditioned Set"]
[null,null,null,"Specimen No."]
[null,null,null,"Voids",null,null,{"$f":"IF(G66,CHOOSE(G66,$G$15,$J$15,$M$15,$P$15,$S$15,$V$15),\" \")","v":" "},null,null,{"$f":"IF(J66,CHOOSE(J66,$G$15,$J$15,$M$15,$P$15,$S$15,$V$15),\" \")","v":" "},null,null,{"$f":"IF(M66,CHOOSE(M66,$G$15,$J$15,$M60,$P$15,$S$15,$V$15),\" \")","v":" "},null,null,{"$f":"IF(P66,CHOOSE(P66,$G$15,$J$15,$M60,$P$15,$S$15,$V$15),\" \")","v":" "},null,null,{"$f":"IF(S66,CHOOSE(S66,$G$15,$J$15,$M60,$P$15,$S$15,$V$15),\" \")","v":" "},null,null,{"$f":"IF(V66,CHOOSE(V66,$G$15,$J$15,$M60,$P$15,$S$15,$V$15),\" \")","v":" "}]
[null,null,null,"Average voids",null,null,{"$f":"IF(ISTEXT(G67),\"\",AVERAGE(G67:O67))","v":""},null,null,null,null,null,null,null,null,{"$f":"IF(ISTEXT(P67),\"\",AVERAGE(P67:X67))","v":""}]
[]
[null,null,null,null,null,null,null,null,null,null,null,null,null,null,null,"Saturation of Conditioned Set"]
[]
[null,null,null,null,null,null,null,null,null,null,null,null,null,null,null,"Conditioned Set"]
[null,null,null,"Specimen number",null,null,null,null,null,null,null,null,null,null,null,{"$f":"IF(P66,P66,\"\")","v":""},null,null,{"$f":"IF(S66,S66,\"\")","v":""},null,null,{"$f":"IF(V66,V66,\"\")","v":""}]
[null,null,null,"SSD Mass After Partial Vacuum"]
[null,null,null,"Volume of Water Absorbed (cc)",null,null,null,null,null,null,null,null,null,null,null,{"$f":"IF(P74,P74-CHOOSE(P66,$G$11,$J$11,$M$11,$P$11,$S$11,$V$11,),\" \")","v":" "},null,null,{"$f":"IF(S74,S74-CHOOSE(S66,$G$11,$J$11,$M$11,$P$11,$S$11,$V$11,),\" \")","v":" "},null,null,{"$f":"IF(V74,V74-CHOOSE(V66,$G$11,$J$11,$M$11,$P$11,$S$11,$V$11,),\" \")","v":" "}]
[null,null,null,null,"% Saturation",null,null,null,null,null,null,null,null,null,null,{"$f":"IF(P74,100*P75/CHOOSE(P66,$G$16,$J$16,$M$16,$P$16,$S$16,$V$16,),\" \")","v":" "},null,null,{"$f":"IF(S74,100*S75/CHOOSE(S66,$G$16,$J$16,$M$16,$P$16,$S$16,$V$16,),\" \")","v":" "},null,null,{"$f":"IF(V74,100*V75/CHOOSE(V66,$G$16,$J$16,$M$16,$P$16,$S$16,$V$16,),\" \")","v":" "}]
[]
[null,null,null,null,null,null,"Tensile Strength Ratio"]
[]
[null,null,null,null,null,null,"Unconditioned Set",null,null,null,null,null,null,null,null,"Conditioned Set"]
[null,"Specimen No.",null,null,null,null,{"$f":"IF(G66,G66,\"\")","v":""},null,null,{"$f":"IF(J66,J66,\"\")","v":""},null,null,{"$f":"IF(M66,M66,\"\")","v":""},null,null,{"$f":"IF(P66,P66,\"\")","v":""},null,null,{"$f":"IF(S66,S66,\"\")","v":""},null,null,{"$f":"IF(V66,V66,\"\")","v":""}]
[null,"Load (lbs)"]
[null,"Tensile Strength (psi)",null,null,null,null,{"$f":"IF(G82,2*G82/(CHOOSE(G81,$G$10,$J$10,$M$10,$P$10,$S$10,$V$10,)*3.141592654/25.4*6),\" \")","v":" "},null,null,{"$f":"IF(J82,2*J82/(CHOOSE(J81,$G$10,$J$10,$M$10,$P$10,$S$10,$V$10,)*3.141592654/25.4*6),\" \")","v":" "},null,null,{"$f":"IF(M82,2*M82/(CHOOSE(M81,$G$10,$J$10,$M$10,$P$10,$S$10,$V$10,)*3.141592654/25.4*6),\" \")","v":" "},null,null,{"$f":"IF(P82,2*P82/(CHOOSE(P81,$G$10,$J$10,$M$10,$P$10,$S$10,$V$10,)*3.141592654/25.4*6),\" \")","v":" "},null,null,{"$f":"IF(S82,2*S82/(CHOOSE(S81,$G$10,$J$10,$M$10,$P$10,$S$10,$V$10,)*3.141592654/25.4*6),\" \")","v":" "},null,null,{"$f":"IF(V82,2*V82/(CHOOSE(V81,$G$10,$J$10,$M$10,$P$10,$S$10,$V$10,)*3.141592654/25.4*6),\" \")","v":" "}]
[null,"Average psi",null,null,null,null,{"$f":"IF(G82,AVERAGE(G83:O83),\"\")","v":""},null,null,null,null,null,null,null,null,{"$f":"IF(P82,AVERAGE(P83:X83),\"\")","v":""}]
[null,"Coefficient of Variation",null,null,null,null,{"$f":"IF(G82,STDEV(G83:O83)/G84,\" \")","v":" "},null,null,null,null,null,null,null,null,{"$f":"IF(P82,STDEV(P83:X83)/P84,\" \")","v":" "}]
[]
[null,null,null,null,null,null,null,null,"Tensile Strength Ratio=",null,null,null,null,null,{"$f":"IF(G82,100*(P84/G84),\" \")","v":" "}]
[]
["Date of Breaks"]
[null,null,null,null,null,null,null,null,null,null,null,"Visual Observations"]
[]
[null,null,null,null,null,null,"Unconditioned Set",null,null,null,null,null,null,null,null,"Conditioned Set"]
[null,null,null,null,null,null,{"$f":"IF(G66,G66,\"\")","v":""},null,null,{"$f":"IF(J66,J66,\"\")","v":""},null,null,{"$f":"IF(M66,M66,\"\")","v":""},null,null,{"$f":"IF(P66,P66,\"\")","v":""},null,null,{"$f":"IF(S66,S66,\"\")","v":""},null,null,{"$f":"IF(V66,V66,\"\")","v":""}]
["Visual Damage (0 to 5 rating)"]
["Cracked / Broken Agg."]
[]
[null,null,null,null,null,null,null,null,null,null,null,null,"TSR's 3"]
[null,null,"Asphalt Supplier Code",null,null,null,null,null,null,null,null,null,null,"Maximum Theoretical Gravity (Gmm) ="]
[null,null,"Specimen No.",null,null,null,1,null,null,2,null,null,3,null,null,4,null,null,5,null,null,6]
[null,null,"Height of Specimen"]
[null,null,"Mass in Air"]
[null,null,"Mass in H2O"]
[null,null,"Mass at SSD"]
[null,null,"Bulk Sp. Gr.",null,null,null,{"$f":"IF(G103,ROUND(G101/(G103-G102),3),\" \")","v":" "},null,null,{"$f":"IF(J103,ROUND(J101/(J103-J102),3),\" \")","v":" "},null,null,{"$f":"IF(M103,ROUND(M101/(M103-M102),3),\" \")","v":" "},null,null,{"$f":"IF(P103,ROUND(P101/(P103-P102),3),\" \")","v":" "},null,null,{"$f":"IF(S103,ROUND(S101/(S103-S102),3),\" \")","v":" "},null,null,{"$f":"IF(V103,ROUND(V101/(V103-V102),3),\" \")","v":" "}]
[null,null,"Voids ",null,null,null,{"$f":"IF(G103,ROUND(100-(G104/$V$8*100),1),\" \")","v":" "},null,null,{"$f":"IF(J103,ROUND(100-(J104/$V$8*100),1),\" \")","v":" "},null,null,{"$f":"IF(M103,ROUND(100-(M104/$V$8*100),1),\" \")","v":" "},null,null,{"$f":"IF(P103,ROUND(100-(P104/$V$8*100),1),\" \")","v":" "},null,null,{"$f":"IF(S103,ROUND(100-(S104/$V$8*100),1),\" \")","v":" "},null,null,{"$f":"IF(V103,ROUND(100-(V104/$V$8*100),1),\" \")","v":" "}]
[null,null,"Volume of Air Voids",null,null,null,{"$f":"IF(G103,(G103-G102)-(G101/$V$8),\"\")","v":""},null,null,{"$f":"IF(J103,(J103-J102)-(J101/$V$8),\"\")","v":""},null,null,{"$f":"IF(M103,(M103-M102)-(M101/$V$8),\"\")","v":""},null,null,{"$f":"IF(P103,(P103-P102)-(P101/$V$8),\"\")","v":""},null,null,{"$f":"IF(S103,(S103-S102)-(S101/$V$8),\"\")","v":""},null,null,{"$f":"IF(V103,(V103-V102)-(V101/$V$8),\"\")","v":""}]
[]
[null,null,"Group specimens into 2 subsets of 3 specimens each, so the average voids of the 2 subset are approx. equal"]
[]
[null,null,null,null,null,null,"Unconditioned Set",null,null,null,null,null,null,null,null,"Conditioned Set"]
[null,null,null,"Specimen No."]
[null,null,null,"Voids",null,null,{"$f":"IF(G111,CHOOSE(G111,$G$15,$J$15,$M$15,$P$15,$S$15,$V$15),\" \")","v":" "},null,null,{"$f":"IF(J111,CHOOSE(J111,$G$15,$J$15,$M$15,$P$15,$S$15,$V$15),\" \")","v":" "},null,null,{"$f":"IF(M111,CHOOSE(M111,$G$15,$J$15,$M105,$P$15,$S$15,$V$15),\" \")","v":" "},null,null,{"$f":"IF(P111,CHOOSE(P111,$G$15,$J$15,$M105,$P$15,$S$15,$V$15),\" \")","v":" "},null,null,{"$f":"IF(S111,CHOOSE(S111,$G$15,$J$15,$M105,$P$15,$S$15,$V$15),\" \")","v":" "},null,null,{"$f":"IF(V111,CHOOSE(V111,$G$15,$J$15,$M105,$P$15,$S$15,$V$15),\" \")","v":" "}]
[null,null,null,"Average voids",null,null,{"$f":"IF(ISTEXT(G112),\"\",AVERAGE(G112:O112))","v":""},null,null,null,null,null,null,null,null,{"$f":"IF(ISTEXT(P112),\"\",AVERAGE(P112:X112))","v":""}]
[]
[null,null,null,null,null,null,null,null,null,null,null,null,null,null,null,"Saturation of Conditioned Set"]
[]
[null,null,null,null,null,null,null,null,null,null,null,null,null,null,null,"Conditioned Set"]
[null,null,null,"Specimen number",null,null,null,null,null,null,null,null,null,null,null,{"$f":"IF(P111,P111,\"\")","v":""},null,null,{"$f":"IF(S111,S111,\"\")","v":""},null,null,{"$f":"IF(V111,V111,\"\")","v":""}]
[null,null,null,"SSD Mass After Partial Vacuum"]
[null,null,null,"Volume of Water Absorbed (cc)",null,null,null,null,null,null,null,null,null,null,null,{"$f":"IF(P119,P119-CHOOSE(P111,$G$11,$J$11,$M$11,$P$11,$S$11,$V$11,),\" \")","v":" "},null,null,{"$f":"IF(S119,S119-CHOOSE(S111,$G$11,$J$11,$M$11,$P$11,$S$11,$V$11,),\" \")","v":" "},null,null,{"$f":"IF(V119,V119-CHOOSE(V111,$G$11,$J$11,$M$11,$P$11,$S$11,$V$11,),\" \")","v":" "}]
[null,null,null,null,"% Saturation",null,null,null,null,null,null,null,null,null,null,{"$f":"IF(P119,100*P120/CHOOSE(P111,$G$16,$J$16,$M$16,$P$16,$S$16,$V$16,),\" \")","v":" "},null,null,{"$f":"IF(S119,100*S120/CHOOSE(S111,$G$16,$J$16,$M$16,$P$16,$S$16,$V$16,),\" \")","v":" "},null,null,{"$f":"IF(V119,100*V120/CHOOSE(V111,$G$16,$J$16,$M$16,$P$16,$S$16,$V$16,),\" \")","v":" "}]
[]
[null,null,null,null,null,null,"Tensile Strength Ratio"]
[]
[null,null,null,null,null,null,"Unconditioned Set",null,null,null,null,null,null,null,null,"Conditioned Set"]
[null,"Specimen No.",null,null,null,null,{"$f":"IF(G111,G111,\"\")","v":""},null,null,{"$f":"IF(J111,J111,\"\")","v":""},null,null,{"$f":"IF(M111,M111,\"\")","v":""},null,null,{"$f":"IF(P111,P111,\"\")","v":""},null,null,{"$f":"IF(S111,S111,\"\")","v":""},null,null,{"$f":"IF(V111,V111,\"\")","v":""}]
[null,"Load (lbs)"]
[null,"Tensile Strength (psi)",null,null,null,null,{"$f":"IF(G127,2*G127/(CHOOSE(G126,$G$10,$J$10,$M$10,$P$10,$S$10,$V$10,)*3.141592654/25.4*6),\" \")","v":" "},null,null,{"$f":"IF(J127,2*J127/(CHOOSE(J126,$G$10,$J$10,$M$10,$P$10,$S$10,$V$10,)*3.141592654/25.4*6),\" \")","v":" "},null,null,{"$f":"IF(M127,2*M127/(CHOOSE(M126,$G$10,$J$10,$M$10,$P$10,$S$10,$V$10,)*3.141592654/25.4*6),\" \")","v":" "},null,null,{"$f":"IF(P127,2*P127/(CHOOSE(P126,$G$10,$J$10,$M$10,$P$10,$S$10,$V$10,)*3.141592654/25.4*6),\" \")","v":" "},null,null,{"$f":"IF(S127,2*S127/(CHOOSE(S126,$G$10,$J$10,$M$10,$P$10,$S$10,$V$10,)*3.141592654/25.4*6),\" \")","v":" "},null,null,{"$f":"IF(V127,2*V127/(CHOOSE(V126,$G$10,$J$10,$M$10,$P$10,$S$10,$V$10,)*3.141592654/25.4*6),\" \")","v":" "}]
[null,"Average psi",null,null,null,null,{"$f":"IF(G127,AVERAGE(G128:O128),\"\")","v":""},null,null,null,null,null,null,null,null,{"$f":"IF(P127,AVERAGE(P128:X128),\"\")","v":""}]
[null,"Coefficient of Variation",null,null,null,null,{"$f":"IF(G127,STDEV(G128:O128)/G129,\" \")","v":" "},null,null,null,null,null,null,null,null,{"$f":"IF(P127,STDEV(P128:X128)/P129,\" \")","v":" "}]
[]
[null,null,null,null,null,null,null,null,"Tensile Strength Ratio=",null,null,null,null,null,{"$f":"IF(G127,100*(P129/G129),\" \")","v":" "}]
[]
["Date of Breaks"]
[null,null,null,null,null,null,null,null,null,null,null,"Visual Observations"]
[]
[null,null,null,null,null,null,"Unconditioned Set",null,null,null,null,null,null,null,null,"Conditioned Set"]
[null,null,null,null,null,null,{"$f":"IF(G111,G111,\"\")","v":""},null,null,{"$f":"IF(J111,J111,\"\")","v":""},null,null,{"$f":"IF(M111,M111,\"\")","v":""},null,null,{"$f":"IF(P111,P111,\"\")","v":""},null,null,{"$f":"IF(S111,S111,\"\")","v":""},null,null,{"$f":"IF(V111,V111,\"\")","v":""}]
["Visual Damage (0 to 5 rating)"]
["Cracked / Broken Agg."]
[]
[null,null,null,null,null,null,null,null,null,null,null,null,"TSR's 4"]
[null,null,"Asphalt Supplier Code",null,null,null,null,null,null,null,null,null,null,"Maximum Theoretical Gravity (Gmm) ="]
[null,null,"Specimen No.",null,null,null,1,null,null,2,null,null,3,null,null,4,null,null,5,null,null,6]
[null,null,"Height of Specimen"]
[null,null,"Mass in Air"]
[null,null,"Mass in H2O"]
[null,null,"Mass at SSD"]
[null,null,"Bulk Sp. Gr.",null,null,null,{"$f":"IF(G148,ROUND(G146/(G148-G147),3),\" \")","v":" "},null,null,{"$f":"IF(J148,ROUND(J146/(J148-J147),3),\" \")","v":" "},null,null,{"$f":"IF(M148,ROUND(M146/(M148-M147),3),\" \")","v":" "},null,null,{"$f":"IF(P148,ROUND(P146/(P148-P147),3),\" \")","v":" "},null,null,{"$f":"IF(S148,ROUND(S146/(S148-S147),3),\" \")","v":" "},null,null,{"$f":"IF(V148,ROUND(V146/(V148-V147),3),\" \")","v":" "}]
[null,null,"Voids ",null,null,null,{"$f":"IF(G148,ROUND(100-(G149/$V$8*100),1),\" \")","v":" "},null,null,{"$f":"IF(J148,ROUND(100-(J149/$V$8*100),1),\" \")","v":" "},null,null,{"$f":"IF(M148,ROUND(100-(M149/$V$8*100),1),\" \")","v":" "},null,null,{"$f":"IF(P148,ROUND(100-(P149/$V$8*100),1),\" \")","v":" "},null,null,{"$f":"IF(S148,ROUND(100-(S149/$V$8*100),1),\" \")","v":" "},null,null,{"$f":"IF(V148,ROUND(100-(V149/$V$8*100),1),\" \")","v":" "}]
[null,null,"Volume of Air Voids",null,null,null,{"$f":"IF(G148,(G148-G147)-(G146/$V$8),\"\")","v":""},null,null,{"$f":"IF(J148,(J148-J147)-(J146/$V$8),\"\")","v":""},null,null,{"$f":"IF(M148,(M148-M147)-(M146/$V$8),\"\")","v":""},null,null,{"$f":"IF(P148,(P148-P147)-(P146/$V$8),\"\")","v":""},null,null,{"$f":"IF(S148,(S148-S147)-(S146/$V$8),\"\")","v":""},null,null,{"$f":"IF(V148,(V148-V147)-(V146/$V$8),\"\")","v":""}]
[]
[null,null,"Group specimens into 2 subsets of 3 specimens each, so the average voids of the 2 subset are approx. equal"]
[]
[null,null,null,null,null,null,"Unconditioned Set",null,null,null,null,null,null,null,null,"Conditioned Set"]
[null,null,null,"Specimen No."]
[null,null,null,"Voids",null,null,{"$f":"IF(G156,CHOOSE(G156,$G$15,$J$15,$M$15,$P$15,$S$15,$V$15),\" \")","v":" "},null,null,{"$f":"IF(J156,CHOOSE(J156,$G$15,$J$15,$M$15,$P$15,$S$15,$V$15),\" \")","v":" "},null,null,{"$f":"IF(M156,CHOOSE(M156,$G$15,$J$15,$M150,$P$15,$S$15,$V$15),\" \")","v":" "},null,null,{"$f":"IF(P156,CHOOSE(P156,$G$15,$J$15,$M150,$P$15,$S$15,$V$15),\" \")","v":" "},null,null,{"$f":"IF(S156,CHOOSE(S156,$G$15,$J$15,$M150,$P$15,$S$15,$V$15),\" \")","v":" "},null,null,{"$f":"IF(V156,CHOOSE(V156,$G$15,$J$15,$M150,$P$15,$S$15,$V$15),\" \")","v":" "}]
[null,null,null,"Average voids",null,null,{"$f":"IF(ISTEXT(G157),\"\",AVERAGE(G157:O157))","v":""},null,null,null,null,null,null,null,null,{"$f":"IF(ISTEXT(P157),\"\",AVERAGE(P157:X157))","v":""}]
[]
[null,null,null,null,null,null,null,null,null,null,null,null,null,null,null,"Saturation of Conditioned Set"]
[]
[null,null,null,null,null,null,null,null,null,null,null,null,null,null,null,"Conditioned Set"]
[null,null,null,"Specimen number",null,null,null,null,null,null,null,null,null,null,null,{"$f":"IF(P156,P156,\"\")","v":""},null,null,{"$f":"IF(S156,S156,\"\")","v":""},null,null,{"$f":"IF(V156,V156,\"\")","v":""}]
[null,null,null,"SSD Mass After Partial Vacuum"]
[null,null,null,"Volume of Water Absorbed (cc)",null,null,null,null,null,null,null,null,null,null,null,{"$f":"IF(P164,P164-CHOOSE(P156,$G$11,$J$11,$M$11,$P$11,$S$11,$V$11,),\" \")","v":" "},null,null,{"$f":"IF(S164,S164-CHOOSE(S156,$G$11,$J$11,$M$11,$P$11,$S$11,$V$11,),\" \")","v":" "},null,null,{"$f":"IF(V164,V164-CHOOSE(V156,$G$11,$J$11,$M$11,$P$11,$S$11,$V$11,),\" \")","v":" "}]
[null,null,null,null,"% Saturation",null,null,null,null,null,null,null,null,null,null,{"$f":"IF(P164,100*P165/CHOOSE(P156,$G$16,$J$16,$M$16,$P$16,$S$16,$V$16,),\" \")","v":" "},null,null,{"$f":"IF(S164,100*S165/CHOOSE(S156,$G$16,$J$16,$M$16,$P$16,$S$16,$V$16,),\" \")","v":" "},null,null,{"$f":"IF(V164,100*V165/CHOOSE(V156,$G$16,$J$16,$M$16,$P$16,$S$16,$V$16,),\" \")","v":" "}]
[]
[null,null,null,null,null,null,"Tensile Strength Ratio"]
[]
[null,null,null,null,null,null,"Unconditioned Set",null,null,null,null,null,null,null,null,"Conditioned Set"]
[null,"Specimen No.",null,null,null,null,{"$f":"IF(G156,G156,\"\")","v":""},null,null,{"$f":"IF(J156,J156,\"\")","v":""},null,null,{"$f":"IF(M156,M156,\"\")","v":""},null,null,{"$f":"IF(P156,P156,\"\")","v":""},null,null,{"$f":"IF(S156,S156,\"\")","v":""},null,null,{"$f":"IF(V156,V156,\"\")","v":""}]
[null,"Load (lbs)"]
[null,"Tensile Strength (psi)",null,null,null,null,{"$f":"IF(G172,2*G172/(CHOOSE(G171,$G$10,$J$10,$M$10,$P$10,$S$10,$V$10,)*3.141592654/25.4*6),\" \")","v":" "},null,null,{"$f":"IF(J172,2*J172/(CHOOSE(J171,$G$10,$J$10,$M$10,$P$10,$S$10,$V$10,)*3.141592654/25.4*6),\" \")","v":" "},null,null,{"$f":"IF(M172,2*M172/(CHOOSE(M171,$G$10,$J$10,$M$10,$P$10,$S$10,$V$10,)*3.141592654/25.4*6),\" \")","v":" "},null,null,{"$f":"IF(P172,2*P172/(CHOOSE(P171,$G$10,$J$10,$M$10,$P$10,$S$10,$V$10,)*3.141592654/25.4*6),\" \")","v":" "},null,null,{"$f":"IF(S172,2*S172/(CHOOSE(S171,$G$10,$J$10,$M$10,$P$10,$S$10,$V$10,)*3.141592654/25.4*6),\" \")","v":" "},null,null,{"$f":"IF(V172,2*V172/(CHOOSE(V171,$G$10,$J$10,$M$10,$P$10,$S$10,$V$10,)*3.141592654/25.4*6),\" \")","v":" "}]
[null,"Average psi",null,null,null,null,{"$f":"IF(G172,AVERAGE(G173:O173),\"\")","v":""},null,null,null,null,null,null,null,null,{"$f":"IF(P172,AVERAGE(P173:X173),\"\")","v":""}]
[null,"Coefficient of Variation",null,null,null,null,{"$f":"IF(G172,STDEV(G173:O173)/G174,\" \")","v":" "},null,null,null,null,null,null,null,null,{"$f":"IF(P172,STDEV(P173:X173)/P174,\" \")","v":" "}]
[]
[null,null,null,null,null,null,null,null,"Tensile Strength Ratio=",null,null,null,null,null,{"$f":"IF(G172,100*(P174/G174),\" \")","v":" "}]
[]
["Date of Breaks"]
[null,null,null,null,null,null,null,null,null,null,null,"Visual Observations"]
[]
[null,null,null,null,null,null,"Unconditioned Set",null,null,null,null,null,null,null,null,"Conditioned Set"]
[null,null,null,null,null,null,{"$f":"IF(G156,G156,\"\")","v":""},null,null,{"$f":"IF(J156,J156,\"\")","v":""},null,null,{"$f":"IF(M156,M156,\"\")","v":""},null,null,{"$f":"IF(P156,P156,\"\")","v":""},null,null,{"$f":"IF(S156,S156,\"\")","v":""},null,null,{"$f":"IF(V156,V156,\"\")","v":""}]
["Visual Damage (0 to 5 rating)"]
["Cracked / Broken Agg."]

{"sheet":"Height Data","index":16,"n_rows":20,"n_cols":41,"rows_kept":20,"cut":false,"hidden":false,"merged":[[11,34,11,35],[10,34,10,35],[9,34,9,35],[8,32,8,37],[8,38,8,41],[10,18,10,19],[11,18,11,19],[9,22,9,23],[9,24,9,25],[11,24,11,25],[11,22,11,23],[10,24,10,25],[10,22,10,23],[8,20,8,25],[3,21,3,26],[10,40,10,41],[10,38,10,39],[10,36,10,37],[10,32,10,33],[9,30,9,31],[9,32,9,33],[9,40,9,41],[9,38,9,39],[9,36,9,37],[10,28,10,29],[9,28,9,29],[8,26,8,31],[8,2,8,5],[8,6,8,9],[8,10,8,13],[9,12,9,13],[9,14,9,15],[9,16,9,17],[9,20,9,21],[9,26,9,27],[9,2,9,3],[9,8,9,9],[9,10,9,11],[8,14,8,19],[9,18,9,19],[17,0,17,1],[10,10,10,11],[10,8,10,9],[10,6,10,7],[10,4,10,5],[10,2,10,3],[10,30,10,31],[10,26,10,27],[10,20,10,21],[10,16,10,17],[10,14,10,15],[13,2,13,3],[13,4,13,5],[13,6,13,7],[13,8,13,9],[10,0,10,1],[11,0,11,1],[16,0,16,1],[11,14,11,15],[11,16,11,17],[11,20,11,21],[11,26,11,27],[11,30,11,31],[11,2,11,3],[9,0,9,1],[9,4,9,5],[9,6,9,7],[12,38,12,39],[12,40,12,41],[12,0,12,1],[13,0,13,1],[14,0,14,1],[15,0,15,1],[11,38,11,39],[12,14,12,15],[12,16,12,17],[12,20,12,21],[12,22,12,25],[12,26,12,27],[12,30,12,31],[13,38,13,39],[11,40,11,41],[12,2,12,3],[12,4,12,5],[12,6,12,7],[12,8,12,9],[12,10,12,11],[12,12,12,13],[11,4,11,5],[11,6,11,7],[11,8,11,9],[11,10,11,11],[11,12,11,13],[11,28,11,29],[14,14,14,15],[14,16,14,17],[14,20,14,21],[13,40,13,41],[14,2,14,3],[14,4,14,5],[14,6,14,7],[14,8,14,9],[14,10,14,11],[14,12,14,13],[13,14,13,15],[13,16,13,17],[13,20,13,21],[13,22,13,25],[13,26,13,27],[13,30,13,31],[14,38,14,39],[14,40,14,41],[14,22,14,25],[14,26,14,27],[14,30,14,31],[13,10,13,11],[13,12,13,13],[15,38,15,39],[15,40,15,41],[16,2,16,3],[16,4,16,5],[16,6,16,7],[16,8,16,9],[16,10,16,11],[16,12,16,13],[15,14,15,15],[15,16,15,17],[15,20,15,21],[15,22,15,25],[15,26,15,27],[15,30,15,31],[15,2,15,3],[15,4,15,5],[15,6,15,7],[15,8,15,9],[15,10,15,11],[15,12,15,13],[17,38,17,39],[17,40,17,41],[7,2,7,13],[7,14,7,37],[7,38,7,41],[17,14,17,15],[17,16,17,17],[17,20,17,21],[17,22,17,25],[17,26,17,27],[17,30,17,31],[16,32,16,33],[16,36,16,37],[16,38,16,39],[16,40,16,41],[17,2,17,3],[17,4,17,5],[17,6,17,7],[17,8,17,9],[17,10,17,11],[17,12,17,13],[16,14,16,15],[16,16,16,17],[16,20,16,21],[0,5,0,6],[2,5,2,36],[3,6,3,8],[3,9,3,12],[3,13,3,20],[3,27,3,31],[3,32,3,33],[17,32,17,33],[17,36,17,37],[16,22,16,25],[16,26,16,27],[16,30,16,31],[15,32,15,33],[15,36,15,37],[14,32,14,33],[14,36,14,37],[13,32,13,33],[13,36,13,37],[12,32,12,33],[12,36,12,37],[11,32,11,33],[11,36,11,37],[10,12,10,13],[5,6,5,8],[18,20,18,21],[19,20,19,21],[5,9,5,11],[5,13,5,20],[5,21,5,25],[5,27,5,31],[5,32,5,33],[4,6,4,8],[4,9,4,12],[4,13,4,20],[4,21,4,25],[4,30,4,31],[4,32,4,33]]}
[null,{"$f":"Setup!A2","v":"ESB-21"},null,null,null,{"$f":"Setup!E2","v":"00:00:00"}]
[]
[null,null,null,null,null,"Height Data"]
[null,null,null,null,null,null,"Producer;",null,null,{"$f":"Setup!E7","v":0},null,null,null,"Material Class:",null,null,null,null,null,null,null,{"$f":"Setup!E11","v":0},null,null,null,null,null,"JMF",null,null,null,null,{"$f":"Setup!E5","v":0}]
[null,null,null,null,null,null,"Designed By:",null,null,{"$f":"Setup!E9","v":0},null,null,null,"Esals:",null,null,null,null,null,null,null,{"$f":"Setup!E13","v":0},null,null,null,null,null,null,null,null,"SRL:",null,{"$f":"Setup!E12","v":0}]
[null,null,null,null,null,null,"Date:",null,null,{"$f":"Setup!E6","v":"00:00:00"},null,null,null,"Rap:",null,null,null,null,null,null,null,{"$f":"Setup!E18","v":0},null,null,null,null,null,"PG Grade:",null,null,null,null,{"$f":"Setup!E15","v":0}]
[]
[null,null,"Trial Blends",null,null,null,null,null,null,null,null,null,null,null,"AC Trials",null,null,null,null,null,null,null,null,null,null,null,null,null,null,null,null,null,null,null,null,null,null,null,"Nmax"]
[null,null,"Blend 1",null,null,null,"Blend 2",null,null,null,"Blend 3",null,null,null,"-.5 AC",null,null,null,null,null,"Design AC",null,null,null,null,null,"+.5 AC",null,null,null,null,null,"+1.0 AC",null,null,null,null,null,"Design AC @ Nmax"]
["Gyration",null,1,null,2,null,1,null,2,null,1,null,2,null,1,null,2,null,3,null,1,null,2,null,3,null,1,null,2,null,3,null,1,null,2,null,3,null,1,null,2]
["Nini",null,{"$f":"'Trial Blends'!L11","v":0},null,{"$f":"'Trial Blends'!L12","v":0},null,{"$f":"'Trial Blends'!L18","v":0},null,{"$f":"'Trial Blends'!L19","v":0},null,{"$f":"'Trial Blends'!L25","v":0},null,{"$f":"'Trial Blends'!L26","v":0},null,{"$f":"'AC Trials'!L11","v":0},null,{"$f":"'AC Trials'!L12","v":0},null,{"$f":"'AC Trials'!L13","v":0},null,{"$f":"'AC Trials'!L19","v":0},null,{"$f":"'AC Trials'!L20","v":0},null,{"$f":"'AC Trials'!L21","v":0},null,{"$f":"'AC Trials'!L27","v":0},null,{"$f":"'AC Trials'!L28","v":0},null,{"$f":"'AC Trials'!L29","v":0},null,{"$f":"'AC Trials'!L35","v":0},null,{"$f":"'AC Trials'!L36","v":0},null,{"$f":"'AC Trials'!L37","v":0},null,{"$f":"Nmax!L15","v":0},null,{"$f":"Nmax!L16","v":0}]
["Ndes",null,{"$f":"'Trial Blends'!N11","v":0},null,{"$f":"'Trial Blends'!N12","v":0},null,{"$f":"'Trial Blends'!N18","v":0},null,{"$f":"'Trial Blends'!N19","v":0},null,{"$f":"'Trial Blends'!N25","v":0},null,{"$f":"'Trial Blends'!N26","v":0},null,{"$f":"'AC Trials'!N11","v":0},null,{"$f":"'AC Trials'!N12","v":0},null,{"$f":"'AC Trials'!N13","v":0},null,{"$f":"'AC Trials'!N19","v":0},null,{"$f":"'AC Trials'!N20","v":0},null,{"$f":"'AC Trials'!N21","v":0},null,{"$f":"'AC Trials'!N27","v":0},null,{"$f":"'AC Trials'!N28","v":0},null,{"$f":"'AC Trials'!N29","v":0},null,{"$f":"'AC Trials'!N35","v":0},null,{"$f":"'AC Trials'!N36","v":0},null,{"$f":"'AC Trials'!N37","v":0},null,{"$f":"Nmax!N15","v":0},null,{"$f":"Nmax!N16","v":0}]
["Nmax",null,null,null,null,null,null,null,null,null,null,null,null,null,null,null,null,null,null,null,null,null,null,null,null,null,null,null,null,null,null,null,null,null,null,null,null,null,{"$f":"Nmax!P15","v":0},null,{"$f":"Nmax!P16","v":0}]
[]
[]
[]
[]
[null,null,null,null,null,null,null,null,null,null,null,null,null,null,null,null,null,null,null,null,{"$f":"AVERAGE(U11:Z11)","v":0}]
[null,null,null,null,null,null,null,null,null,null,null,null,null,null,null,null,null,null,null,null,{"$f":"AVERAGE(U12:Z12)","v":0}]
[null,null,null,null,null,null,null,null,null,null,null,null,null,null,null,null,null,null,null,null,{"$f":"AVERAGE(AM13:AP13)","v":0}]

{"sheet":"Correction Factor","index":17,"n_rows":124,"n_cols":57,"rows_kept":124,"cut":false,"hidden":false,"merged":[[121,34,121,35],[123,0,123,6],[123,7,123,11],[121,18,121,20],[121,22,121,23],[121,24,121,25],[121,27,121,28],[121,29,121,30],[121,32,121,33],[120,29,120,30],[120,32,120,33],[120,34,120,35],[121,0,121,1],[121,2,121,3],[121,4,121,6],[121,7,121,8],[121,10,121,12],[121,13,121,14],[121,16,121,17],[120,13,120,14],[120,16,120,17],[120,18,120,20],[120,22,120,23],[120,24,120,25],[120,27,120,28],[119,24,119,25],[119,27,119,28],[119,29,119,30],[119,32,119,33],[119,34,119,35],[120,0,120,1],[120,2,120,3],[120,4,120,6],[120,7,120,8],[120,10,120,12],[118,34,118,35],[119,0,119,1],[119,2,119,3],[119,4,119,6],[119,7,119,8],[119,10,119,12],[119,13,119,14],[119,16,119,17],[119,18,119,20],[119,22,119,23],[118,18,118,20],[118,22,118,23],[118,24,118,25],[118,27,118,28],[118,29,118,30],[118,32,118,33],[117,29,117,30],[117,32,117,33],[117,34,117,35],[118,0,118,1],[118,2,118,3],[118,4,118,6],[118,7,118,8],[118,10,118,12],[118,13,118,14],[118,16,118,17],[117,13,117,14],[117,16,117,17],[117,18,117,20],[117,22,117,23],[117,24,117,25],[117,27,117,28],[116,24,116,25],[116,27,116,28],[116,29,116,30],[116,32,116,33],[116,34,116,35],[117,0,117,1],[117,2,117,3],[117,4,117,6],[117,7,117,8],[117,10,117,12],[115,34,115,35],[116,0,116,1],[116,2,116,3],[116,4,116,6],[116,7,116,8],[116,10,116,12],[116,13,116,14],[116,16,116,17],[116,18,116,20],[116,22,116,23],[115,18,115,20],[115,22,115,23],[115,24,115,25],[115,27,115,28],[115,29,115,30],[115,32,115,33],[114,29,114,30],[114,32,114,33],[114,34,114,35],[115,0,115,1],[115,2,115,3],[115,4,115,6],[115,7,115,8],[115,10,115,12],[115,13,115,14],[115,16,115,17],[114,13,114,14],[114,16,114,17],[114,18,114,20],[114,22,114,23],[114,24,114,25],[114,27,114,28],[113,24,113,25],[113,27,113,28],[113,29,113,30],[113,32,113,33],[113,34,113,35],[114,0,114,1],[114,2,114,3],[114,4,114,6],[114,7,114,8],[114,10,114,12],[112,34,112,35],[113,0,113,1],[113,2,113,3],[113,4,113,6],[113,7,113,8],[113,10,113,12],[113,13,113,14],[113,16,113,17],[113,18,113,20],[113,22,113,23],[112,18,112,20],[112,22,112,23],[112,24,112,25],[112,27,112,28],[112,29,112,30],[112,32,112,33],[109,24,109,25],[109,27,109,28],[109,29,109,30],[109,32,109,33],[108,32,108,33],[108,34,108,35],[111,29,111,30],[111,32,111,33],[111,34,111,35],[112,0,112,1],[112,2,112,3],[112,4,112,6],[112,7,112,8],[112,10,112,12],[112,13,112,14],[112,16,112,17],[111,13,111,14],[111,16,111,17],[111,18,111,20],[111,22,111,23],[111,24,111,25],[111,27,111,28],[110,24,110,25],[110,27,110,28],[110,29,110,30],[110,32,110,33],[110,34,110,35],[111,0,111,1],[111,2,111,3],[111,4,111,6],[111,7,111,8],[111,10,111,12],[108,56,121,57],[109,0,109,1],[109,2,109,3],[109,4,109,6],[109,7,109,8],[109,10,109,12],[109,13,109,14],[109,16,109,17],[108,16,108,17],[108,18,108,20],[108,22,108,23],[108,24,108,25],[108,27,108,28],[108,29,108,30],[108,0,108,1],[108,2,108,3],[108,4,108,6],[108,7,108,8],[108,10,108,12],[108,13,108,14],[109,34,109,35],[110,0,110,1],[110,2,110,3],[110,4,110,6],[110,7,110,8],[110,10,110,12],[110,13,110,14],[110,16,110,17],[110,18,110,20],[110,22,110,23],[109,18,109,20],[109,22,109,23],[106,52,106,53],[107,0,107,3],[107,4,107,8],[107,10,107,14],[107,16,107,20],[107,22,107,25],[107,27,107,30],[107,32,107,35],[105,32,105,35],[106,0,106,3],[106,4,106,8],[106,10,106,14],[106,16,106,20],[106,22,106,25],[106,27,106,30],[106,32,106,35],[102,20,102,23],[102,24,102,25],[102,27,104,35],[102,52,105,53],[104,4,104,25],[105,4,105,8],[105,10,105,14],[105,16,105,20],[105,22,105,25],[105,27,105,30],[102,0,102,2],[102,3,102,4],[102,6,102,8],[102,9,102,11],[102,13,102,16],[102,17,102,18],[101,20,101,23],[101,24,101,25],[101,27,101,28],[101,29,101,31],[101,32,101,33],[101,34,101,35],[100,29,100,31],[100,32,100,33],[100,34,100,35],[100,52,101,53],[101,0,101,2],[101,3,101,4],[101,6,101,8],[101,9,101,11],[101,13,101,16],[101,17,101,18],[99,52,99,53],[100,0,100,2],[100,3,100,4],[100,6,100,8],[100,9,100,11],[100,13,100,16],[100,17,100,18],[100,20,100,23],[100,24,100,25],[100,27,100,28],[99,20,99,23],[99,24,99,25],[99,27,99,28],[99,29,99,31],[99,32,99,33],[99,34,99,35],[98,20,98,23],[98,24,98,25],[98,27,98,31],[98,32,98,35],[99,0,99,2],[99,3,99,4],[99,6,99,8],[99,9,99,11],[99,13,99,16],[99,17,99,18],[98,0,98,2],[98,3,98,4],[98,6,98,8],[98,9,98,11],[98,13,98,16],[98,17,98,18],[92,34,92,35],[94,0,94,6],[94,7,94,11],[96,6,96,13],[96,14,96,18],[97,0,97,4],[97,6,97,11],[97,13,97,18],[97,20,97,25],[97,27,97,35],[92,18,92,20],[92,22,92,23],[92,24,92,25],[92,27,92,28],[92,29,92,30],[92,32,92,33],[91,29,91,30],[91,32,91,33],[91,34,91,35],[92,0,92,1],[92,2,92,3],[92,4,92,6],[92,7,92,8],[92,10,92,12],[92,13,92,14],[92,16,92,17],[91,13,91,14],[91,16,91,17],[91,18,91,20],[91,22,91,23],[91,24,91,25],[91,27,91,28],[90,24,90,25],[90,27,90,28],[90,29,90,30],[90,32,90,33],[90,34,90,35],[91,0,91,1],[91,2,91,3],[91,4,91,6],[91,7,91,8],[91,10,91,12],[89,34,89,35],[90,0,90,1],[90,2,90,3],[90,4,90,6],[90,7,90,8],[90,10,90,12],[90,13,90,14],[90,16,90,17],[90,18,90,20],[90,22,90,23],[89,18,89,20],[89,22,89,23],[89,24,89,25],[89,27,89,28],[89,29,89,30],[89,32,89,33],[88,29,88,30],[88,32,88,33],[88,34,88,35],[89,0,89,1],[89,2,89,3],[89,4,89,6],[89,7,89,8],[89,10,89,12],[89,13,89,14],[89,16,89,17],[88,13,88,14],[88,16,88,17],[88,18,88,20],[88,22,88,23],[88,24,88,25],[88,27,88,28],[87,24,87,25],[87,27,87,28],[87,29,87,30],[87,32,87,33],[87,34,87,35],[88,0,88,1],[88,2,88,3],[88,4,88,6],[88,7,88,8],[88,10,88,12],[86,34,86,35],[87,0,87,1],[87,2,87,3],[87,4,87,6],[87,7,87,8],[87,10,87,12],[87,13,87,14],[87,16,87,17],[87,18,87,20],[87,22,87,23],[86,18,86,20],[86,22,86,23],[86,24,86,25],[86,27,86,28],[86,29,86,30],[86,32,86,33],[85,29,85,30],[85,32,85,33],[85,34,85,35],[86,0,86,1],[86,2,86,3],[86,4,86,6],[86,7,86,8],[86,10,86,12],[86,13,86,14],[86,16,86,17],[85,13,85,14],[85,16,85,17],[85,18,85,20],[85,22,85,23],[85,24,85,25],[85,27,85,28],[84,24,84,25],[84,27,84,28],[84,29,84,30],[84,32,84,33],[84,34,84,35],[85,0,85,1],[85,2,85,3],[85,4,85,6],[85,7,85,8],[85,10,85,12],[84,0,84,1],[84,2,84,3],[84,4,84,6],[84,7,84,8],[84,10,84,12],[84,13,84,14],[84,16,84,17],[84,18,84,20],[84,22,84,23],[83,18,83,20],[83,22,83,23],[83,24,83,25],[83,27,83,28],[83,29,83,30],[83,32,83,33],[82,29,82,30],[82,32,82,33],[83,0,83,1],[83,2,83,3],[83,4,83,6],[83,7,83,8],[83,10,83,12],[83,13,83,14],[83,16,83,17],[82,13,82,14],[82,16,82,17],[82,18,82,20],[82,22,82,23],[82,24,82,25],[82,27,82,28],[80,34,80,35],[81,0,81,1],[81,2,81,3],[81,4,81,6],[81,7,81,8],[81,10,81,12],[81,13,81,14],[81,16,81,17],[81,18,81,20],[81,22,81,23],[80,18,80,20],[80,22,80,23],[80,24,80,25],[80,27,80,28],[80,29,80,30],[80,32,80,33],[83,34,83,35],[82,34,82,35],[79,32,79,33],[79,34,79,35],[79,56,92,57],[80,0,80,1],[80,2,80,3],[80,4,80,6],[80,7,80,8],[80,10,80,12],[80,13,80,14],[80,16,80,17],[79,16,79,17],[79,18,79,20],[79,22,79,23],[79,24,79,25],[79,27,79,28],[79,29,79,30],[79,0,79,1],[79,2,79,3],[79,4,79,6],[79,7,79,8],[79,10,79,12],[79,13,79,14],[81,24,81,25],[81,27,81,28],[81,29,81,30],[81,32,81,33],[81,34,81,35],[82,0,82,1],[82,2,82,3],[82,4,82,6],[82,7,82,8],[82,10,82,12],[77,52,77,53],[78,0,78,3],[78,4,78,8],[78,10,78,14],[78,16,78,20],[78,22,78,25],[78,27,78,30],[78,32,78,35],[76,32,76,35],[77,0,77,3],[77,4,77,8],[77,10,77,14],[77,16,77,20],[77,22,77,25],[77,27,77,30],[77,32,77,35],[73,20,73,23],[73,24,73,25],[73,27,75,35],[73,52,76,53],[75,4,75,25],[76,4,76,8],[76,10,76,14],[76,16,76,20],[76,22,76,25],[76,27,76,30],[73,0,73,2],[73,3,73,4],[73,6,73,8],[73,9,73,11],[73,13,73,16],[73,17,73,18],[72,20,72,23],[72,24,72,25],[72,27,72,28],[72,29,72,31],[72,32,72,33],[72,34,72,35],[71,29,71,31],[71,32,71,33],[71,34,71,35],[71,52,72,53],[72,0,72,2],[72,3,72,4],[72,6,72,8],[72,9,72,11],[72,13,72,16],[72,17,72,18],[70,52,70,53],[71,0,71,2],[71,3,71,4],[71,6,71,8],[71,9,71,11],[71,13,71,16],[71,17,71,18],[71,20,71,23],[71,24,71,25],[71,27,71,28],[70,20,70,23],[70,24,70,25],[70,27,70,28],[70,29,70,31],[70,32,70,33],[70,34,70,35],[69,20,69,23],[69,24,69,25],[69,27,69,31],[69,32,69,35],[70,0,70,2],[70,3,70,4],[70,6,70,8],[70,9,70,11],[70,13,70,16],[70,17,70,18],[69,0,69,2],[69,3,69,4],[69,6,69,8],[69,9,69,11],[69,13,69,16],[69,17,69,18],[63,34,63,35],[65,0,65,6],[65,7,65,11],[67,6,67,13],[67,14,67,18],[68,0,68,4],[68,6,68,11],[68,13,68,18],[68,20,68,25],[68,27,68,35],[63,18,63,20],[63,22,63,23],[63,24,63,25],[63,27,63,28],[63,29,63,30],[63,32,63,33],[62,29,62,30],[62,32,62,33],[62,34,62,35],[63,0,63,1],[63,2,63,3],[63,4,63,6],[63,7,63,8],[63,10,63,12],[63,13,63,14],[63,16,63,17],[62,13,62,14],[62,16,62,17],[62,18,62,20],[62,22,62,23],[62,24,62,25],[62,27,62,28],[61,24,61,25],[61,27,61,28],[61,29,61,30],[61,32,61,33],[61,34,61,35],[62,0,62,1],[62,2,62,3],[62,4,62,6],[62,7,62,8],[62,10,62,12],[60,34,60,35],[61,0,61,1],[61,2,61,3],[61,4,61,6],[61,7,61,8],[61,10,61,12],[61,13,61,14],[61,16,61,17],[61,18,61,20],[61,22,61,23],[60,18,60,20],[60,22,60,23],[60,24,60,25],[60,27,60,28],[60,29,60,30],[60,32,60,33],[59,29,59,30],[59,32,59,33],[59,34,59,35],[60,0,60,1],[60,2,60,3],[60,4,60,6],[60,7,60,8],[60,10,60,12],[60,13,60,14],[60,16,60,17],[59,13,59,14],[59,16,59,17],[59,18,59,20],[59,22,59,23],[59,24,59,25],[59,27,59,28],[58,24,58,25],[58,27,58,28],[58,29,58,30],[58,32,58,33],[58,34,58,35],[59,0,59,1],[59,2,59,3],[59,4,59,6],[59,7,59,8],[59,10,59,12],[57,34,57,35],[58,0,58,1],[58,2,58,3],[58,4,58,6],[58,7,58,8],[58,10,58,12],[58,13,58,14],[58,16,58,17],[58,18,58,20],[58,22,58,23],[57,18,57,20],[57,22,57,23],[57,24,57,25],[57,27,57,28],[57,29,57,30],[57,32,57,33],[56,29,56,30],[56,32,56,33],[56,34,56,35],[57,0,57,1],[57,2,57,3],[57,4,57,6],[57,7,57,8],[57,10,57,12],[57,13,57,14],[57,16,57,17],[56,13,56,14],[56,16,56,17],[56,18,56,20],[56,22,56,23],[56,24,56,25],[56,27,56,28],[55,24,55,25],[55,27,55,28],[55,29,55,30],[55,32,55,33],[55,34,55,35],[56,0,56,1],[56,2,56,3],[56,4,56,6],[56,7,56,8],[56,10,56,12],[55,0,55,1],[55,2,55,3],[55,4,55,6],[55,7,55,8],[55,10,55,12],[55,13,55,14],[55,16,55,17],[55,18,55,20],[55,22,55,23],[54,18,54,20],[54,22,54,23],[54,24,54,25],[54,27,54,28],[54,29,54,30],[54,32,54,33],[53,29,53,30],[53,32,53,33],[54,0,54,1],[54,2,54,3],[54,4,54,6],[54,7,54,8],[54,10,54,12],[54,13,54,14],[54,16,54,17],[53,13,53,14],[53,16,53,17],[53,18,53,20],[53,22,53,23],[53,24,53,25],[53,27,53,28],[51,34,51,35],[52,0,52,1],[52,2,52,3],[52,4,52,6],[52,7,52,8],[52,10,52,12],[52,13,52,14],[52,16,52,17],[52,18,52,20],[52,22,52,23],[51,18,51,20],[51,22,51,23],[51,24,51,25],[51,27,51,28],[51,29,51,30],[51,32,51,33],[54,34,54,35],[53,34,53,35],[50,32,50,33],[50,34,50,35],[50,56,63,57],[51,0,51,1],[51,2,51,3],[51,4,51,6],[51,7,51,8],[51,10,51,12],[51,13,51,14],[51,16,51,17],[50,16,50,17],[50,18,50,20],[50,22,50,23],[50,24,50,25],[50,27,50,28],[50,29,50,30],[50,0,50,1],[50,2,50,3],[50,4,50,6],[50,7,50,8],[50,10,50,12],[50,13,50,14],[52,24,52,25],[52,27,52,28],[52,29,52,30],[52,32,52,33],[52,34,52,35],[53,0,53,1],[53,2,53,3],[53,4,53,6],[53,7,53,8],[53,10,53,12],[48,52,48,53],[49,0,49,3],[49,4,49,8],[49,10,49,14],[49,16,49,20],[49,22,49,25],[49,27,49,30],[49,32,49,35],[47,32,47,35],[48,0,48,3],[48,4,48,8],[48,10,48,14],[48,16,48,20],[48,22,48,25],[48,27,48,30],[48,32,48,35],[44,20,44,23],[44,24,44,25],[44,27,46,35],[44,52,47,53],[46,4,46,25],[47,4,47,8],[47,10,47,14],[47,16,47,20],[47,22,47,25],[47,27,47,30],[44,0,44,2],[44,3,44,4],[44,6,44,8],[44,9,44,11],[44,13,44,16],[44,17,44,18],[43,20,43,23],[43,24,43,25],[43,27,43,28],[43,29,43,31],[43,32,43,33],[43,34,43,35],[42,29,42,31],[42,32,42,33],[42,34,42,35],[42,52,43,53],[43,0,43,2],[43,3,43,4],[43,6,43,8],[43,9,43,11],[43,13,43,16],[43,17,43,18],[41,52,41,53],[42,0,42,2],[42,3,42,4],[42,6,42,8],[42,9,42,11],[42,13,42,16],[42,17,42,18],[42,20,42,23],[42,24,42,25],[42,27,42,28],[41,20,41,23],[41,24,41,25],[41,27,41,28],[41,29,41,31],[41,32,41,33],[41,34,41,35],[40,20,40,23],[40,24,40,25],[40,27,40,31],[40,32,40,35],[41,0,41,2],[41,3,41,4],[41,6,41,8],[41,9,41,11],[41,13,41,16],[41,17,41,18],[40,0,40,2],[40,3,40,4],[40,6,40,8],[40,9,40,11],[40,13,40,16],[40,17,40,18],[34,34,34,35],[36,0,36,6],[36,7,36,11],[38,6,38,13],[38,14,38,18],[39,0,39,4],[39,6,39,11],[39,13,39,18],[39,20,39,25],[39,27,39,35],[34,18,34,20],[34,22,34,23],[34,24,34,25],[34,27,34,28],[34,29,34,30],[34,32,34,33],[33,29,33,30],[33,32,33,33],[33,34,33,35],[34,0,34,1],[34,2,34,3],[34,4,34,6],[34,7,34,8],[34,10,34,12],[34,13,34,14],[34,16,34,17],[33,13,33,14],[33,16,33,17],[33,18,33,20],[33,22,33,23],[33,24,33,25],[33,27,33,28],[32,24,32,25],[32,27,32,28],[32,29,32,30],[32,32,32,33],[32,34,32,35],[33,0,33,1],[33,2,33,3],[33,4,33,6],[33,7,33,8],[33,10,33,12],[31,34,31,35],[32,0,32,1],[32,2,32,3],[32,4,32,6],[32,7,32,8],[32,10,32,12],[32,13,32,14],[32,16,32,17],[32,18,32,20],[32,22,32,23],[31,18,31,20],[31,22,31,23],[31,24,31,25],[31,27,31,28],[31,29,31,30],[31,32,31,33],[30,29,30,30],[30,32,30,33],[30,34,30,35],[31,0,31,1],[31,2,31,3],[31,4,31,6],[31,7,31,8],[31,10,31,12],[31,13,31,14],[31,16,31,17],[30,13,30,14],[30,16,30,17],[30,18,30,20],[30,22,30,23],[30,24,30,25],[30,27,30,28],[29,24,29,25],[29,27,29,28],[29,29,29,30],[29,32,29,33],[29,34,29,35],[30,0,30,1],[30,2,30,3],[30,4,30,6],[30,7,30,8],[30,10,30,12],[28,34,28,35],[29,0,29,1],[29,2,29,3],[29,4,29,6],[29,7,29,8],[29,10,29,12],[29,13,29,14],[29,16,29,17],[29,18,29,20],[29,22,29,23],[28,18,28,20],[28,22,28,23],[28,24,28,25],[28,27,28,28],[28,29,28,30],[28,32,28,33],[27,29,27,30],[27,32,27,33],[27,34,27,35],[28,0,28,1],[28,2,28,3],[28,4,28,6],[28,7,28,8],[28,10,28,12],[28,13,28,14],[28,16,28,17],[27,13,27,14],[27,16,27,17],[27,18,27,20],[27,22,27,23],[27,24,27,25],[27,27,27,28],[26,24,26,25],[26,27,26,28],[26,29,26,30],[26,32,26,33],[26,34,26,35],[27,0,27,1],[27,2,27,3],[27,4,27,6],[27,7,27,8],[27,10,27,12],[26,0,26,1],[26,2,26,3],[26,4,26,6],[26,7,26,8],[26,10,26,12],[26,13,26,14],[26,16,26,17],[26,18,26,20],[26,22,26,23],[25,18,25,20],[25,22,25,23],[25,24,25,25],[25,27,25,28],[25,29,25,30],[25,32,25,33],[24,29,24,30],[24,32,24,33],[25,0,25,1],[25,2,25,3],[25,4,25,6],[25,7,25,8],[25,10,25,12],[25,13,25,14]],"merged_total":1164,"flags":["merged_cut"]}
[{"$f":"Setup!A2","v":"ESB-21"}]
[null,null,"Ignition Oven Calibration",null,null,null,null,null,null,null,null,null,null,null,null,null,null,null,null,null,null,null,null,null,null,null,null,null,null,null,null,null,null,null,"Each ignition oven that will be used for testing needs to have calibration factors ran. Scroll down for more forms"]
[null,null,"Producer:",null,null,null,null,{"$f":"Setup!E7","v":0},null,null,null,null,null,null,null,null,"Material Class:",null,null,null,null,null,{"$f":"Setup!E11","v":0},null,null,null,null,"JMF:",null,null,{"$f":"Setup!E5","v":0}]
[null,null,"Designed By:",null,null,null,null,{"$f":"Setup!E9","v":0},null,null,null,null,null,null,null,null,null,"Esals:",null,null,null,null,{"$f":"Setup!E13","v":0},null,null,null,null,"SRL:",null,null,{"$f":"Setup!E12","v":0}]
[null,null,null,"Date:",null,null,null,{"$f":"Setup!E6","v":"00:00:00"},null,null,null,null,null,"Recycled:",null,null,null,null,null,null,null,null,{"$f":"Setup!E18","v":0},null,null,null,null,"PG Grade:",null,null,{"$f":"Setup!E15","v":0}]
[]
[null,null,"In accordance with PTM 757, if the difference between the measured asphalt contents from sample 1 and sample 2 exceeds .15%, repeat the two tests. The high and low values will be discarded and the remaining two results will be used to determine the asphalt and 200 Cf."]
[null,null,null,null,null,null,null,null,null,null,null,null,null,null,null,null,null,null,null,null,null,null,null,null,null,null,null,null,null,null,null,null,null,null,null,null,null,null,null,null,null,null,null,null,null,null,{"$f":"D12","v":0},{"$f":"J12","v":0},{"$f":"R12","v":0},{"$f":"Y12","v":0},null,{"$f":"AU13","v":{"$error":"#DIV/0!"}}]
[null,null,null,null,null,null,null,null,null,null,null,null,null,null,null,null,null,null,null,null,null,null,null,null,null,null,null,null,null,null,null,null,null,null,null,null,null,null,null,null,null,null,null,null,null,null,{"$f":"D13","v":0},{"$f":"J13","v":0},{"$f":"R13","v":0},{"$f":"Y13","v":0},null,{"$f":"AV13","v":{"$error":"#DIV/0!"}}]
[null,null,null,null,null,null,"Ignition Oven Identification",null,null,null,null,null,null,null,{"$f":"Setup!E34","v":0}]
["Ignition Sample 1",null,null,null,null,null,"Ignition Sample 2",null,null,null,null,null,null,"Ignition Sample 3",null,null,null,null,null,null,"Ignition Sample 4",null,null,null,null,null,null,"Correction Factors for TR 448",null,null,null,null,null,null,null,null,null,null,null,null,null,null,null,null,null,null,{"$f":"AU8-AU9","v":0},{"$f":"AV8-AV9","v":0},{"$f":"AW8-AW9","v":0},{"$f":"AX8-AX9","v":0},null,{"$f":"IF(ISERROR(AW13),0,AW13)","v":0}]
["Starting Wt.",null,null,null,null,null,"Starting Wt.",null,null,null,null,null,null,"Starting Wt.",null,null,null,null,null,null,"Starting Wt.",null,null,null,null,null,null,"Asphalt Cf",null,null,null,null,"200 Cf",null,null,null,null,null,null,null,null,null,null,null,null,null,{"$f":"D15","v":0},{"$f":"J15","v":0},{"$f":"R15","v":0},{"$f":"Y15","v":0},null,{"$f":"IF(ISERROR(AX13),0,AX13)","v":0}]
["Ending Wt.",null,null,null,null,null,"Ending Wt.",null,null,null,null,null,null,"Ending Wt.",null,null,null,null,null,null,"Ending Wt.",null,null,null,null,null,null,"AC Avg",null,{"$f":"IF(AND(Y12=\"\",AT17=2),\"\",AZ20)","v":{"$error":"#VALUE!"}},null,null,"200 Avg",null,{"$f":"AD35","v":""},null,null,null,null,null,null,null,null,null,null,null,{"$f":"ROUND((AU11/AU8)*100-AU12,5)","v":{"$error":"#DIV/0!"}},{"$f":"ROUND((AV11/AV8)*100-AV12,5)","v":{"$error":"#DIV/0!"}},{"$f":"ROUND((AW11/AW8)*100-AW12,5)","v":{"$error":"#DIV/0!"}},{"$f":"ROUND((AX11/AX8)*100-AX12,5)","v":{"$error":"#DIV/0!"}},null,null,"Asphalt"]
["Wt. Loss",null,null,{"$f":"IF(ISBLANK(D13),\"\",D12-D13)","v":""},null,null,"Wt. Loss",null,null,{"$f":"IF(ISBLANK(J13),\"\",J12-J13)","v":""},null,null,null,"Wt. Loss",null,null,null,{"$f":"IF(ISBLANK(R13),\"\",R12-R13)","v":""},null,null,"Wt. Loss",null,null,null,{"$f":"IF(ISBLANK(Y13),\"\",Y12-Y13)","v":""},null,null,"AC JMF",null,{"$f":"'AC Trials'!B$16","v":0},null,null,"200 Blank",null,{"$f":"AI35","v":""},null,null,null,null,null,null,null,null,null,null,null,null,null,null,null,null,{"$f":"MAX(AZ8:AZ12)","v":{"$error":"#DIV/0!"}},"Selects High and low AC  values"]
["Temp. Comp.",null,null,null,null,null,"Temp. Comp.",null,null,null,null,null,null,"Temp. Comp.",null,null,null,null,null,null,"Temp. Comp.",null,null,null,null,null,null,"AC Cf",null,{"$f":"IF(ISTEXT(AD13),\"\",AD13-AD14)","v":{"$error":"#VALUE!"}},null,null,"200 Cf",null,{"$f":"ROUND(AI13-AI14,1)","v":{"$error":"#VALUE!"}},null,null,null,null,null,null,null,null,null,null,null,null,null,null,null,null,{"$f":"IF(OR(AZ11=0,AZ12=0),MIN(AZ8:AZ9),MIN(AZ8:AZ12))","v":{"$error":"#DIV/0!"}}]
["Asphalt Cont.",null,null,{"$f":"IF(ISBLANK(D13),\"\",ROUND((D14/D12)*100-D15,2))","v":""},null,null,"Asphalt Cont.",null,null,{"$f":"IF(ISBLANK(J13),\"\",ROUND((J14/J12)*100-J15,2))","v":""},null,null,null,"Asphalt Cont.",null,null,null,{"$f":"IF(ISBLANK(R13),\"\",ROUND((R14/R12)*100-R15,2))","v":""},null,null,"Asphalt Cont.",null,null,null,{"$f":"IF(ISBLANK(Y13),\"\",ROUND((Y14/Y12)*100-Y15,2))","v":""},null,null,{"$f":"IF(ISNUMBER(R12),\"\",IF(ISTEXT(AT17),\"\",IF(AT17=1,\"\",IF(AT17=2,\"The difference between the measured asphalt contents of the two samples exceeds .15, two more samples will need to be tested\"))))","v":{"$error":"#VALUE!"}},null,null,null,null,null,null,null,null,null,null,null,null,null,null,null,null,null,null,null,null,null,null,null,{"$f":"IF(OR(AZ11=0,AZ12=0),AZ8,IF(OR(AZ8=AZ14,AZ8=AZ15),\"\",AZ8))","v":{"$error":"#DIV/0!"}},"Eliminates high and low AC values and selects values to be used in average",null,{"$f":"IF(ISTEXT(AZ16),\"\",1)","v":1}]
[null,null,null,null,null,null,null,null,null,null,null,null,null,null,null,null,null,null,null,null,null,null,null,null,null,null,null,null,null,null,null,null,null,null,null,null,null,null,null,null,null,null,null,null,{"$f":"D16-J16","v":{"$error":"#VALUE!"}},{"$f":"IF(OR(AS17>0.15,AS17<-0.15),2,1)","v":{"$error":"#VALUE!"}},null,null,null,null,null,{"$f":"IF(OR(AZ11=0,AZ12=0),AZ9,IF(OR(AZ9=AZ14,AZ9=AZ15),\"\",AZ9))","v":{"$error":"#DIV/0!"}},null,null,{"$f":"IF(ISTEXT(AZ17),\"\",2)","v":2}]
[null,null,null,null,"200 Correction Factor",null,null,null,null,null,null,null,null,null,null,null,null,null,null,null,null,null,null,null,null,null,null,null,null,null,null,null,null,null,null,null,null,null,null,null,null,null,null,null,null,null,null,null,null,null,null,{"$f":"IF(OR(AZ11=AZ14,AZ11=AZ15),\"\",AZ11)","v":{"$error":"#DIV/0!"}},null,null,{"$f":"IF(ISTEXT(AZ18),\"\",IF(AZ18=0,\"\",3))","v":{"$error":"#DIV/0!"}}]
[null,null,null,null,"Sample 1",null,null,null,null,null,"Sample 2",null,null,null,null,null,"Sample 3",null,null,null,null,null,"Sample 4",null,null,null,null,null,null,null,null,null,"Blank Sample",null,null,null,null,null,null,null,null,null,null,null,null,null,null,null,null,null,null,{"$f":"IF(OR(AZ12=AZ14,AZ12=AZ15),\"\",AZ12)","v":{"$error":"#DIV/0!"}},null,null,{"$f":"IF(ISTEXT(AZ19),\"\",IF(AZ19=0,\"\",4))","v":{"$error":"#DIV/0!"}}]
["St Wt Before Wash",null,null,null,null,null,null,null,null,null,null,null,null,null,null,null,null,null,null,null,null,null,null,null,null,null,null,"St Wt Before Wash",null,null,null,null,null,null,null,null,null,null,null,null,null,null,null,null,null,null,null,null,null,null,null,{"$f":"IF(OR(AZ11=0,AZ12=0),ROUND(AVERAGE(AZ14:AZ15),2),ROUND(AVERAGE(AZ16:AZ19),2))","v":{"$error":"#DIV/0!"}},"Average Asphalt"]
["Dry Wt After Wash",null,null,null,null,null,null,null,null,null,null,null,null,null,null,null,null,null,null,null,null,null,null,null,null,null,null,"Dry Wt After Wash"]
["Sieve",null,"JMF",null,"Weight",null,null,"% Pass",null,null,"Weight",null,null,"% Pass",null,null,"Weight",null,"% Pass",null,null,null,"Weight",null,"% Pass",null,null,"JMF",null,"Average",null,null,"Weight",null,"% Pass",null,null,null,null,null,null,null,null,null,null,null,null,null,null,null,null,"Grad 1","Grad 2","Grad 3","Grad 4","Avg","Determines which aggregate gradations to use for average"]
[2,null,{"$f":"'Design Agg'!O$34","v":" "},null,null,null,null,{"$f":"IF(ISBLANK(E23),\"\",IF(ISBLANK(E$21),\"\",(E23+(E$20-E$21))/(E$21+(E$20-E$21))*100))","v":""},null,null,null,null,null,{"$f":"IF(ISBLANK(K23),\"\",IF(ISBLANK(K$21),\"\",(K23+(K$20-K$21))/(K$21+(K$20-K$21))*100))","v":""},null,null,null,null,{"$f":"IF(ISBLANK(Q23),\"\",IF(ISBLANK(Q$21),\"\",(Q23+(Q$20-Q$21))/(Q$21+(Q$20-Q$21))*100))","v":""},null,null,null,null,null,{"$f":"IF(ISBLANK(W23),\"\",IF(ISBLANK(W$21),\"\",(W23+(W$20-W$21))/(W$21+(W$20-W$21))*100))","v":""},null,null,{"$f":"C23","v":" "},null,{"$f":"IF(ISERROR(BD23),\"\",BD23)","v":""},null,null,null,null,{"$f":"IF(ISBLANK(AG23),\"\",IF(ISBLANK(AG$21),\"\",(AG23+(AG$20-AG$21))/(AG$21+(AG$20-AG$21))*100))","v":""},null,null,null,null,null,null,null,null,null,null,null,null,null,null,null,null,{"$f":"IF($BC$16=1,H23,\"\")","v":""},{"$f":"IF($BC$17=2,N23,\"\")","v":""},{"$f":"IF($BC$18=3,S23,\"\")","v":{"$error":"#DIV/0!"}},{"$f":"IF($BC$19=4,Y23,\"\")","v":{"$error":"#DIV/0!"}},{"$f":"AVERAGE(AZ23:BC23)","v":{"$error":"#DIV/0!"}}]
[1.5,null,{"$f":"'Design Agg'!N$34","v":" "},null,null,null,null,"",null,null,null,null,null,"",null,null,null,null,"",null,null,null,null,null,"",null,null,{"$f":"C24","v":" "},null,{"$f":"IF(ISERROR(BD24),\"\",BD24)","v":""},null,null,null,null,"",null,null,null,null,null,null,null,null,null,null,null,null,null,null,null,null,{"$f":"IF($BC$16=1,H24,\"\")","v":""},{"$f":"IF($BC$17=2,N24,\"\")","v":""},{"$f":"IF($BC$18=3,S24,\"\")","v":{"$error":"#DIV/0!"}},{"$error":"#DIV/0!"},{"$f":"AVERAGE(AZ24:BC24)","v":{"$error":"#DIV/0!"}}]
[1,null,{"$f":"'Design Agg'!M$34","v":" "},null,null,null,null,"",null,null,null,null,null,"",null,null,null,null,"",null,null,null,null,null,"",null,null," ",null,"",null,null,null,null,"",null,null,null,null,null,null,null,null,null,null,null,null,null,null,null,null,"","",{"$error":"#DIV/0!"},{"$error":"#DIV/0!"},{"$error":"#DIV/0!"}]
[0.75,null,{"$f":"'Design Agg'!L$34","v":" "},null,null,null,null,"",null,null,null,null,null,"",null,null,null,null,"",null,null,null,null,null,"",null,null," ",null,"",null,null,null,null,"",null,null,null,null,null,null,null,null,null,null,null,null,null,null,null,null,"","",{"$error":"#DIV/0!"},{"$error":"#DIV/0!"},{"$error":"#DIV/0!"}]
[0.5,null,{"$f":"'Design Agg'!K$34","v":" "},null,null,null,null,"",null,null,null,null,null,"",null,null,null,null,"",null,null,null,null,null,"",null,null," ",null,"",null,null,null,null,"",null,null,null,null,null,null,null,null,null,null,null,null,null,null,null,null,"","",{"$error":"#DIV/0!"},{"$error":"#DIV/0!"},{"$error":"#DIV/0!"}]
[0.375,null,{"$f":"'Design Agg'!J$34","v":" "},null,null,null,null,"",null,null,null,null,null,"",null,null,null,null,"",null,null,null,null,null,"",null,null," ",null,"",null,null,null,null,"",null,null,null,null,null,null,null,null,null,null,null,null,null,null,null,null,"","",{"$error":"#DIV/0!"},{"$error":"#DIV/0!"},{"$error":"#DIV/0!"}]
[4,null,{"$f":"'Design Agg'!H$34","v":" "},null,null,null,null,"",null,null,null,null,null,"",null,null,null,null,"",null,null,null,null,null,"",null,null," ",null,"",null,null,null,null,"",null,null,null,null,null,null,null,null,null,null,null,null,null,null,null,null,"","",{"$error":"#DIV/0!"},{"$error":"#DIV/0!"},{"$error":"#DIV/0!"}]
[8,null,{"$f":"'Design Agg'!G$34","v":" "},null,null,null,null,{"$f":"IF(ISBLANK(E30),\"\",IF(ISBLANK(E$21),\"\",(E30+(E$20-E$21))/(E$21+(E$20-E$21))*100))","v":""},null,null,null,null,null,"",null,null,null,null,"",null,null,null,null,null,"",null,null," ",null,"",null,null,null,null,"",null,null,null,null,null,null,null,null,null,null,null,null,null,null,null,null,"","",{"$error":"#DIV/0!"},{"$error":"#DIV/0!"},{"$error":"#DIV/0!"}]
[16,null,{"$f":"'Design Agg'!F$34","v":" "},null,null,null,null,"",null,null,null,null,null,"",null,null,null,null,"",null,null,null,null,null,"",null,null," ",null,"",null,null,null,null,"",null,null,null,null,null,null,null,null,null,null,null,null,null,null,null,null,"","",{"$error":"#DIV/0!"},{"$error":"#DIV/0!"},{"$error":"#DIV/0!"}]
[30,null,{"$f":"'Design Agg'!E$34","v":" "},null,null,null,null,"",null,null,null,null,null,"",null,null,null,null,"",null,null,null,null,null,"",null,null," ",null,"",null,null,null,null,"",null,null,null,null,null,null,null,null,null,null,null,null,null,null,null,null,"","",{"$error":"#DIV/0!"},{"$error":"#DIV/0!"},{"$error":"#DIV/0!"}]
[50,null,{"$f":"'Design Agg'!D$34","v":" "},null,null,null,null,"",null,null,null,null,null,"",null,null,null,null,"",null,null,null,null,null,"",null,null," ",null,"",null,null,null,null,"",null,null,null,null,null,null,null,null,null,null,null,null,null,null,null,null,"","",{"$error":"#DIV/0!"},{"$error":"#DIV/0!"},{"$error":"#DIV/0!"}]
[100,null,{"$f":"'Design Agg'!C$34","v":" "},null,null,null,null,"",null,null,null,null,null,"",null,null,null,null,"",null,null,null,null,null,"",null,null," ",null,"",null,null,null,null,"",null,null,null,null,null,null,null,null,null,null,null,null,null,null,null,null,"","",{"$error":"#DIV/0!"},{"$error":"#DIV/0!"},{"$error":"#DIV/0!"}]
[200,null,{"$f":"'Design Agg'!B$34","v":" "},null,null,null,null,{"$f":"IF(ISBLANK(E35),\"\",IF(ISBLANK(E$21),\"\",ROUND((E35+(E$20-E$21))/(E$21+(E$20-E$21))*100,1)))","v":""},null,null,null,null,null,{"$f":"IF(ISBLANK(K35),\"\",IF(ISBLANK(K$21),\"\",ROUND((K35+(K$20-K$21))/(K$21+(K$20-K$21))*100,1)))","v":""},null,null,null,null,{"$f":"IF(ISBLANK(Q35),\"\",IF(ISBLANK(Q$21),\"\",ROUND((Q35+(Q$20-Q$21))/(Q$21+(Q$20-Q$21))*100,1)))","v":""},null,null,null,null,null,{"$f":"IF(ISBLANK(W35),\"\",IF(ISBLANK(W$21),\"\",ROUND((W35+(W$20-W$21))/(W$21+(W$20-W$21))*100,1)))","v":""},null,null," ",null,"",null,null,null,null,{"$f":"IF(ISBLANK(AG35),\"\",IF(ISBLANK(AG$21),\"\",ROUND((AG35+(AG$20-AG$21))/(AG$21+(AG$20-AG$21))*100,1)))","v":""},null,null,null,null,null,null,null,null,null,null,null,null,null,null,null,null,"","",{"$error":"#DIV/0!"},{"$error":"#DIV/0!"},{"$f":"ROUND(AVERAGE(AZ35:BC35),1)","v":{"$error":"#DIV/0!"}}]
[]
["Weight of sample for TR 448",null,null,null,null,null,null,1200,null,null,null,null,null,null,null,null,null,null,null,null,null,null,null,null,null,null,null,null,null,null,null,null,null,null,null,null,null,null,null,null,null,null,null,null,null,null,{"$f":"D41","v":0},{"$f":"J41","v":0},{"$f":"R41","v":0},{"$f":"Y41","v":0},null,{"$f":"AU42","v":{"$error":"#DIV/0!"}}]
[null,null,null,null,null,null,null,null,null,null,null,null,null,null,null,null,null,null,null,null,null,null,null,null,null,null,null,null,null,null,null,null,null,null,null,null,null,null,null,null,null,null,null,null,null,null,{"$f":"D42","v":0},{"$f":"J42","v":0},{"$f":"R42","v":0},{"$f":"Y42","v":0},null,{"$f":"AV42","v":{"$error":"#DIV/0!"}}]
[null,null,null,null,null,null,"Ignition Oven Identification",null,null,null,null,null,null,null,{"$f":"Setup!F34","v":0}]
["Ignition Sample 1",null,null,null,null,null,"Ignition Sample 2",null,null,null,null,null,null,"Ignition Sample 3",null,null,null,null,null,null,"Ignition Sample 4",null,null,null,null,null,null,"Correction Factors for TR 448",null,null,null,null,null,null,null,null,null,null,null,null,null,null,null,null,null,null,{"$f":"AU37-AU38","v":0},{"$f":"AV37-AV38","v":0},{"$f":"AW37-AW38","v":0},{"$f":"AX37-AX38","v":0},null,{"$f":"IF(ISERROR(AW42),0,AW42)","v":0}]
["Starting Wt.",null,null,null,null,null,"Starting Wt.",null,null,null,null,null,null,"Starting Wt.",null,null,null,null,null,null,"Starting Wt.",null,null,null,null,null,null,"Asphalt Cf",null,null,null,null,"200 Cf",null,null,null,null,null,null,null,null,null,null,null,null,null,{"$f":"D44","v":0},{"$f":"J44","v":0},{"$f":"R44","v":0},{"$f":"Y44","v":0},null,{"$f":"IF(ISERROR(AX42),0,AX42)","v":0}]
["Ending Wt.",null,null,null,null,null,"Ending Wt.",null,null,null,null,null,null,"Ending Wt.",null,null,null,null,null,null,"Ending Wt.",null,null,null,null,null,null,"AC Avg",null,{"$f":"IF(AND(Y41=\"\",AT46=2),\"\",AZ49)","v":{"$error":"#VALUE!"}},null,null,"200 Avg",null,{"$f":"AD64","v":""},null,null,null,null,null,null,null,null,null,null,null,{"$f":"ROUND((AU40/AU37)*100-AU41,5)","v":{"$error":"#DIV/0!"}},{"$f":"ROUND((AV40/AV37)*100-AV41,5)","v":{"$error":"#DIV/0!"}},{"$f":"ROUND((AW40/AW37)*100-AW41,5)","v":{"$error":"#DIV/0!"}},{"$f":"ROUND((AX40/AX37)*100-AX41,5)","v":{"$error":"#DIV/0!"}},null,null,"Asphalt"]
["Wt. Loss",null,null,{"$f":"IF(ISBLANK(D42),\"\",D41-D42)","v":""},null,null,"Wt. Loss",null,null,{"$f":"IF(ISBLANK(J42),\"\",J41-J42)","v":""},null,null,null,"Wt. Loss",null,null,null,{"$f":"IF(ISBLANK(R42),\"\",R41-R42)","v":""},null,null,"Wt. Loss",null,null,null,{"$f":"IF(ISBLANK(Y42),\"\",Y41-Y42)","v":""},null,null,"AC JMF",null,{"$f":"'AC Trials'!B$16","v":0},null,null,"200 Blank",null,{"$f":"AI64","v":""},null,null,null,null,null,null,null,null,null,null,null,null,null,null,null,null,{"$f":"MAX(AZ37:AZ41)","v":{"$error":"#DIV/0!"}},"Selects High and low AC  values"]
["Temp. Comp.",null,null,null,null,null,"Temp. Comp.",null,null,null,null,null,null,"Temp. Comp.",null,null,null,null,null,null,"Temp. Comp.",null,null,null,null,null,null,"AC Cf",null,{"$f":"IF(ISTEXT(AD42),\"\",AD42-AD43)","v":{"$error":"#VALUE!"}},null,null,"200 Cf",null,{"$f":"ROUND(AI42-AI43,1)","v":{"$error":"#VALUE!"}},null,null,null,null,null,null,null,null,null,null,null,null,null,null,null,null,{"$f":"IF(OR(AZ40=0,AZ41=0),MIN(AZ37:AZ38),MIN(AZ37:AZ41))","v":{"$error":"#DIV/0!"}}]
["Asphalt Cont.",null,null,{"$f":"IF(ISBLANK(D42),\"\",ROUND((D43/D41)*100-D44,2))","v":""},null,null,"Asphalt Cont.",null,null,{"$f":"IF(ISBLANK(J42),\"\",ROUND((J43/J41)*100-J44,2))","v":""},null,null,null,"Asphalt Cont.",null,null,null,{"$f":"IF(ISBLANK(R42),\"\",ROUND((R43/R41)*100-R44,2))","v":""},null,null,"Asphalt Cont.",null,null,null,{"$f":"IF(ISBLANK(Y42),\"\",ROUND((Y43/Y41)*100-Y44,2))","v":""},null,null,{"$f":"IF(ISNUMBER(R41),\"\",IF(ISTEXT(AT46),\"\",IF(AT46=1,\"\",IF(AT46=2,\"The difference between the measured asphalt contents of the two samples exceeds .15, two more samples will need to be tested\"))))","v":{"$error":"#VALUE!"}},null,null,null,null,null,null,null,null,null,null,null,null,null,null,null,null,null,null,null,null,null,null,null,{"$f":"IF(OR(AZ40=0,AZ41=0),AZ37,IF(OR(AZ37=AZ43,AZ37=AZ44),\"\",AZ37))","v":{"$error":"#DIV/0!"}},"Eliminates high and low AC values and selects values to be used in average",null,{"$f":"IF(ISTEXT(AZ45),\"\",1)","v":1}]
[null,null,null,null,null,null,null,null,null,null,null,null,null,null,null,null,null,null,null,null,null,null,null,null,null,null,null,null,null,null,null,null,null,null,null,null,null,null,null,null,null,null,null,null,{"$f":"D45-J45","v":{"$error":"#VALUE!"}},{"$f":"IF(OR(AS46>0.15,AS46<-0.15),2,1)","v":{"$error":"#VALUE!"}},null,null,null,null,null,{"$f":"IF(OR(AZ40=0,AZ41=0),AZ38,IF(OR(AZ38=AZ43,AZ38=AZ44),\"\",AZ38))","v":{"$error":"#DIV/0!"}},null,null,{"$f":"IF(ISTEXT(AZ46),\"\",2)","v":2}]
[null,null,null,null,"200 Correction Factor",null,null,null,null,null,null,null,null,null,null,null,null,null,null,null,null,null,null,null,null,null,null,null,null,null,null,null,null,null,null,null,null,null,null,null,null,null,null,null,null,null,null,null,null,null,null,{"$f":"IF(OR(AZ40=AZ43,AZ40=AZ44),\"\",AZ40)","v":{"$error":"#DIV/0!"}},null,null,{"$f":"IF(ISTEXT(AZ47),\"\",IF(AZ47=0,\"\",3))","v":{"$error":"#DIV/0!"}}]
[null,null,null,null,"Sample 1",null,null,null,null,null,"Sample 2",null,null,null,null,null,"Sample 3",null,null,null,null,null,"Sample 4",null,null,null,null,null,null,null,null,null,"Blank Sample",null,null,null,null,null,null,null,null,null,null,null,null,null,null,null,null,null,null,{"$f":"IF(OR(AZ41=AZ43,AZ41=AZ44),\"\",AZ41)","v":{"$error":"#DIV/0!"}},null,null,{"$f":"IF(ISTEXT(AZ48),\"\",IF(AZ48=0,\"\",4))","v":{"$error":"#DIV/0!"}}]
["St Wt Before Wash",null,null,null,null,null,null,null,null,null,null,null,null,null,null,null,null,null,null,null,null,null,null,null,null,null,null,"St Wt Before Wash",null,null,null,null,null,null,null,null,null,null,null,null,null,null,null,null,null,null,null,null,null,null,null,{"$f":"IF(OR(AZ40=0,AZ41=0),ROUND(AVERAGE(AZ43:AZ44),2),ROUND(AVERAGE(AZ45:AZ48),2))","v":{"$error":"#DIV/0!"}},"Average Asphalt"]
["Dry Wt After Wash",null,null,null,null,null,null,null,null,null,null,null,null,null,null,null,null,null,null,null,null,null,null,null,null,null,null,"Dry Wt After Wash"]
["Sieve",null,"JMF",null,"Weight",null,null,"% Pass",null,null,"Weight",null,null,"% Pass",null,null,"Weight",null,"% Pass",null,null,null,"Weight",null,"% Pass",null,null,"JMF",null,"Average",null,null,"Weight",null,"% Pass",null,null,null,null,null,null,null,null,null,null,null,null,null,null,null,null,"Grad 1","Grad 2","Grad 3","Grad 4","Avg","Determines which aggregate gradations to use for average"]
[2,null,{"$f":"'Design Agg'!O$34","v":" "},null,null,null,null,{"$f":"IF(ISBLANK(E52),\"\",IF(ISBLANK(E$50),\"\",(E52+(E$49-E$50))/(E$50+(E$49-E$50))*100))","v":""},null,null,null,null,null,{"$f":"IF(ISBLANK(K52),\"\",IF(ISBLANK(K$50),\"\",(K52+(K$49-K$50))/(K$50+(K$49-K$50))*100))","v":""},null,null,null,null,{"$f":"IF(ISBLANK(Q52),\"\",IF(ISBLANK(Q$50),\"\",(Q52+(Q$49-Q$50))/(Q$50+(Q$49-Q$50))*100))","v":""},null,null,null,null,null,{"$f":"IF(ISBLANK(W52),\"\",IF(ISBLANK(W$50),\"\",(W52+(W$49-W$50))/(W$50+(W$49-W$50))*100))","v":""},null,null,{"$f":"C52","v":" "},null,{"$f":"IF(ISERROR(BD52),\"\",BD52)","v":""},null,null,null,null,{"$f":"IF(ISBLANK(AG52),\"\",IF(ISBLANK(AG$50),\"\",(AG52+(AG$49-AG$50))/(AG$50+(AG$49-AG$50))*100))","v":""},null,null,null,null,null,null,null,null,null,null,null,null,null,null,null,null,{"$f":"IF($BC$45=1,H52,\"\")","v":""},{"$f":"IF($BC$46=2,N52,\"\")","v":""},{"$f":"IF($BC$47=3,S52,\"\")","v":{"$error":"#DIV/0!"}},{"$f":"IF($BC$48=4,Y52,\"\")","v":{"$error":"#DIV/0!"}},{"$f":"AVERAGE(AZ52:BC52)","v":{"$error":"#DIV/0!"}}]
[1.5,null,{"$f":"'Design Agg'!N$34","v":" "},null,null,null,null,"",null,null,null,null,null,"",null,null,null,null,"",null,null,null,null,null,"",null,null,{"$f":"C53","v":" "},null,{"$f":"IF(ISERROR(BD53),\"\",BD53)","v":""},null,null,null,null,"",null,null,null,null,null,null,null,null,null,null,null,null,null,null,null,null,"","",{"$error":"#DIV/0!"},{"$error":"#DIV/0!"},{"$f":"AVERAGE(AZ53:BC53)","v":{"$error":"#DIV/0!"}}]
[1,null,{"$f":"'Design Agg'!M$34","v":" "},null,null,null,null,"",null,null,null,null,null,"",null,null,null,null,"",null,null,null,null,null,"",null,null," ",null,"",null,null,null,null,"",null,null,null,null,null,null,null,null,null,null,null,null,null,null,null,null,"","",{"$error":"#DIV/0!"},{"$error":"#DIV/0!"},{"$error":"#DIV/0!"}]
[0.75,null,{"$f":"'Design Agg'!L$34","v":" "},null,null,null,null,"",null,null,null,null,null,"",null,null,null,null,"",null,null,null,null,null,"",null,null," ",null,"",null,null,null,null,"",null,null,null,null,null,null,null,null,null,null,null,null,null,null,null,null,"","",{"$error":"#DIV/0!"},{"$error":"#DIV/0!"},{"$error":"#DIV/0!"}]
[0.5,null,{"$f":"'Design Agg'!K$34","v":" "},null,null,null,null,"",null,null,null,null,null,"",null,null,null,null,"",null,null,null,null,null,"",null,null," ",null,"",null,null,null,null,"",null,null,null,null,null,null,null,null,null,null,null,null,null,null,null,null,"","",{"$error":"#DIV/0!"},{"$error":"#DIV/0!"},{"$error":"#DIV/0!"}]
[0.375,null,{"$f":"'Design Agg'!J$34","v":" "},null,null,null,null,"",null,null,null,null,null,"",null,null,null,null,"",null,null,null,null,null,"",null,null," ",null,"",null,null,null,null,"",null,null,null,null,null,null,null,null,null,null,null,null,null,null,null,null,"","",{"$error":"#DIV/0!"},{"$error":"#DIV/0!"},{"$error":"#DIV/0!"}]
[4,null,{"$f":"'Design Agg'!H$34","v":" "},null,null,null,null,"",null,null,null,null,null,"",null,null,null,null,"",null,null,null,null,null,"",null,null," ",null,"",null,null,null,null,"",null,null,null,null,null,null,null,null,null,null,null,null,null,null,null,null,"","",{"$error":"#DIV/0!"},{"$error":"#DIV/0!"},{"$error":"#DIV/0!"}]
[8,null,{"$f":"'Design Agg'!G$34","v":" "},null,null,null,null,"",null,null,null,null,null,"",null,null,null,null,"",null,null,null,null,null,"",null,null," ",null,"",null,null,null,null,"",null,null,null,null,null,null,null,null,null,null,null,null,null,null,null,null,"","",{"$error":"#DIV/0!"},{"$error":"#DIV/0!"},{"$error":"#DIV/0!"}]
[16,null,{"$f":"'Design Agg'!F$34","v":" "},null,null,null,null,"",null,null,null,null,null,"",null,null,null,null,"",null,null,null,null,null,"",null,null," ",null,"",null,null,null,null,"",null,null,null,null,null,null,null,null,null,null,null,null,null,null,null,null,"","",{"$error":"#DIV/0!"},{"$error":"#DIV/0!"},{"$error":"#DIV/0!"}]
[30,null,{"$f":"'Design Agg'!E$34","v":" "},null,null,null,null,"",null,null,null,null,null,"",null,null,null,null,"",null,null,null,null,null,"",null,null," ",null,"",null,null,null,null,"",null,null,null,null,null,null,null,null,null,null,null,null,null,null,null,null,"","",{"$error":"#DIV/0!"},{"$error":"#DIV/0!"},{"$error":"#DIV/0!"}]
[50,null,{"$f":"'Design Agg'!D$34","v":" "},null,null,null,null,"",null,null,null,null,null,"",null,null,null,null,"",null,null,null,null,null,"",null,null," ",null,"",null,null,null,null,"",null,null,null,null,null,null,null,null,null,null,null,null,null,null,null,null,"","",{"$error":"#DIV/0!"},{"$error":"#DIV/0!"},{"$error":"#DIV/0!"}]
[100,null,{"$f":"'Design Agg'!C$34","v":" "},null,null,null,null,"",null,null,null,null,null,"",null,null,null,null,"",null,null,null,null,null,"",null,null," ",null,"",null,null,null,null,"",null,null,null,null,null,null,null,null,null,null,null,null,null,null,null,null,"","",{"$error":"#DIV/0!"},{"$error":"#DIV/0!"},{"$error":"#DIV/0!"}]
[200,null,{"$f":"'Design Agg'!B$34","v":" "},null,null,null,null,{"$f":"IF(ISBLANK(E64),\"\",IF(ISBLANK(E$50),\"\",ROUND((E64+(E$49-E$50))/(E$50+(E$49-E$50))*100,1)))","v":""},null,null,null,null,null,{"$f":"IF(ISBLANK(K64),\"\",IF(ISBLANK(K$50),\"\",ROUND((K64+(K$49-K$50))/(K$50+(K$49-K$50))*100,1)))","v":""},null,null,null,null,{"$f":"IF(ISBLANK(Q64),\"\",IF(ISBLANK(Q$50),\"\",ROUND((Q64+(Q$49-Q$50))/(Q$50+(Q$49-Q$50))*100,1)))","v":""},null,null,null,null,null,{"$f":"IF(ISBLANK(W64),\"\",IF(ISBLANK(W$50),\"\",ROUND((W64+(W$49-W$50))/(W$50+(W$49-W$50))*100,1)))","v":""},null,null," ",null,"",null,null,null,null,{"$f":"IF(ISBLANK(AG64),\"\",IF(ISBLANK(AG$50),\"\",ROUND((AG64+(AG$49-AG$50))/(AG$50+(AG$49-AG$50))*100,1)))","v":""},null,null,null,null,null,null,null,null,null,null,null,null,null,null,null,null,"","",{"$error":"#DIV/0!"},{"$error":"#DIV/0!"},{"$f":"ROUND(AVERAGE(AZ64:BC64),1)","v":{"$error":"#DIV/0!"}}]
[]
["Weight of sample for TR 448",null,null,null,null,null,null,null,null,null,null,null,null,null,null,null,null,null,null,null,null,null,null,null,null,null,null,null,null,null,null,null,null,null,null,null,null,null,null,null,null,null,null,null,null,null,{"$f":"D70","v":0},{"$f":"J70","v":0},{"$f":"R70","v":0},{"$f":"Y70","v":0},null,{"$f":"AU71","v":{"$error":"#DIV/0!"}}]
[null,null,null,null,null,null,null,null,null,null,null,null,null,null,null,null,null,null,null,null,null,null,null,null,null,null,null,null,null,null,null,null,null,null,null,null,null,null,null,null,null,null,null,null,null,null,{"$f":"D71","v":0},{"$f":"J71","v":0},{"$f":"R71","v":0},{"$f":"Y71","v":0},null,{"$f":"AV71","v":{"$error":"#DIV/0!"}}]
[null,null,null,null,null,null,"Ignition Oven Identification",null,null,null,null,null,null,null,{"$f":"Setup!G34","v":0}]
["Ignition Sample 1",null,null,null,null,null,"Ignition Sample 2",null,null,null,null,null,null,"Ignition Sample 3",null,null,null,null,null,null,"Ignition Sample 4",null,null,null,null,null,null,"Correction Factors for TR 448",null,null,null,null,null,null,null,null,null,null,null,null,null,null,null,null,null,null,{"$f":"AU66-AU67","v":0},{"$f":"AV66-AV67","v":0},{"$f":"AW66-AW67","v":0},{"$f":"AX66-AX67","v":0},null,{"$f":"IF(ISERROR(AW71),0,AW71)","v":0}]
["Starting Wt.",null,null,null,null,null,"Starting Wt.",null,null,null,null,null,null,"Starting Wt.",null,null,null,null,null,null,"Starting Wt.",null,null,null,null,null,null,"Asphalt Cf",null,null,null,null,"200 Cf",null,null,null,null,null,null,null,null,null,null,null,null,null,{"$f":"D73","v":0},{"$f":"J73","v":0},{"$f":"R73","v":0},{"$f":"Y73","v":0},null,{"$f":"IF(ISERROR(AX71),0,AX71)","v":0}]
["Ending Wt.",null,null,null,null,null,"Ending Wt.",null,null,null,null,null,null,"Ending Wt.",null,null,null,null,null,null,"Ending Wt.",null,null,null,null,null,null,"AC Avg",null,{"$f":"IF(AND(Y70=\"\",AT75=2),\"\",AZ78)","v":{"$error":"#VALUE!"}},null,null,"200 Avg",null,{"$f":"AD93","v":""},null,null,null,null,null,null,null,null,null,null,null,{"$f":"ROUND((AU69/AU66)*100-AU70,5)","v":{"$error":"#DIV/0!"}},{"$f":"ROUND((AV69/AV66)*100-AV70,5)","v":{"$error":"#DIV/0!"}},{"$f":"ROUND((AW69/AW66)*100-AW70,5)","v":{"$error":"#DIV/0!"}},{"$f":"ROUND((AX69/AX66)*100-AX70,5)","v":{"$error":"#DIV/0!"}},null,null,"Asphalt"]
["Wt. Loss",null,null,{"$f":"IF(ISBLANK(D71),\"\",D70-D71)","v":""},null,null,"Wt. Loss",null,null,{"$f":"IF(ISBLANK(J71),\"\",J70-J71)","v":""},null,null,null,"Wt. Loss",null,null,null,{"$f":"IF(ISBLANK(R71),\"\",R70-R71)","v":""},null,null,"Wt. Loss",null,null,null,{"$f":"IF(ISBLANK(Y71),\"\",Y70-Y71)","v":""},null,null,"AC JMF",null,{"$f":"'AC Trials'!B$16","v":0},null,null,"200 Blank",null,{"$f":"AI93","v":""},null,null,null,null,null,null,null,null,null,null,null,null,null,null,null,null,{"$f":"MAX(AZ66:AZ70)","v":{"$error":"#DIV/0!"}},"Selects High and low AC  values"]
["Temp. Comp.",null,null,null,null,null,"Temp. Comp.",null,null,null,null,null,null,"Temp. Comp.",null,null,null,null,null,null,"Temp. Comp.",null,null,null,null,null,null,"AC Cf",null,{"$f":"IF(ISTEXT(AD71),\"\",AD71-AD72)","v":{"$error":"#VALUE!"}},null,null,"200 Cf",null,{"$f":"ROUND(AI71-AI72,1)","v":{"$error":"#VALUE!"}},null,null,null,null,null,null,null,null,null,null,null,null,null,null,null,null,{"$f":"IF(OR(AZ69=0,AZ70=0),MIN(AZ66:AZ67),MIN(AZ66:AZ70))","v":{"$error":"#DIV/0!"}}]
["Asphalt Cont.",null,null,{"$f":"IF(ISBLANK(D71),\"\",ROUND((D72/D70)*100-D73,2))","v":""},null,null,"Asphalt Cont.",null,null,{"$f":"IF(ISBLANK(J71),\"\",ROUND((J72/J70)*100-J73,2))","v":""},null,null,null,"Asphalt Cont.",null,null,null,{"$f":"IF(ISBLANK(R71),\"\",ROUND((R72/R70)*100-R73,2))","v":""},null,null,"Asphalt Cont.",null,null,null,{"$f":"IF(ISBLANK(Y71),\"\",ROUND((Y72/Y70)*100-Y73,2))","v":""},null,null,{"$f":"IF(ISNUMBER(R70),\"\",IF(ISTEXT(AT75),\"\",IF(AT75=1,\"\",IF(AT75=2,\"The difference between the measured asphalt contents of the two samples exceeds .15, two more samples will need to be tested\"))))","v":{"$error":"#VALUE!"}},null,null,null,null,null,null,null,null,null,null,null,null,null,null,null,null,null,null,null,null,null,null,null,{"$f":"IF(OR(AZ69=0,AZ70=0),AZ66,IF(OR(AZ66=AZ72,AZ66=AZ73),\"\",AZ66))","v":{"$error":"#DIV/0!"}},"Eliminates high and low AC values and selects values to be used in average",null,{"$f":"IF(ISTEXT(AZ74),\"\",1)","v":1}]
[null,null,null,null,null,null,null,null,null,null,null,null,null,null,null,null,null,null,null,null,null,null,null,null,null,null,null,null,null,null,null,null,null,null,null,null,null,null,null,null,null,null,null,null,{"$f":"D74-J74","v":{"$error":"#VALUE!"}},{"$f":"IF(OR(AS75>0.15,AS75<-0.15),2,1)","v":{"$error":"#VALUE!"}},null,null,null,null,null,{"$f":"IF(OR(AZ69=0,AZ70=0),AZ67,IF(OR(AZ67=AZ72,AZ67=AZ73),\"\",AZ67))","v":{"$error":"#DIV/0!"}},null,null,{"$f":"IF(ISTEXT(AZ75),\"\",2)","v":2}]
[null,null,null,null,"200 Correction Factor",null,null,null,null,null,null,null,null,null,null,null,null,null,null,null,null,null,null,null,null,null,null,null,null,null,null,null,null,null,null,null,null,null,null,null,null,null,null,null,null,null,null,null,null,null,null,{"$f":"IF(OR(AZ69=AZ72,AZ69=AZ73),\"\",AZ69)","v":{"$error":"#DIV/0!"}},null,null,{"$f":"IF(ISTEXT(AZ76),\"\",IF(AZ76=0,\"\",3))","v":{"$error":"#DIV/0!"}}]
[null,null,null,null,"Sample 1",null,null,null,null,null,"Sample 2",null,null,null,null,null,"Sample 3",null,null,null,null,null,"Sample 4",null,null,null,null,null,null,null,null,null,"Blank Sample",null,null,null,null,null,null,null,null,null,null,null,null,null,null,null,null,null,null,{"$f":"IF(OR(AZ70=AZ72,AZ70=AZ73),\"\",AZ70)","v":{"$error":"#DIV/0!"}},null,null,{"$f":"IF(ISTEXT(AZ77),\"\",IF(AZ77=0,\"\",4))","v":{"$error":"#DIV/0!"}}]
["St Wt Before Wash",null,null,null,null,null,null,null,null,null,null,null,null,null,null,null,null,null,null,null,null,null,null,null,null,null,null,"St Wt Before Wash",null,null,null,null,null,null,null,null,null,null,null,null,null,null,null,null,null,null,null,null,null,null,null,{"$f":"IF(OR(AZ69=0,AZ70=0),ROUND(AVERAGE(AZ72:AZ73),2),ROUND(AVERAGE(AZ74:AZ77),2))","v":{"$error":"#DIV/0!"}},"Average Asphalt"]
["Dry Wt After Wash",null,null,null,null,null,null,null,null,null,null,null,null,null,null,null,null,null,null,null,null,null,null,null,null,null,null,"Dry Wt After Wash"]
["Sieve",null,"JMF",null,"Weight",null,null,"% Pass",null,null,"Weight",null,null,"% Pass",null,null,"Weight",null,"% Pass",null,null,null,"Weight",null,"% Pass",null,null,"JMF",null,"Average",null,null,"Weight",null,"% Pass",null,null,null,null,null,null,null,null,null,null,null,null,null,null,null,null,"Grad 1","Grad 2","Grad 3","Grad 4","Avg","Determines which aggregate gradations to use for average"]
[2,null,{"$f":"'Design Agg'!O$34","v":" "},null,null,null,null,{"$f":"IF(ISBLANK(E81),\"\",IF(ISBLANK(E$79),\"\",(E81+(E$78-E$79))/(E$79+(E$78-E$79))*100))","v":""},null,null,null,null,null,{"$f":"IF(ISBLANK(K81),\"\",IF(ISBLANK(K$79),\"\",(K81+(K$78-K$79))/(K$79+(K$78-K$79))*100))","v":""},null,null,null,null,{"$f":"IF(ISBLANK(Q81),\"\",IF(ISBLANK(Q$79),\"\",(Q81+(Q$78-Q$79))/(Q$79+(Q$78-Q$79))*100))","v":""},null,null,null,null,null,{"$f":"IF(ISBLANK(W81),\"\",IF(ISBLANK(W$79),\"\",(W81+(W$78-W$79))/(W$79+(W$78-W$79))*100))","v":""},null,null,{"$f":"C81","v":" "},null,{"$f":"IF(ISERROR(BD81),\"\",BD81)","v":""},null,null,null,null,{"$f":"IF(ISBLANK(AG81),\"\",IF(ISBLANK(AG$79),\"\",(AG81+(AG$78-AG$79))/(AG$79+(AG$78-AG$79))*100))","v":""},null,null,null,null,null,null,null,null,null,null,null,null,null,null,null,null,{"$f":"IF($BC$74=1,H81,\"\")","v":""},{"$f":"IF($BC$75=2,N81,\"\")","v":""},{"$f":"IF($BC$76=3,S81,\"\")","v":{"$error":"#DIV/0!"}},{"$f":"IF($BC$77=4,Y81,\"\")","v":{"$error":"#DIV/0!"}},{"$f":"AVERAGE(AZ81:BC81)","v":{"$error":"#DIV/0!"}}]
[1.5,null,{"$f":"'Design Agg'!N$34","v":" "},null,null,null,null,"",null,null,null,null,null,"",null,null,null,null,"",null,null,null,null,null,"",null,null,{"$f":"C82","v":" "},null,{"$f":"IF(ISERROR(BD82),\"\",BD82)","v":""},null,null,null,null,"",null,null,null,null,null,null,null,null,null,null,null,null,null,null,null,null,"","",{"$error":"#DIV/0!"},{"$error":"#DIV/0!"},{"$f":"AVERAGE(AZ82:BC82)","v":{"$error":"#DIV/0!"}}]
[1,null,{"$f":"'Design Agg'!M$34","v":" "},null,null,null,null,"",null,null,null,null,null,"",null,null,null,null,"",null,null,null,null,null,"",null,null," ",null,"",null,null,null,null,"",null,null,null,null,null,null,null,null,null,null,null,null,null,null,null,null,"","",{"$error":"#DIV/0!"},{"$error":"#DIV/0!"},{"$error":"#DIV/0!"}]
[0.75,null,{"$f":"'Design Agg'!L$34","v":" "},null,null,null,null,"",null,null,null,null,null,"",null,null,null,null,"",null,null,null,null,null,"",null,null," ",null,"",null,null,null,null,"",null,null,null,null,null,null,null,null,null,null,null,null,null,null,null,null,"","",{"$error":"#DIV/0!"},{"$error":"#DIV/0!"},{"$error":"#DIV/0!"}]
[0.5,null,{"$f":"'Design Agg'!K$34","v":" "},null,null,null,null,"",null,null,null,null,null,"",null,null,null,null,"",null,null,null,null,null,"",null,null," ",null,"",null,null,null,null,"",null,null,null,null,null,null,null,null,null,null,null,null,null,null,null,null,"","",{"$error":"#DIV/0!"},{"$error":"#DIV/0!"},{"$error":"#DIV/0!"}]
[0.375,null,{"$f":"'Design Agg'!J$34","v":" "},null,null,null,null,"",null,null,null,null,null,"",null,null,null,null,"",null,null,null,null,null,"",null,null," ",null,"",null,null,null,null,"",null,null,null,null,null,null,null,null,null,null,null,null,null,null,null,null,"","",{"$error":"#DIV/0!"},{"$error":"#DIV/0!"},{"$error":"#DIV/0!"}]
[4,null,{"$f":"'Design Agg'!H$34","v":" "},null,null,null,null,"",null,null,null,null,null,"",null,null,null,null,"",null,null,null,null,null,"",null,null," ",null,"",null,null,null,null,"",null,null,null,null,null,null,null,null,null,null,null,null,null,null,null,null,"","",{"$error":"#DIV/0!"},{"$error":"#DIV/0!"},{"$error":"#DIV/0!"}]
[8,null,{"$f":"'Design Agg'!G$34","v":" "},null,null,null,null,"",null,null,null,null,null,"",null,null,null,null,"",null,null,null,null,null,"",null,null," ",null,"",null,null,null,null,"",null,null,null,null,null,null,null,null,null,null,null,null,null,null,null,null,"","",{"$error":"#DIV/0!"},{"$error":"#DIV/0!"},{"$error":"#DIV/0!"}]
[16,null,{"$f":"'Design Agg'!F$34","v":" "},null,null,null,null,"",null,null,null,null,null,"",null,null,null,null,"",null,null,null,null,null,"",null,null," ",null,"",null,null,null,null,"",null,null,null,null,null,null,null,null,null,null,null,null,null,null,null,null,"","",{"$error":"#DIV/0!"},{"$error":"#DIV/0!"},{"$error":"#DIV/0!"}]
[30,null,{"$f":"'Design Agg'!E$34","v":" "},null,null,null,null,"",null,null,null,null,null,"",null,null,null,null,"",null,null,null,null,null,"",null,null," ",null,"",null,null,null,null,"",null,null,null,null,null,null,null,null,null,null,null,null,null,null,null,null,"","",{"$error":"#DIV/0!"},{"$error":"#DIV/0!"},{"$error":"#DIV/0!"}]
[50,null,{"$f":"'Design Agg'!D$34","v":" "},null,null,null,null,"",null,null,null,null,null,"",null,null,null,null,"",null,null,null,null,null,"",null,null," ",null,"",null,null,null,null,"",null,null,null,null,null,null,null,null,null,null,null,null,null,null,null,null,"","",{"$error":"#DIV/0!"},{"$error":"#DIV/0!"},{"$error":"#DIV/0!"}]
[100,null,{"$f":"'Design Agg'!C$34","v":" "},null,null,null,null,"",null,null,null,null,null,"",null,null,null,null,"",null,null,null,null,null,"",null,null," ",null,"",null,null,null,null,"",null,null,null,null,null,null,null,null,null,null,null,null,null,null,null,null,"","",{"$error":"#DIV/0!"},{"$error":"#DIV/0!"},{"$error":"#DIV/0!"}]
[200,null,{"$f":"'Design Agg'!B$34","v":" "},null,null,null,null,{"$f":"IF(ISBLANK(E93),\"\",IF(ISBLANK(E$79),\"\",ROUND((E93+(E$78-E$79))/(E$79+(E$78-E$79))*100,1)))","v":""},null,null,null,null,null,{"$f":"IF(ISBLANK(K93),\"\",IF(ISBLANK(K$79),\"\",ROUND((K93+(K$78-K$79))/(K$79+(K$78-K$79))*100,1)))","v":""},null,null,null,null,{"$f":"IF(ISBLANK(Q93),\"\",IF(ISBLANK(Q$79),\"\",ROUND((Q93+(Q$78-Q$79))/(Q$79+(Q$78-Q$79))*100,1)))","v":""},null,null,null,null,null,{"$f":"IF(ISBLANK(W93),\"\",IF(ISBLANK(W$79),\"\",ROUND((W93+(W$78-W$79))/(W$79+(W$78-W$79))*100,1)))","v":""},null,null," ",null,"",null,null,null,null,{"$f":"IF(ISBLANK(AG93),\"\",IF(ISBLANK(AG$79),\"\",ROUND((AG93+(AG$78-AG$79))/(AG$79+(AG$78-AG$79))*100,1)))","v":""},null,null,null,null,null,null,null,null,null,null,null,null,null,null,null,null,"","",{"$error":"#DIV/0!"},{"$error":"#DIV/0!"},{"$f":"ROUND(AVERAGE(AZ93:BC93),1)","v":{"$error":"#DIV/0!"}}]
[]
["Weight of sample for TR 448",null,null,null,null,null,null,null,null,null,null,null,null,null,null,null,null,null,null,null,null,null,null,null,null,null,null,null,null,null,null,null,null,null,null,null,null,null,null,null,null,null,null,null,null,null,{"$f":"D99","v":0},{"$f":"J99","v":0},{"$f":"R99","v":0},{"$f":"Y99","v":0},null,{"$f":"AU100","v":{"$error":"#DIV/0!"}}]
[null,null,null,null,null,null,null,null,null,null,null,null,null,null,null,null,null,null,null,null,null,null,null,null,null,null,null,null,null,null,null,null,null,null,null,null,null,null,null,null,null,null,null,null,null,null,{"$f":"D100","v":0},{"$f":"J100","v":0},{"$f":"R100","v":0},{"$f":"Y100","v":0},null,{"$f":"AV100","v":{"$error":"#DIV/0!"}}]
[null,null,null,null,null,null,"Ignition Oven Identification",null,null,null,null,null,null,null,{"$f":"Setup!H34","v":0}]
["Ignition Sample 1",null,null,null,null,null,"Ignition Sample 2",null,null,null,null,null,null,"Ignition Sample 3",null,null,null,null,null,null,"Ignition Sample 4",null,null,null,null,null,null,"Correction Factors for TR 448",null,null,null,null,null,null,null,null,null,null,null,null,null,null,null,null,null,null,{"$f":"AU95-AU96","v":0},{"$f":"AV95-AV96","v":0},{"$f":"AW95-AW96","v":0},{"$f":"AX95-AX96","v":0},null,{"$f":"IF(ISERROR(AW100),0,AW100)","v":0}]
["Starting Wt.",null,null,null,null,null,"Starting Wt.",null,null,null,null,null,null,"Starting Wt.",null,null,null,null,null,null,"Starting Wt.",null,null,null,null,null,null,"Asphalt Cf",null,null,null,null,"200 Cf",null,null,null,null,null,null,null,null,null,null,null,null,null,{"$f":"D102","v":0},{"$f":"J102","v":0},{"$f":"R102","v":0},{"$f":"Y102","v":0},null,{"$f":"IF(ISERROR(AX100),0,AX100)","v":0}]
["Ending Wt.",null,null,null,null,null,"Ending Wt.",null,null,null,null,null,null,"Ending Wt.",null,null,null,null,null,null,"Ending Wt.",null,null,null,null,null,null,"AC Avg",null,{"$f":"IF(AND(Y99=\"\",AT104=2),\"\",AZ107)","v":{"$error":"#VALUE!"}},null,null,"200 Avg",null,{"$f":"AD122","v":""},null,null,null,null,null,null,null,null,null,null,null,{"$f":"ROUND((AU98/AU95)*100-AU99,5)","v":{"$error":"#DIV/0!"}},{"$f":"ROUND((AV98/AV95)*100-AV99,5)","v":{"$error":"#DIV/0!"}},{"$f":"ROUND((AW98/AW95)*100-AW99,5)","v":{"$error":"#DIV/0!"}},{"$f":"ROUND((AX98/AX95)*100-AX99,5)","v":{"$error":"#DIV/0!"}},null,null,"Asphalt"]
["Wt. Loss",null,null,{"$f":"IF(ISBLANK(D100),\"\",D99-D100)","v":""},null,null,"Wt. Loss",null,null,{"$f":"IF(ISBLANK(J100),\"\",J99-J100)","v":""},null,null,null,"Wt. Loss",null,null,null,{"$f":"IF(ISBLANK(R100),\"\",R99-R100)","v":""},null,null,"Wt. Loss",null,null,null,{"$f":"IF(ISBLANK(Y100),\"\",Y99-Y100)","v":""},null,null,"AC JMF",null,{"$f":"'AC Trials'!B$16","v":0},null,null,"200 Blank",null,{"$f":"AI122","v":""},null,null,null,null,null,null,null,null,null,null,null,null,null,null,null,null,{"$f":"MAX(AZ95:AZ99)","v":{"$error":"#DIV/0!"}},"Selects High and low AC  values"]
["Temp. Comp.",null,null,null,null,null,"Temp. Comp.",null,null,null,null,null,null,"Temp. Comp.",null,null,null,null,null,null,"Temp. Comp.",null,null,null,null,null,null,"AC Cf",null,{"$f":"IF(ISTEXT(AD100),\"\",AD100-AD101)","v":{"$error":"#VALUE!"}},null,null,"200 Cf",null,{"$f":"ROUND(AI100-AI101,1)","v":{"$error":"#VALUE!"}},null,null,null,null,null,null,null,null,null,null,null,null,null,null,null,null,{"$f":"IF(OR(AZ98=0,AZ99=0),MIN(AZ95:AZ96),MIN(AZ95:AZ99))","v":{"$error":"#DIV/0!"}}]
["Asphalt Cont.",null,null,{"$f":"IF(ISBLANK(D100),\"\",ROUND((D101/D99)*100-D102,2))","v":""},null,null,"Asphalt Cont.",null,null,{"$f":"IF(ISBLANK(J100),\"\",ROUND((J101/J99)*100-J102,2))","v":""},null,null,null,"Asphalt Cont.",null,null,null,{"$f":"IF(ISBLANK(R100),\"\",ROUND((R101/R99)*100-R102,2))","v":""},null,null,"Asphalt Cont.",null,null,null,{"$f":"IF(ISBLANK(Y100),\"\",ROUND((Y101/Y99)*100-Y102,2))","v":""},null,null,{"$f":"IF(ISNUMBER(R99),\"\",IF(ISTEXT(AT104),\"\",IF(AT104=1,\"\",IF(AT104=2,\"The difference between the measured asphalt contents of the two samples exceeds .15, two more samples will need to be tested\"))))","v":{"$error":"#VALUE!"}},null,null,null,null,null,null,null,null,null,null,null,null,null,null,null,null,null,null,null,null,null,null,null,{"$f":"IF(OR(AZ98=0,AZ99=0),AZ95,IF(OR(AZ95=AZ101,AZ95=AZ102),\"\",AZ95))","v":{"$error":"#DIV/0!"}},"Eliminates high and low AC values and selects values to be used in average",null,{"$f":"IF(ISTEXT(AZ103),\"\",1)","v":1}]
[null,null,null,null,null,null,null,null,null,null,null,null,null,null,null,null,null,null,null,null,null,null,null,null,null,null,null,null,null,null,null,null,null,null,null,null,null,null,null,null,null,null,null,null,{"$f":"D103-J103","v":{"$error":"#VALUE!"}},{"$f":"IF(OR(AS104>0.15,AS104<-0.15),2,1)","v":{"$error":"#VALUE!"}},null,null,null,null,null,{"$f":"IF(OR(AZ98=0,AZ99=0),AZ96,IF(OR(AZ96=AZ101,AZ96=AZ102),\"\",AZ96))","v":{"$error":"#DIV/0!"}},null,null,{"$f":"IF(ISTEXT(AZ104),\"\",2)","v":2}]
[null,null,null,null,"200 Correction Factor",null,null,null,null,null,null,null,null,null,null,null,null,null,null,null,null,null,null,null,null,null,null,null,null,null,null,null,null,null,null,null,null,null,null,null,null,null,null,null,null,null,null,null,null,null,null,{"$f":"IF(OR(AZ98=AZ101,AZ98=AZ102),\"\",AZ98)","v":{"$error":"#DIV/0!"}},null,null,{"$f":"IF(ISTEXT(AZ105),\"\",IF(AZ105=0,\"\",3))","v":{"$error":"#DIV/0!"}}]
[null,null,null,null,"Sample 1",null,null,null,null,null,"Sample 2",null,null,null,null,null,"Sample 3",null,null,null,null,null,"Sample 4",null,null,null,null,null,null,null,null,null,"Blank Sample",null,null,null,null,null,null,null,null,null,null,null,null,null,null,null,null,null,null,{"$f":"IF(OR(AZ99=AZ101,AZ99=AZ102),\"\",AZ99)","v":{"$error":"#DIV/0!"}},null,null,{"$f":"IF(ISTEXT(AZ106),\"\",IF(AZ106=0,\"\",4))","v":{"$error":"#DIV/0!"}}]
["St Wt Before Wash",null,null,null,null,null,null,null,null,null,null,null,null,null,null,null,null,null,null,null,null,null,null,null,null,null,null,"St Wt Before Wash",null,null,null,null,null,null,null,null,null,null,null,null,null,null,null,null,null,null,null,null,null,null,null,{"$f":"IF(OR(AZ98=0,AZ99=0),ROUND(AVERAGE(AZ101:AZ102),2),ROUND(AVERAGE(AZ103:AZ106),2))","v":{"$error":"#DIV/0!"}},"Average Asphalt"]
["Dry Wt After Wash",null,null,null,null,null,null,null,null,null,null,null,null,null,null,null,null,null,null,null,null,null,null,null,null,null,null,"Dry Wt After Wash"]
["Sieve",null,"JMF",null,"Weight",null,null,"% Pass",null,null,"Weight",null,null,"% Pass",null,null,"Weight",null,"% Pass",null,null,null,"Weight",null,"% Pass",null,null,"JMF",null,"Average",null,null,"Weight",null,"% Pass",null,null,null,null,null,null,null,null,null,null,null,null,null,null,null,null,"Grad 1","Grad 2","Grad 3","Grad 4","Avg","Determines which aggregate gradations to use for average"]
[2,null,{"$f":"'Design Agg'!O$34","v":" "},null,null,null,null,{"$f":"IF(ISBLANK(E110),\"\",IF(ISBLANK(E$108),\"\",(E110+(E$107-E$108))/(E$108+(E$107-E$108))*100))","v":""},null,null,null,null,null,{"$f":"IF(ISBLANK(K110),\"\",IF(ISBLANK(K$108),\"\",(K110+(K$107-K$108))/(K$108+(K$107-K$108))*100))","v":""},null,null,null,null,{"$f":"IF(ISBLANK(Q110),\"\",IF(ISBLANK(Q$108),\"\",(Q110+(Q$107-Q$108))/(Q$108+(Q$107-Q$108))*100))","v":""},null,null,null,null,null,{"$f":"IF(ISBLANK(W110),\"\",IF(ISBLANK(W$108),\"\",(W110+(W$107-W$108))/(W$108+(W$107-W$108))*100))","v":""},null,null,{"$f":"C110","v":" "},null,{"$f":"IF(ISERROR(BD110),\"\",BD110)","v":""},null,null,null,null,{"$f":"IF(ISBLANK(AG110),\"\",IF(ISBLANK(AG$108),\"\",(AG110+(AG$107-AG$108))/(AG$108+(AG$107-AG$108))*100))","v":""},null,null,null,null,null,null,null,null,null,null,null,null,null,null,null,null,{"$f":"IF($BC$103=1,H110,\"\")","v":""},{"$f":"IF($BC$104=2,N110,\"\")","v":""},{"$f":"IF($BC$105=3,S110,\"\")","v":{"$error":"#DIV/0!"}},{"$f":"IF($BC$106=4,Y110,\"\")","v":{"$error":"#DIV/0!"}},{"$f":"AVERAGE(AZ110:BC110)","v":{"$error":"#DIV/0!"}}]
[1.5,null,{"$f":"'Design Agg'!N$34","v":" "},null,null,null,null,"",null,null,null,null,null,"",null,null,null,null,"",null,null,null,null,null,"",null,null,{"$f":"C111","v":" "},null,{"$f":"IF(ISERROR(BD111),\"\",BD111)","v":""},null,null,null,null,"",null,null,null,null,null,null,null,null,null,null,null,null,null,null,null,null,"","",{"$error":"#DIV/0!"},{"$error":"#DIV/0!"},{"$f":"AVERAGE(AZ111:BC111)","v":{"$error":"#DIV/0!"}}]
[1,null,{"$f":"'Design Agg'!M$34","v":" "},null,null,null,null,"",null,null,null,null,null,"",null,null,null,null,"",null,null,null,null,null,"",null,null," ",null,"",null,null,null,null,"",null,null,null,null,null,null,null,null,null,null,null,null,null,null,null,null,"","",{"$error":"#DIV/0!"},{"$error":"#DIV/0!"},{"$error":"#DIV/0!"}]
[0.75,null,{"$f":"'Design Agg'!L$34","v":" "},null,null,null,null,"",null,null,null,null,null,"",null,null,null,null,"",null,null,null,null,null,"",null,null," ",null,"",null,null,null,null,"",null,null,null,null,null,null,null,null,null,null,null,null,null,null,null,null,"","",{"$error":"#DIV/0!"},{"$error":"#DIV/0!"},{"$error":"#DIV/0!"}]
[0.5,null,{"$f":"'Design Agg'!K$34","v":" "},null,null,null,null,"",null,null,null,null,null,"",null,null,null,null,"",null,null,null,null,null,"",null,null," ",null,"",null,null,null,null,"",null,null,null,null,null,null,null,null,null,null,null,null,null,null,null,null,"","",{"$error":"#DIV/0!"},{"$error":"#DIV/0!"},{"$error":"#DIV/0!"}]
[0.375,null,{"$f":"'Design Agg'!J$34","v":" "},null,null,null,null,"",null,null,null,null,null,"",null,null,null,null,"",null,null,null,null,null,"",null,null," ",null,"",null,null,null,null,"",null,null,null,null,null,null,null,null,null,null,null,null,null,null,null,null,"","",{"$error":"#DIV/0!"},{"$error":"#DIV/0!"},{"$error":"#DIV/0!"}]
[4,null,{"$f":"'Design Agg'!H$34","v":" "},null,null,null,null,"",null,null,null,null,null,"",null,null,null,null,"",null,null,null,null,null,"",null,null," ",null,"",null,null,null,null,"",null,null,null,null,null,null,null,null,null,null,null,null,null,null,null,null,"","",{"$error":"#DIV/0!"},{"$error":"#DIV/0!"},{"$error":"#DIV/0!"}]
[8,null,{"$f":"'Design Agg'!G$34","v":" "},null,null,null,null,"",null,null,null,null,null,"",null,null,null,null,"",null,null,null,null,null,"",null,null," ",null,"",null,null,null,null,"",null,null,null,null,null,null,null,null,null,null,null,null,null,null,null,null,"","",{"$error":"#DIV/0!"},{"$error":"#DIV/0!"},{"$error":"#DIV/0!"}]
[16,null,{"$f":"'Design Agg'!F$34","v":" "},null,null,null,null,"",null,null,null,null,null,"",null,null,null,null,"",null,null,null,null,null,"",null,null," ",null,"",null,null,null,null,"",null,null,null,null,null,null,null,null,null,null,null,null,null,null,null,null,"","",{"$error":"#DIV/0!"},{"$error":"#DIV/0!"},{"$error":"#DIV/0!"}]
[30,null,{"$f":"'Design Agg'!E$34","v":" "},null,null,null,null,"",null,null,null,null,null,"",null,null,null,null,"",null,null,null,null,null,"",null,null," ",null,"",null,null,null,null,"",null,null,null,null,null,null,null,null,null,null,null,null,null,null,null,null,"","",{"$error":"#DIV/0!"},{"$error":"#DIV/0!"},{"$error":"#DIV/0!"}]
[50,null,{"$f":"'Design Agg'!D$34","v":" "},null,null,null,null,"",null,null,null,null,null,"",null,null,null,null,"",null,null,null,null,null,"",null,null," ",null,"",null,null,null,null,"",null,null,null,null,null,null,null,null,null,null,null,null,null,null,null,null,"","",{"$error":"#DIV/0!"},{"$error":"#DIV/0!"},{"$error":"#DIV/0!"}]
[100,null,{"$f":"'Design Agg'!C$34","v":" "},null,null,null,null,"",null,null,null,null,null,"",null,null,null,null,"",null,null,null,null,null,"",null,null," ",null,"",null,null,null,null,"",null,null,null,null,null,null,null,null,null,null,null,null,null,null,null,null,"","",{"$error":"#DIV/0!"},{"$error":"#DIV/0!"},{"$error":"#DIV/0!"}]
[200,null,{"$f":"'Design Agg'!B$34","v":" "},null,null,null,null,{"$f":"IF(ISBLANK(E122),\"\",IF(ISBLANK(E$108),\"\",ROUND((E122+(E$107-E$108))/(E$108+(E$107-E$108))*100,1)))","v":""},null,null,null,null,null,{"$f":"IF(ISBLANK(K122),\"\",IF(ISBLANK(K$108),\"\",ROUND((K122+(K$107-K$108))/(K$108+(K$107-K$108))*100,1)))","v":""},null,null,null,null,{"$f":"IF(ISBLANK(Q122),\"\",IF(ISBLANK(Q$108),\"\",ROUND((Q122+(Q$107-Q$108))/(Q$108+(Q$107-Q$108))*100,1)))","v":""},null,null,null,null,null,{"$f":"IF(ISBLANK(W122),\"\",IF(ISBLANK(W$108),\"\",ROUND((W122+(W$107-W$108))/(W$108+(W$107-W$108))*100,1)))","v":""},null,null," ",null,"",null,null,null,null,{"$f":"IF(ISBLANK(AG122),\"\",IF(ISBLANK(AG$108),\"\",ROUND((AG122+(AG$107-AG$108))/(AG$108+(AG$107-AG$108))*100,1)))","v":""},null,null,null,null,null,null,null,null,null,null,null,null,null,null,null,null,"","",{"$error":"#DIV/0!"},{"$error":"#DIV/0!"},{"$f":"ROUND(AVERAGE(AZ122:BC122),1)","v":{"$error":"#DIV/0!"}}]
[]
["Weight of sample for TR 448"]

{"sheet":"TR 448A","index":18,"n_rows":88,"n_cols":37,"rows_kept":88,"cut":false,"hidden":false,"merged":[[0,34,0,36],[35,0,35,20],[36,0,36,4],[36,5,36,7],[36,8,36,10],[36,11,36,13],[36,14,36,16],[36,17,36,20],[37,0,37,4],[37,5,37,7],[37,8,37,10],[37,11,37,13],[37,14,37,16],[37,17,37,20],[24,0,24,20],[16,0,16,20],[0,26,0,27],[1,26,1,27],[13,32,13,33],[14,32,14,33],[15,32,15,33],[2,13,2,16],[2,17,2,20],[3,6,3,7],[65,4,65,9],[65,10,65,11],[65,12,65,14],[65,15,65,17],[64,0,64,3],[65,0,65,3],[64,18,64,20],[65,18,65,20],[63,4,63,9],[63,10,63,11],[63,12,63,14],[63,15,63,17],[63,0,63,3],[63,18,63,20],[64,4,64,9],[64,10,64,11],[64,12,64,14],[64,15,64,17],[0,17,0,20],[1,0,6,3],[1,6,1,9],[1,13,1,16],[1,17,1,20],[2,6,2,7],[2,8,2,9],[6,7,6,8],[6,13,6,18],[6,19,6,20],[3,8,3,9],[3,15,3,18],[3,19,3,20],[0,0,0,3],[0,4,0,12],[0,13,0,16],[5,6,5,9],[8,0,8,1],[8,2,8,4],[8,5,8,6],[8,7,8,12],[8,14,8,20],[4,6,4,9],[4,13,4,18],[4,19,4,20],[5,13,5,18],[5,19,5,20],[10,0,10,3],[10,4,10,11],[10,12,10,14],[10,15,10,20],[12,0,12,4],[12,5,12,6],[12,7,12,10],[12,11,12,12],[12,13,12,15],[12,16,12,17],[17,0,17,4],[17,5,17,7],[17,8,17,10],[17,11,17,13],[17,14,17,16],[17,17,17,20],[12,19,12,20],[14,0,14,1],[14,2,14,3],[14,4,14,6],[14,7,14,11],[14,12,14,13],[14,14,14,17],[19,0,19,4],[19,5,19,7],[19,8,19,10],[19,11,19,13],[19,14,19,16],[19,17,19,20],[18,0,18,4],[18,5,18,7],[18,8,18,10],[18,11,18,13],[18,14,18,16],[18,17,18,20],[21,0,21,4],[21,5,21,7],[21,8,21,10],[21,11,21,13],[21,14,21,16],[21,17,21,20],[20,0,20,4],[20,5,20,7],[20,8,20,10],[20,11,20,13],[20,14,20,16],[20,17,20,20],[23,0,23,4],[23,5,23,7],[23,8,23,10],[23,11,23,13],[23,14,23,16],[23,17,23,20],[22,0,22,4],[22,5,22,7],[22,8,22,10],[22,11,22,13],[22,14,22,16],[22,17,22,20],[26,0,26,4],[26,5,26,7],[26,8,26,10],[26,11,26,13],[26,14,26,16],[26,17,26,20],[25,0,25,4],[25,5,25,7],[25,8,25,10],[25,11,25,13],[25,14,25,16],[25,17,25,20],[30,0,30,4],[30,5,30,7],[30,8,30,10],[30,11,30,13],[30,14,30,16],[30,17,30,20],[28,0,28,4],[28,5,28,7],[28,8,28,10],[28,11,28,13],[28,14,28,16],[28,17,28,20],[51,17,52,20],[48,6,48,13],[48,14,48,15],[53,0,53,2],[53,3,53,5],[53,6,53,7],[53,8,53,9],[53,10,53,11],[53,12,53,13],[53,14,53,16],[53,17,53,20],[48,0,48,4],[50,0,50,20],[51,0,52,2],[51,3,52,5],[51,6,52,7],[51,8,52,9],[51,10,52,11],[51,12,52,13],[51,14,52,16],[54,14,55,16],[54,17,55,20],[56,0,56,2],[56,3,56,5],[56,6,56,7],[56,8,56,9],[56,10,56,11],[56,12,56,13],[56,14,56,16],[56,17,56,20],[54,0,55,2],[54,3,55,5],[54,6,55,7],[54,8,55,9],[54,10,55,11],[54,12,55,13],[62,4,62,9],[62,10,62,11],[62,12,62,14],[62,15,62,17],[60,0,60,20],[61,4,61,9],[61,10,61,11],[61,12,61,14],[61,15,61,17],[61,0,61,3],[62,0,62,3],[61,18,61,20],[62,18,62,20],[69,1,69,3],[69,4,69,6],[69,7,69,9],[69,10,69,11],[69,12,69,15],[69,16,69,19],[67,0,67,20],[68,1,68,3],[68,4,68,6],[68,7,68,9],[68,12,68,15],[68,16,68,19],[71,1,71,3],[71,4,71,6],[71,7,71,9],[71,10,71,11],[71,12,71,15],[71,16,71,19],[70,1,70,3],[70,4,70,6],[70,7,70,9],[70,10,70,11],[70,12,70,15],[70,16,70,19],[72,7,72,9],[72,10,72,11],[72,12,72,15],[72,16,72,19],[87,0,87,2],[87,3,87,11],[87,12,87,14],[87,15,87,16],[87,18,87,20],[79,17,79,19],[81,0,81,20],[83,0,83,2],[83,3,83,11],[83,12,83,14],[83,15,83,16],[83,18,83,20],[79,1,79,2],[79,3,79,6],[79,7,79,9],[79,10,79,12],[79,13,79,14],[79,15,79,16],[27,0,27,20],[29,17,29,20],[29,14,29,16],[29,11,29,13],[29,8,29,10],[29,5,29,7],[29,0,29,4],[85,0,85,2],[85,3,85,11],[85,12,85,14],[85,15,85,16],[85,18,85,20],[74,0,74,20],[75,1,78,2],[75,3,78,6],[75,7,77,12],[75,13,77,16],[75,17,78,19],[78,7,78,9],[78,10,78,12],[78,13,78,14],[78,15,78,16],[72,1,72,3],[72,4,72,6],[39,5,39,10],[39,12,39,17],[31,0,31,4],[31,5,31,7],[31,8,31,10],[31,11,31,13],[31,14,31,16],[31,17,31,20],[32,0,32,20],[33,17,33,20],[33,14,33,16],[33,11,33,13],[33,8,33,10],[33,5,33,7],[33,0,33,4],[58,6,58,7],[58,8,58,9],[58,10,58,11],[57,10,57,11],[57,8,57,9],[57,6,57,7],[57,3,58,5],[34,0,34,4],[34,5,34,7],[34,8,34,10],[34,11,34,13],[41,0,41,20],[42,2,44,2],[45,0,45,1],[46,0,46,4],[46,6,46,10],[46,11,46,13],[46,14,47,16],[46,17,47,17],[47,0,47,4],[47,6,47,10],[47,11,47,13],[34,14,34,16],[34,17,34,20]]}
["TR-448A   (1-15)",null,null,null,"JOB MIX FORMULA REPORT",null,null,null,null,null,null,null,null,"SUPPLIER CODE",null,null,null,"MATERIAL CLASS",null,null,null,null,null,null,"PG 46-40",null,"Trial Blend Selected",null,{"$f":"'Trial Blends'!N42","v":0},{"$f":"'AC Trials'!K41","v":0},null,null,null,null,"% in Blend"]
[null,null,null,null,null,null,"PennDOT JMF No.",null,null,null,null,null,null,{"$f":"Setup!E8","v":0},null,null,null,{"$f":"Setup!E11","v":0},null,null,null,null,null,null,"PG 52-28",null,"% Recycled in mix",null,{"$f":"IF(OR(Setup!E18=0,ISBLANK(Setup!E18)),0,1)","v":0},{"$f":"ROUND(AD1-AI16,1)","v":0},null,null,null,null,"TB1","TB2","TB3"]
[null,null,null,null,null,null,{"$f":"Setup!AC6","v":""},null,{"$f":"Setup!E5","v":0},null,null,null,null,"Design ESAL'S",null,null,null,{"$f":"Setup!E13","v":0},null,null,null,null,null,null,"PG 58-28",null,null,null,null,null,null,null,null,"Agg 1",{"$f":"'Agg Blends'!L9","v":0},{"$f":"'Agg Blends'!M9","v":0},{"$f":"'Agg Blends'!N9","v":0}]
[null,null,null,null,null,null,"Year",null,"No.",null,null,null,null,null,null,null,null,null,null,{"$f":"Setup!E12","v":0},null,null,null,null,"PG 64-22",null,null,null,null,null,null,null,null,"Agg 2",{"$f":"'Agg Blends'!L10","v":0},{"$f":"'Agg Blends'!M10","v":0},{"$f":"'Agg Blends'!N10","v":0}]
[null,null,null,null,null,null,"Supplier JMF No.",null,null,null,null,null,null,"Mixture Final PG Binder Grade",null,null,null,null,null,null,null,null,null,null,"PG 64-28",null,null,null,null,null,null,null,null,"Agg 3",{"$f":"'Agg Blends'!L11","v":0},{"$f":"'Agg Blends'!M11","v":0},{"$f":"'Agg Blends'!N11","v":0}]
[null,null,null,null,null,null,null,null,null,null,null,null,null,"Asphalt Mix Type",null,null,null,null,null,null,null,null,null,null,"PG 76-22",null,null,null,null,null,null,null,null,"Agg 4",{"$f":"'Agg Blends'!L12","v":0},{"$f":"'Agg Blends'!M12","v":0},{"$f":"'Agg Blends'!N12","v":0}]
[null,null,null,null,null,null,null,null,null,null,null,null,null,"Original Approval Date",null,null,null,null,null,null,null,null,null,null,"PG 58S-28",null,null,null,null,null,null,null,null,"Agg 5",{"$f":"'Agg Blends'!L13","v":0},{"$f":"'Agg Blends'!M13","v":0},{"$f":"'Agg Blends'!N13","v":0}]
[null,null,null,null,null,null,null,null,null,null,null,null,null,null,null,null,null,null,null,null,null,null,null,null,"PG 64S-22",null,null,null,null,null,null,null,null,"Agg 6",{"$f":"'Agg Blends'!L14","v":0},{"$f":"'Agg Blends'!M14","v":0},{"$f":"'Agg Blends'!N14","v":0}]
["DATE",null,null,null,null,"SPEC",null,null,null,null,null,null,null,"PO",null,null,null,null,null,null,null,null,null,null,"PG 64E-22",null,null,null,null,null,null,null,null,"% Rec1",{"$f":"'Agg Blends'!L16","v":0},{"$f":"'Agg Blends'!M16","v":0},{"$f":"'Agg Blends'!N16","v":0}]
[null,null,null,null,null,null,null,null,null,null,null,null,null,null,null,null,null,null,null,null,null,null,null,null,null,null,null,null,null,null,null,null,null,"% Rec2",{"$f":"'Agg Blends'!L17","v":0},{"$f":"'Agg Blends'!M17","v":0},{"$f":"'Agg Blends'!N17","v":0}]
["SUPPLIER NAME",null,null,null,null,null,null,null,null,null,null,null,"LOCATION",null,null,null,null,null,null,null,null,null,null,null,null,null,null,null,null,null,null,null,null,"AC Rec1",{"$f":"'Agg Blends'!CO87","v":0}]
[null,null,null,null,null,null,null,null,null,null,null,null,null,null,null,null,null,null,null,null,null,null,null,null,"HMA",null,null,null,null,null,null,null,null,"AC Rec2",{"$f":"'Agg Blends'!CO88","v":0}]
["BITUMINOUS PLANT TYPE",null,null,null,null,null,null,"TONS PER HOUR",null,null,null,null,null,"ECMS NO.",null,null,null,null,null,"Mix Time",null,null,null,null,"WMA"]
[null,null,null,null,null,null,null,null,null,null,null,null,null,null,null,null,null,null,null,"Dry","Wet",null,null,null,"COLD",null,null,null,null,null,null,null,"%AC in Recycle1",null,{"$f":"IF($AC$2=0,\"\",IF(ISTEXT(AI$11),\"\",ROUND(IF(AC$1=1,(AI$11/100)*AI$9,IF(AC$1=2,(AI$11/100)*AJ$9,IF(AC$1=3,(AI$11/100)*AK$9))),1)))","v":""},{"$f":"ROUND(AI14,1)","v":{"$error":"#VALUE!"}}]
["SR & SEC",null,null,null,"CONTRACTOR",null,null,null,null,null,null,null,"LOCATION",null,null,null,null,null,null,null,null,null,null,null,null,null,null,null,null,null,null,null,"%AC in Recycle2",null,{"$f":"IF($AC$2=0,\"\",IF(ISTEXT(AI$12),\"\",ROUND(IF(AC$1=1,(AI$12/100)*AI$10,IF(AC$1=2,(AI$12/100)*AJ$10,IF(AC$1=3,(AI$12/100)*AK$10))),1)))","v":""},{"$f":"ROUND(AI15,1)","v":{"$error":"#VALUE!"}}]
[null,null,null,null,null,null,null,null,null,null,null,null,null,null,null,null,null,null,null,null,null,null,null,null,null,null,null,null,null,null,null,null,"Sum % Recycled AC",null,{"$f":"SUM(AI14:AI15)","v":0},{"$f":"ROUND(AI16,1)","v":0}]
["Virgin Aggregate"]
["Material Supplier Code",null,null,null,null,"Material Code",null,null,"Material Class",null,null,"% In Mix",null,null,"Bulk Sp. Gr.",null,null,"% Absorption"]
[{"$f":"IF(AND(ISBLANK('Agg Blends'!$L9),ISBLANK('Agg Blends'!$M9),ISBLANK('Agg Blends'!$N9)),\" \",'Agg Blends'!F9)","v":" "},null,null,null,null,{"$f":"(IF(AND(ISBLANK('Agg Blends'!$L$9),ISBLANK('Agg Blends'!$M$9),ISBLANK('Agg Blends'!$N$9)),\" \",'Agg Blends'!H9))","v":" "},null,null,{"$f":"(IF(AND(ISBLANK('Agg Blends'!$L9),ISBLANK('Agg Blends'!$M9),ISBLANK('Agg Blends'!$N9)),\" \",'Agg Blends'!I9))","v":" "},null,null,{"$f":"IF($AC$1=1,(100-$AD$1)/100*AI3,IF($AC$1=2,(100-$AD$1)/100*AJ3,IF($AC$1=3,(100-$AD$1)/100*AK3)))","v":false},null,null,{"$f":"'Agg Blends'!D$36","v":0},null,null,{"$f":"'Agg Blends'!D$37","v":0}]
[{"$f":"IF(AND(ISBLANK('Agg Blends'!$L10),ISBLANK('Agg Blends'!$M10),ISBLANK('Agg Blends'!$N10)),\" \",'Agg Blends'!F10)","v":" "},null,null,null,null,{"$f":"(IF(AND(ISBLANK('Agg Blends'!$L$10),ISBLANK('Agg Blends'!$M$10),ISBLANK('Agg Blends'!$N$10)),\" \",'Agg Blends'!H10))","v":" "},null,null,{"$f":"(IF(AND(ISBLANK('Agg Blends'!$L10),ISBLANK('Agg Blends'!$M10),ISBLANK('Agg Blends'!$N10)),\" \",'Agg Blends'!I10))","v":" "},null,null,false,null,null,{"$f":"'Agg Blends'!E$36","v":0},null,null,{"$f":"'Agg Blends'!E$37","v":0}]
[{"$f":"IF(AND(ISBLANK('Agg Blends'!$L11),ISBLANK('Agg Blends'!$M11),ISBLANK('Agg Blends'!$N11)),\" \",'Agg Blends'!F11)","v":" "},null,null,null,null,{"$f":"(IF(AND(ISBLANK('Agg Blends'!$L$11),ISBLANK('Agg Blends'!$M$11),ISBLANK('Agg Blends'!$N$11)),\" \",'Agg Blends'!H11))","v":" "},null,null,{"$f":"(IF(AND(ISBLANK('Agg Blends'!$L11),ISBLANK('Agg Blends'!$M11),ISBLANK('Agg Blends'!$N11)),\" \",'Agg Blends'!I11))","v":" "},null,null,false,null,null,{"$f":"'Agg Blends'!F$36","v":0},null,null,{"$f":"'Agg Blends'!F$37","v":0}]
[{"$f":"IF(AND(ISBLANK('Agg Blends'!$L12),ISBLANK('Agg Blends'!$M12),ISBLANK('Agg Blends'!$N12)),\" \",'Agg Blends'!F12)","v":" "},null,null,null,null,{"$f":"(IF(AND(ISBLANK('Agg Blends'!$L$12),ISBLANK('Agg Blends'!$M$12),ISBLANK('Agg Blends'!$N$12)),\" \",'Agg Blends'!H12))","v":" "},null,null,{"$f":"(IF(AND(ISBLANK('Agg Blends'!$L2),ISBLANK('Agg Blends'!$M12),ISBLANK('Agg Blends'!$N12)),\" \",'Agg Blends'!I12))","v":" "},null,null,false,null,null,{"$f":"'Agg Blends'!G$36","v":0},null,null,{"$f":"'Agg Blends'!G$37","v":0}]
[{"$f":"IF(AND(ISBLANK('Agg Blends'!$L13),ISBLANK('Agg Blends'!$M13),ISBLANK('Agg Blends'!$N13)),\" \",'Agg Blends'!F13)","v":" "},null,null,null,null,{"$f":"(IF(AND(ISBLANK('Agg Blends'!$L$13),ISBLANK('Agg Blends'!$M$13),ISBLANK('Agg Blends'!$N$13)),\" \",'Agg Blends'!H13))","v":" "},null,null,{"$f":"(IF(AND(ISBLANK('Agg Blends'!$L13),ISBLANK('Agg Blends'!$M13),ISBLANK('Agg Blends'!$N13)),\" \",'Agg Blends'!I13))","v":" "},null,null,false,null,null,{"$f":"'Agg Blends'!H$36","v":0},null,null,{"$f":"'Agg Blends'!H$37","v":0}]
[{"$f":"IF(AND(ISBLANK('Agg Blends'!$L14),ISBLANK('Agg Blends'!$M14),ISBLANK('Agg Blends'!$N14)),\" \",'Agg Blends'!F14)","v":" "},null,null,null,null,{"$f":"(IF(AND(ISBLANK('Agg Blends'!$L$14),ISBLANK('Agg Blends'!$M$14),ISBLANK('Agg Blends'!$N$14)),\" \",'Agg Blends'!H14))","v":" "},null,null,{"$f":"(IF(AND(ISBLANK('Agg Blends'!$L4),ISBLANK('Agg Blends'!$M4),ISBLANK('Agg Blends'!$N14)),\" \",'Agg Blends'!I14))","v":0},null,null,false,null,null,{"$f":"'Agg Blends'!I$36","v":0},null,null,{"$f":"'Agg Blends'!I$37","v":0}]
["Recycle Aggregate"]
[{"$f":"IF(AND(ISBLANK('Agg Blends'!$L16),ISBLANK('Agg Blends'!$M16),ISBLANK('Agg Blends'!$N16)),\" \",'Agg Blends'!F16)","v":" "},null,null,null,null,{"$f":"(IF(AND(ISBLANK('Agg Blends'!$L$9),ISBLANK('Agg Blends'!$M$9),ISBLANK('Agg Blends'!$N$9)),\" \",'Agg Blends'!H16))","v":" "},null,null,{"$f":"IF(AND(ISBLANK('Agg Blends'!$L$16),ISBLANK('Agg Blends'!$M$16),ISBLANK('Agg Blends'!$N$16)),\" \",'Agg Blends'!$I$16)","v":" "},null,null,{"$f":"IF($AC$1=1,('Agg Blends'!L16-AI14),IF($AC$1=2,('Agg Blends'!M16-AI14),IF($AC$1=3,('Agg Blends'!N16-AI14))))","v":false},null,null,{"$f":"'Agg Blends'!J$36","v":0}]
[{"$f":"IF(AND(ISBLANK('Agg Blends'!$L17),ISBLANK('Agg Blends'!$M17),ISBLANK('Agg Blends'!$N17)),\" \",'Agg Blends'!F17)","v":" "},null,null,null,null,{"$f":"(IF(AND(ISBLANK('Agg Blends'!$L$9),ISBLANK('Agg Blends'!$M$9),ISBLANK('Agg Blends'!$N$9)),\" \",'Agg Blends'!H17))","v":" "},null,null,{"$f":"IF(AND(ISBLANK('Agg Blends'!$L$17),ISBLANK('Agg Blends'!$M$17),ISBLANK('Agg Blends'!$N$17)),\" \",'Agg Blends'!$I$17)","v":" "},null,null,{"$f":"IF($AC$1=1,('Agg Blends'!L17-AI15),IF($AC$1=2,('Agg Blends'!M17-AI15),IF($AC$1=3,('Agg Blends'!N17-AI15))))","v":false},null,null,{"$f":"'Agg Blends'!K$36","v":0}]
["Virgin Asphalt"]
[{"$f":"Setup!E14","v":0},null,null,null,null,{"$f":"IF(ISBLANK(Setup!E14),\"\",1)","v":""},null,null,{"$f":"Setup!E15","v":0},null,null,{"$f":"AD2","v":0},null,null,{"$f":"Setup!E16","v":0}]
[{"$f":"Setup!R14","v":0},null,null,null,null,{"$f":"IF(ISBLANK(Setup!R14),\"\",1)","v":""},null,null,{"$f":"IF(ISBLANK(Setup!R14),\"\",I$29)","v":""}]
[{"$f":"Setup!R15","v":0},null,null,null,null,{"$f":"IF(ISBLANK(Setup!R15),\"\",1)","v":""},null,null,{"$f":"IF(ISBLANK(Setup!R15),\"\",I$29)","v":""}]
[{"$f":"Setup!R16","v":0},null,null,null,null,{"$f":"IF(ISBLANK(Setup!R16),\"\",1)","v":""},null,null,{"$f":"IF(ISBLANK(Setup!R16),\"\",I$29)","v":""}]
["Recycled Ashpalt"]
[{"$f":"IF(AND(ISBLANK('Agg Blends'!$L$16),ISBLANK('Agg Blends'!$M$16),ISBLANK('Agg Blends'!$N$16)),\" \",'Agg Blends'!$F$16)","v":" "},null,null,null,null,null,null,null,{"$f":"IF(AND(ISBLANK('Agg Blends'!$L$16),ISBLANK('Agg Blends'!$M$16),ISBLANK('Agg Blends'!$N$16)),\" \",'Agg Blends'!$I$16)","v":" "},null,null,{"$f":"AI14","v":""}]
[{"$f":"IF(AND(ISBLANK('Agg Blends'!L$17),ISBLANK('Agg Blends'!M$17),ISBLANK('Agg Blends'!NM$17)),\" \",'Agg Blends'!F$17)","v":" "},null,null,null,null,null,null,null,{"$f":"IF(AND(ISBLANK('Agg Blends'!$L$17),ISBLANK('Agg Blends'!$M$17),ISBLANK('Agg Blends'!$N$17)),\" \",'Agg Blends'!$I$17)","v":" "},null,null,{"$f":"AI15","v":""}]
["Asphalt Additives / Stabilizer"]
[]
[]
[]
["Total % Asphalt in Mix",null,null,null,{"$f":"AD1","v":0},"Total % Recycled Asphalt in Mix",null,null,null,null,null,{"$f":"AI16","v":0},"Total Percent Recycled in Mix",null,null,null,null,null,{"$f":"IF(AC1=1,SUM(AI9:AI10),IF(AC1=2,SUM(AJ9:AJ10),IF(AC1=3,SUM(AK9:AK10),\"\")))","v":""}]
[]
["JOB MIX FORMULA AND DESIGN"]
[null,null,"AC %",7.4999999999999997E-2,0.15,0.3,0.6,1.18,2.36,4.75,6.33,9.5,12.5,19,25,37.5,50,"F/A","Pbe"]
[null,null,null,"mm","mm","mm","mm","mm","mm","mm","mm","mm","mm","mm","mm","mm","mm"]
[null,null,null,"#200","#100","#50","#30","#16","#8","#4",0.25,0.375,0.5,0.75,1,1.5,2]
["Design",null,{"$f":"'AC Trials'!B16","v":0},{"$f":"'Design Agg'!B34","v":" "},{"$f":"'Design Agg'!C34","v":" "},{"$f":"'Design Agg'!D34","v":" "},{"$f":"'Design Agg'!E34","v":" "},{"$f":"'Design Agg'!F34","v":" "},{"$f":"'Design Agg'!G34","v":" "},{"$f":"'Design Agg'!H34","v":" "},{"$f":"'Design Agg'!I34","v":" "},{"$f":"'Design Agg'!J34","v":" "},{"$f":"'Design Agg'!K34","v":" "},{"$f":"'Design Agg'!L34","v":" "},{"$f":"'Design Agg'!M34","v":" "},{"$f":"'Design Agg'!N34","v":" "},{"$f":"'Design Agg'!O34","v":" "},{"$f":"'AC Trials'!K50","v":""},{"$f":"'AC Trials'!K49","v":""}]
["% Virgin AC",null,null,null,null,{"$f":"C46-AI16","v":0},"Virgin AC PG Binder Grade",null,null,null,null,{"$f":"Setup!E15","v":0},null,null,"Asphalt Film Thickness (micron)",null,null,{"$f":"Sheet1!F12","v":{"$error":"#VALUE!"}}]
["% Reclaimed AC from Rec1",null,null,null,null,{"$f":"AI14","v":""},"Reclaimed Binder Ratio",null,null,null,null,{"$f":"ROUND((F48+F49)/C46,2)","v":{"$error":"#VALUE!"}}]
["% Reclaimed AC from Rec2",null,null,null,null,{"$f":"AI15","v":""},"% Draindown at anticipated temperature",null,null,null,null,null,null,null,{"$f":"'Drain Down'!O17","v":{"$error":"#VALUE!"}}]
[]
["MIX CHARACTERISTICS (Gyratory)"]
["Design       ESALS",null,null,"Mold Diameter (mm)",null,null,"Gyrations @ Nini",null,"Gyrations @ Ndes",null,"Gyrations @ Nmax",null,"%VMA   @ Ndes",null,"Max. Sp. Gr. (Gmm)",null,null,"Ndes Bulk Sp. Gr. (Gmb)"]
[]
[{"$f":"IF(ISBLANK(R3),\"\",R3)","v":0},null,null,{"$f":"Setup!H32","v":0},null,null,{"$f":"IF($A54=\"<.3\",6,IF($A54=\".3 to <3\",7,IF($A54=\"3 to <10\",8,IF($A54=\"10 to <30\",8,IF($A54=\"3 to <30\",8,IF($A54=\">30\",9))))))","v":false},null,{"$f":"IF(A54=\"<.3\",50,IF(AB$5=\".3 to <3\",75,IF(A54=\"3 to <10\",100,IF(A54=\"10 to <30\",100,IF(A54=\"3 to <30\",100,IF(A54=\">30\",125))))))","v":false},null,{"$f":"IF(A54=\"<.3\",75,IF(AD$5=\".3 to <3\",115,IF(A54=\"3 to <10\",160,IF(A54=\"10 to <30\",160,IF(A54=\"3 to <30\",160,IF(A54=\">30\",205))))))","v":false},null,{"$f":"'AC Trials'!K45","v":""},null,{"$f":"'AC Trials'!K42","v":""},null,null,{"$f":"'AC Trials'!K43","v":""}]
["Combine Agg. Gsb",null,null,"Mass of Specimen",null,null,"% Voids                @ Nini",null,"%Voids                 @ Ndes",null,"%Voids   @ Nmax",null,"%VFA   @ Ndes",null,"Max. Density (Lbs./Cu. Ft.)",null,null,"Ndes Bulk Density (Lbs./Cu. Ft.)"]
[]
[{"$f":"'Design Agg'!F37","v":false},null,null,{"$f":"'AC Trials'!AG20","v":{"$error":"#DIV/0!"}},null,null,{"$f":"100-Nmax!T17","v":{"$error":"#VALUE!"}},null,{"$f":"'AC Trials'!K44","v":""},null,{"$f":"100-Nmax!X17","v":{"$error":"#VALUE!"}},null,{"$f":"'AC Trials'!K46","v":""},null,{"$f":"IF(ISBLANK(O54),\"\",O54*62.245)","v":{"$error":"#VALUE!"}},null,null,{"$f":"IF(ISBLANK(R54),\" \",R54*62.245)","v":{"$error":"#VALUE!"}}]
[null,null,null,"Specimen         Height",null,null,"Ht.@Nini",null,"Ht@Ndes",null,"Ht@Nmax"]
[null,null,null,null,null,null,{"$f":"'Height Data'!U18","v":0},null,{"$f":"'Height Data'!U19","v":0},null,{"$f":"'Height Data'!U20","v":0}]
[]
["Ignition Oven Data"]
["Oven Make",null,null,null,"Ignition Oven Identification",null,null,null,null,null,"Set Temp.",null,"Sample Size",null,null,"Asphalt C/F",null,null,"200 C/F"]
[{"$f":"Setup!E33","v":0},null,null,null,{"$f":"Setup!E34","v":0},null,null,null,null,null,{"$f":"Setup!E35","v":0},null,{"$f":"'Correction Factor'!H37","v":1200},null,null,{"$f":"'Correction Factor'!AD15","v":{"$error":"#VALUE!"}},null,null,{"$f":"'Correction Factor'!AI15","v":{"$error":"#VALUE!"}}]
[{"$f":"Setup!F33","v":0},null,null,null,{"$f":"Setup!F34","v":0},null,null,null,null,null,{"$f":"Setup!F35","v":0},null,{"$f":"'Correction Factor'!H66","v":0},null,null,{"$f":"'Correction Factor'!AD44","v":{"$error":"#VALUE!"}},null,null,{"$f":"'Correction Factor'!AI44","v":{"$error":"#VALUE!"}}]
[{"$f":"Setup!G33","v":0},null,null,null,{"$f":"Setup!G34","v":0},null,null,null,null,null,{"$f":"Setup!G35","v":0},null,{"$f":"'Correction Factor'!H95","v":0},null,null,{"$f":"'Correction Factor'!AD73","v":{"$error":"#VALUE!"}},null,null,{"$f":"'Correction Factor'!AI73","v":{"$error":"#VALUE!"}}]
[{"$f":"Setup!H33","v":0},null,null,null,{"$f":"Setup!H34","v":0},null,null,null,null,null,{"$f":"Setup!H35","v":0},null,{"$f":"'Correction Factor'!H124","v":0},null,null,{"$f":"'Correction Factor'!AD102","v":{"$error":"#VALUE!"}},null,null,{"$f":"'Correction Factor'!AI102","v":{"$error":"#VALUE!"}}]
[]
["TSR DATA"]
[null,"AC Supplier",null,null,"Dry PSI Strength",null,null,"Wet PSI Strength",null,null,"TSR Value",null,"Date TSR's were done",null,null,null,"Date of Boil Test"]
[null,{"$f":"Setup!E14","v":0},null,null,{"$f":"'T-283'!G39","v":""},null,null,{"$f":"'T-283'!P39","v":""},null,null,{"$f":"IF(ISBLANK(H70),\" \",(H70/E70)*100)","v":{"$error":"#VALUE!"}},null,{"$f":"'T-283'!E44","v":"00:00:00"}]
[null,{"$f":"'T-283'!J53","v":0},null,null,{"$f":"'T-283'!G84","v":""},null,null,{"$f":"'T-283'!P84","v":""},null,null,{"$f":"IF(ISBLANK(H71),\" \",(H71/E71)*100)","v":{"$error":"#VALUE!"}},null,{"$f":"'T-283'!E89","v":"00:00:00"}]
[null,{"$f":"'T-283'!J98","v":0},null,null,{"$f":"'T-283'!G129","v":""},null,null,{"$f":"'T-283'!P129","v":""},null,null,{"$f":"IF(ISBLANK(H72),\" \",(H72/E72)*100)","v":{"$error":"#VALUE!"}},null,{"$f":"'T-283'!E134","v":"00:00:00"}]
[null,{"$f":"'T-283'!J143","v":0},null,null,{"$f":"'T-283'!G174","v":""},null,null,{"$f":"'T-283'!P174","v":""},null,null,{"$f":"IF(ISBLANK(H73),\" \",(H73/E73)*100)","v":{"$error":"#VALUE!"}},null,{"$f":"'T-283'!E179","v":"00:00:00"}]
[]
["Combined Aggregate Consensus Properties"]
[null,"AASHTO T176 Sand Equivalent",null,"AASHTO T304 Uncompacted Void Content (Fine Aggregate Angularity)",null,null,null,"ASTM D5821 Coarse Aggregate Angularity",null,null,null,null,null,"ASTM D4791 Flat & Elongated",null,null,null,"Total % Reclaimed Agg. From RAP and / or RAS"]
[]
[]
[null,null,null,null,null,null,null,"1-Face Crush",null,null,"2-Face Crush",null,null,"5:1",null,"3:1 SMA only"]
[null,{"$f":"'Design Agg'!L40","v":false},null,{"$f":"'Design Agg'!L41","v":false},null,null,null,{"$f":"'Design Agg'!L38","v":false},null,null,{"$f":"'Design Agg'!L39","v":false},null,null,{"$f":"'Design Agg'!L36","v":false},null,{"$f":"'Design Agg'!L37","v":false},null,{"$f":"SUM(F48:F49)","v":0}]
[]
["GRADATION CHART IS PART OF THIS JOB MIX FORMULA"]
[]
["Designed by:",null,null,null,null,null,null,null,null,null,null,null,"Cert. ID. No.",null,null,null,null,"Date"]
[]
["Submitted by:",null,null,null,null,null,null,null,null,null,null,null,"Cert. ID. No.",null,null,null,null,"Date"]
[]
["Reviewed by:",null,null,null,null,null,null,null,null,null,null,null,"Cert. ID. No.",null,null,null,null,"Date"]

{"sheet":"Sheet1","index":19,"n_rows":25,"n_cols":7,"rows_kept":25,"cut":false,"hidden":true,"merged":[[5,3,5,4],[7,3,7,4],[9,3,9,4],[11,3,11,4],[1,0,2,0],[1,1,2,1],[1,3,1,6],[3,0,4,0],[3,1,4,1],[3,3,3,4]]}
[]
["Sieve Size","JMF %Passing",null,"Asphalt Film Thickness"]
[]
["Max Size Agg",100,null,"Surface Area of Agg.",null,{"$f":"(2*B4+2*B6+4*B7+8*B8+14*B9+30*B10+60*B11+160*B12)/100","v":{"$error":"#VALUE!"}},"Sq.ft/lb"]
[]
[4,{"$f":"ROUND('TR 448A'!J46,0)","v":{"$error":"#VALUE!"}},null,"Total Volume of AC",null,{"$f":"((B16*1000)*(B14/100)/B15)","v":{"$error":"#VALUE!"}},"ml"]
[8,{"$f":"ROUND('TR 448A'!I46,0)","v":{"$error":"#VALUE!"}}]
[16,{"$f":"ROUND('TR 448A'!H46,0)","v":{"$error":"#VALUE!"}},null,"Volume of abs. AC",null,{"$f":"B24/B15","v":{"$error":"#VALUE!"}},"ml"]
[30,{"$f":"ROUND('TR 448A'!G46,0)","v":{"$error":"#VALUE!"}}]
[50,{"$f":"ROUND('TR 448A'!F46,0)","v":{"$error":"#VALUE!"}},null," Vol. of Effective AC",null,{"$f":"F6-F8","v":{"$error":"#VALUE!"}},"ml"]
[100,{"$f":"ROUND('TR 448A'!E46,0)","v":{"$error":"#VALUE!"}}]
[200,{"$f":"'TR 448A'!D46","v":" "},null,"Film Thickness",null,{"$f":"F10/(C23*(B16*1000)*(100-B14)/100)*(1000)","v":{"$error":"#VALUE!"}},"microns"]
[]
["AC",{"$f":"'TR 448A'!C46","v":0}]
["Gb",1.0249999999999999]
["Gmb",{"$f":"'TR 448A'!R54","v":""}]
["Gsb",{"$f":"'TR 448A'!A57","v":false}]
["Gse",{"$f":"F24","v":{"$error":"#VALUE!"}}]
[]
[]
[]
[]
[{"$f":"(B18-B17)","v":{"$error":"#VALUE!"}},{"$f":"(A23/A24)*B15","v":{"$error":"#VALUE!"}},{"$f":"F4/4.8686","v":{"$error":"#VALUE!"}},null,"Max",{"$f":"'TR 448A'!O54","v":""}]
[{"$f":"B17*B18","v":{"$error":"#VALUE!"}},{"$f":"B23*(B16*1000)*(100-B14)/100","v":{"$error":"#VALUE!"}},null,null,"Gse",{"$f":"ROUND((100-B14)/((100/F23)-(B14/1.025)),3)","v":{"$error":"#VALUE!"}}]
[null,null,null,null,"AC",{"$f":"B14","v":0}]

{"sheet":"Blend 1","index":20,"n_rows":46,"n_cols":27,"rows_kept":46,"cut":false,"hidden":false,"merged":[[0,0,0,1],[29,4,29,5],[30,1,31,1],[30,2,31,2],[30,11,30,12],[9,4,9,5],[10,1,11,1],[10,2,11,2],[10,11,10,12],[2,0,2,15],[3,0,3,1],[4,0,4,1],[5,0,5,1],[3,2,3,3],[4,2,4,3],[5,2,5,3],[3,8,3,9],[4,8,4,9],[3,6,3,7],[7,0,7,15],[5,14,5,15],[4,14,4,15],[5,6,5,7],[4,6,4,7],[3,14,3,15],[5,12,5,13],[4,12,4,13],[3,12,3,13],[5,8,5,9]]}
[{"$f":"Setup!A2","v":"ESB-21"}]
[]
["Blend Sheet 1"]
["Producer;",null,{"$f":"Setup!E7","v":0},null,null,null,"Material Class:",null,{"$f":"Setup!E11","v":0},null,null,null,"Nominal Size:",null,{"$f":"Setup!E10","v":0}]
["Designed By:",null,{"$f":"Setup!E9","v":0},null,null,null,"Esals:",null,{"$f":"Setup!E13","v":0},null,null,null,"SRL:",null,{"$f":"Setup!E12","v":0}]
["Date:",null,{"$f":"Setup!E6","v":"00:00:00"},null,null,null,"Rap:",null,{"$f":"Setup!E18","v":0},null,null,null,"PG Grade:",null,{"$f":"Setup!E15","v":0}]
[]
["Blend 1"]
[]
[null,null,null,null,"Gmb Specimen"]
[null,"Individual Weights","Cumulative Weights",null,null,null,null,null,null,null,null,"Total Aggregate Wt"]
["Sieve",null,null,{"$f":"'Agg Blends'!$I$9","v":0},{"$f":"'Agg Blends'!$I$10","v":0},{"$f":"'Agg Blends'!$I$11","v":0},{"$f":"'Agg Blends'!$I$12","v":0},{"$f":"'Agg Blends'!$I$13","v":0},{"$f":"'Agg Blends'!$I$14","v":0},{"$f":"'Agg Blends'!$I$16","v":0},{"$f":"'Agg Blends'!$I$17","v":0},null,null,null,null,null,null,null,null,1,2,3,4,5,6,7,8]
[50,{"$f":"C13-C14","v":0},{"$f":"IF(SUM(D13:K13)=0,0,SUM(D13:K13)+$L$26)","v":0},{"$f":"T13","v":0},0,0,0,0,0,0,0,"Binder %",null,null,null,null,null,null,{"$f":"(C13/$N$11)*100","v":{"$error":"#DIV/0!"}},{"$f":"('Agg Blends'!D21/100)*('Agg Blends'!$L$9/100)*($N$11-$L$26)","v":0},{"$f":"('Agg Blends'!E21/100)*('Agg Blends'!$L$10/100)*($N$11-$L$26)","v":0},{"$f":"('Agg Blends'!F21/100)*('Agg Blends'!$L$11/100)*($N$11-$L$26)","v":0},{"$f":"('Agg Blends'!G21/100)*('Agg Blends'!$L$12/100)*($N$11-$L$26)","v":0},{"$f":"('Agg Blends'!H21/100)*('Agg Blends'!$L$13/100)*($N$11-$L$26)","v":0},{"$f":"('Agg Blends'!I21/100)*('Agg Blends'!$L$14/100)*($N$11-$L$26)","v":0},{"$f":"('Agg Blends'!J21/100)*('Agg Blends'!$L$16/100)*($N$11-$L$26)","v":0},{"$f":"('Agg Blends'!K21/100)*('Agg Blends'!$L$17/100)*($N$11-$L$26)","v":0}]
[37.5,0,0,0,0,0,0,0,0,0,0,"Agg Wt",{"$f":"N11","v":0},{"$f":"N11","v":0},{"$f":"N11","v":0},{"$f":"N11","v":0},null,null,{"$f":"(C14/$N$11)*100","v":{"$error":"#DIV/0!"}},{"$f":"('Agg Blends'!D22/100)*('Agg Blends'!$L$9/100)*($N$11-$L$26)","v":0},{"$f":"('Agg Blends'!E22/100)*('Agg Blends'!$L$10/100)*($N$11-$L$26)","v":0},{"$f":"('Agg Blends'!F22/100)*('Agg Blends'!$L$11/100)*($N$11-$L$26)","v":0},{"$f":"('Agg Blends'!G22/100)*('Agg Blends'!$L$12/100)*($N$11-$L$26)","v":0},{"$f":"('Agg Blends'!H22/100)*('Agg Blends'!$L$13/100)*($N$11-$L$26)","v":0},{"$f":"('Agg Blends'!I22/100)*('Agg Blends'!$L$14/100)*($N$11-$L$26)","v":0},{"$f":"('Agg Blends'!J22/100)*('Agg Blends'!$L$16/100)*($N$11-$L$26)","v":0},{"$f":"('Agg Blends'!K22/100)*('Agg Blends'!$L$17/100)*($N$11-$L$26)","v":0}]
[25,0,0,{"$f":"T15","v":0},0,0,0,0,0,0,0,"Binder Wt",{"$f":"M16-M14","v":0},{"$f":"N16-N14","v":0},{"$f":"O16-O14","v":0},{"$f":"P16-P14","v":0},null,null,{"$f":"(C15/$N$11)*100","v":{"$error":"#DIV/0!"}},{"$f":"('Agg Blends'!D23/100)*('Agg Blends'!$L$9/100)*($N$11-$L$26)","v":0},{"$f":"('Agg Blends'!E23/100)*('Agg Blends'!$L$10/100)*($N$11-$L$26)","v":0},{"$f":"('Agg Blends'!F23/100)*('Agg Blends'!$L$11/100)*($N$11-$L$26)","v":0},{"$f":"('Agg Blends'!G23/100)*('Agg Blends'!$L$12/100)*($N$11-$L$26)","v":0},{"$f":"('Agg Blends'!H23/100)*('Agg Blends'!$L$13/100)*($N$11-$L$26)","v":0},{"$f":"('Agg Blends'!I23/100)*('Agg Blends'!$L$14/100)*($N$11-$L$26)","v":0},{"$f":"('Agg Blends'!J23/100)*('Agg Blends'!$L$16/100)*($N$11-$L$26)","v":0},{"$f":"('Agg Blends'!K23/100)*('Agg Blends'!$L$17/100)*($N$11-$L$26)","v":0}]
[19,0,0,0,0,0,0,0,0,0,0,"Total Wt",{"$f":"(M14/(100-M13))*100","v":0},{"$f":"(N14/(100-N13))*100","v":0},{"$f":"(O14/(100-O13))*100","v":0},{"$f":"(P14/(100-P13))*100","v":0},null,null,{"$error":"#DIV/0!"},{"$f":"('Agg Blends'!D24/100)*('Agg Blends'!$L$9/100)*($N$11-$L$26)","v":0},{"$f":"('Agg Blends'!E24/100)*('Agg Blends'!$L$10/100)*($N$11-$L$26)","v":0},{"$f":"('Agg Blends'!F24/100)*('Agg Blends'!$L$11/100)*($N$11-$L$26)","v":0},{"$f":"('Agg Blends'!G24/100)*('Agg Blends'!$L$12/100)*($N$11-$L$26)","v":0},{"$f":"('Agg Blends'!H24/100)*('Agg Blends'!$L$13/100)*($N$11-$L$26)","v":0},{"$f":"('Agg Blends'!I24/100)*('Agg Blends'!$L$14/100)*($N$11-$L$26)","v":0},{"$f":"('Agg Blends'!J24/100)*('Agg Blends'!$L$16/100)*($N$11-$L$26)","v":0},{"$f":"('Agg Blends'!K24/100)*('Agg Blends'!$L$17/100)*($N$11-$L$26)","v":0}]
[12.5,0,0,0,0,0,0,0,0,0,0,null,null,null,null,null,null,null,{"$error":"#DIV/0!"},{"$f":"('Agg Blends'!D25/100)*('Agg Blends'!$L$9/100)*($N$11-$L$26)","v":0},{"$f":"('Agg Blends'!E25/100)*('Agg Blends'!$L$10/100)*($N$11-$L$26)","v":0},{"$f":"('Agg Blends'!F25/100)*('Agg Blends'!$L$11/100)*($N$11-$L$26)","v":0},{"$f":"('Agg Blends'!G25/100)*('Agg Blends'!$L$12/100)*($N$11-$L$26)","v":0},{"$f":"('Agg Blends'!H25/100)*('Agg Blends'!$L$13/100)*($N$11-$L$26)","v":0},{"$f":"('Agg Blends'!I25/100)*('Agg Blends'!$L$14/100)*($N$11-$L$26)","v":0},{"$f":"('Agg Blends'!J25/100)*('Agg Blends'!$L$16/100)*($N$11-$L$26)","v":0},{"$f":"('Agg Blends'!K25/100)*('Agg Blends'!$L$17/100)*($N$11-$L$26)","v":0}]
[9.5,{"$f":"C18-C19","v":0},0,0,0,0,0,0,0,0,0,null,null,null,null,null,null,null,{"$error":"#DIV/0!"},{"$f":"('Agg Blends'!D26/100)*('Agg Blends'!$L$9/100)*($N$11-$L$26)","v":0},{"$f":"('Agg Blends'!E26/100)*('Agg Blends'!$L$10/100)*($N$11-$L$26)","v":0},{"$f":"('Agg Blends'!F26/100)*('Agg Blends'!$L$11/100)*($N$11-$L$26)","v":0},{"$f":"('Agg Blends'!G26/100)*('Agg Blends'!$L$12/100)*($N$11-$L$26)","v":0},{"$f":"('Agg Blends'!H26/100)*('Agg Blends'!$L$13/100)*($N$11-$L$26)","v":0},{"$f":"('Agg Blends'!I26/100)*('Agg Blends'!$L$14/100)*($N$11-$L$26)","v":0},{"$f":"('Agg Blends'!J26/100)*('Agg Blends'!$L$16/100)*($N$11-$L$26)","v":0},{"$f":"('Agg Blends'!K26/100)*('Agg Blends'!$L$17/100)*($N$11-$L$26)","v":0}]
[6.33,{"$f":"C19-C20","v":0},0,{"$f":"T19","v":0},0,0,0,0,0,0,0,null,null,null,null,null,null,null,{"$error":"#DIV/0!"},{"$f":"('Agg Blends'!D27/100)*('Agg Blends'!$L$9/100)*($N$11-$L$26)","v":0},{"$f":"('Agg Blends'!E27/100)*('Agg Blends'!$L$10/100)*($N$11-$L$26)","v":0},{"$f":"('Agg Blends'!F27/100)*('Agg Blends'!$L$11/100)*($N$11-$L$26)","v":0},{"$f":"('Agg Blends'!G27/100)*('Agg Blends'!$L$12/100)*($N$11-$L$26)","v":0},{"$f":"('Agg Blends'!H27/100)*('Agg Blends'!$L$13/100)*($N$11-$L$26)","v":0},{"$f":"('Agg Blends'!I27/100)*('Agg Blends'!$L$14/100)*($N$11-$L$26)","v":0},{"$f":"('Agg Blends'!J27/100)*('Agg Blends'!$L$16/100)*($N$11-$L$26)","v":0},{"$f":"('Agg Blends'!K27/100)*('Agg Blends'!$L$17/100)*($N$11-$L$26)","v":0}]
[4.75,0,0,0,0,0,0,0,0,0,0,null,null,null,null,null,null,null,{"$f":"(C20/$N$11)*100","v":{"$error":"#DIV/0!"}},{"$f":"('Agg Blends'!D28/100)*('Agg Blends'!$L$9/100)*($N$11-$L$26)","v":0},{"$f":"('Agg Blends'!E28/100)*('Agg Blends'!$L$10/100)*($N$11-$L$26)","v":0},{"$f":"('Agg Blends'!F28/100)*('Agg Blends'!$L$11/100)*($N$11-$L$26)","v":0},{"$f":"('Agg Blends'!G28/100)*('Agg Blends'!$L$12/100)*($N$11-$L$26)","v":0},{"$f":"('Agg Blends'!H28/100)*('Agg Blends'!$L$13/100)*($N$11-$L$26)","v":0},{"$f":"('Agg Blends'!I28/100)*('Agg Blends'!$L$14/100)*($N$11-$L$26)","v":0},{"$f":"('Agg Blends'!J28/100)*('Agg Blends'!$L$16/100)*($N$11-$L$26)","v":0},{"$f":"('Agg Blends'!K28/100)*('Agg Blends'!$L$17/100)*($N$11-$L$26)","v":0}]
[2.36,0,0,0,0,0,0,0,0,0,0,null,null,null,null,null,null,null,{"$error":"#DIV/0!"},{"$f":"('Agg Blends'!D29/100)*('Agg Blends'!$L$9/100)*($N$11-$L$26)","v":0},{"$f":"('Agg Blends'!E29/100)*('Agg Blends'!$L$10/100)*($N$11-$L$26)","v":0},{"$f":"('Agg Blends'!F29/100)*('Agg Blends'!$L$11/100)*($N$11-$L$26)","v":0},{"$f":"('Agg Blends'!G29/100)*('Agg Blends'!$L$12/100)*($N$11-$L$26)","v":0},{"$f":"('Agg Blends'!H29/100)*('Agg Blends'!$L$13/100)*($N$11-$L$26)","v":0},{"$f":"('Agg Blends'!I29/100)*('Agg Blends'!$L$14/100)*($N$11-$L$26)","v":0},{"$f":"('Agg Blends'!J29/100)*('Agg Blends'!$L$16/100)*($N$11-$L$26)","v":0},{"$f":"('Agg Blends'!K29/100)*('Agg Blends'!$L$17/100)*($N$11-$L$26)","v":0}]
[1.18,0,0,0,0,0,0,0,0,0,0,null,null,null,null,null,null,null,{"$error":"#DIV/0!"},{"$f":"('Agg Blends'!D30/100)*('Agg Blends'!$L$9/100)*($N$11-$L$26)","v":0},{"$f":"('Agg Blends'!E30/100)*('Agg Blends'!$L$10/100)*($N$11-$L$26)","v":0},{"$f":"('Agg Blends'!F30/100)*('Agg Blends'!$L$11/100)*($N$11-$L$26)","v":0},{"$f":"('Agg Blends'!G30/100)*('Agg Blends'!$L$12/100)*($N$11-$L$26)","v":0},{"$f":"('Agg Blends'!H30/100)*('Agg Blends'!$L$13/100)*($N$11-$L$26)","v":0},{"$f":"('Agg Blends'!I30/100)*('Agg Blends'!$L$14/100)*($N$11-$L$26)","v":0},{"$f":"('Agg Blends'!J30/100)*('Agg Blends'!$L$16/100)*($N$11-$L$26)","v":0},{"$f":"('Agg Blends'!K30/100)*('Agg Blends'!$L$17/100)*($N$11-$L$26)","v":0}]
[0.6,0,0,0,0,0,0,0,0,0,0,null,null,null,null,null,null,null,{"$error":"#DIV/0!"},{"$f":"('Agg Blends'!D31/100)*('Agg Blends'!$L$9/100)*($N$11-$L$26)","v":0},{"$f":"('Agg Blends'!E31/100)*('Agg Blends'!$L$10/100)*($N$11-$L$26)","v":0},{"$f":"('Agg Blends'!F31/100)*('Agg Blends'!$L$11/100)*($N$11-$L$26)","v":0},{"$f":"('Agg Blends'!G31/100)*('Agg Blends'!$L$12/100)*($N$11-$L$26)","v":0},{"$f":"('Agg Blends'!H31/100)*('Agg Blends'!$L$13/100)*($N$11-$L$26)","v":0},{"$f":"('Agg Blends'!I31/100)*('Agg Blends'!$L$14/100)*($N$11-$L$26)","v":0},{"$f":"('Agg Blends'!J31/100)*('Agg Blends'!$L$16/100)*($N$11-$L$26)","v":0},{"$f":"('Agg Blends'!K31/100)*('Agg Blends'!$L$17/100)*($N$11-$L$26)","v":0}]
[0.3,0,0,0,0,0,0,0,0,0,0,null,null,null,null,null,null,null,{"$error":"#DIV/0!"},{"$f":"('Agg Blends'!D32/100)*('Agg Blends'!$L$9/100)*($N$11-$L$26)","v":0},{"$f":"('Agg Blends'!E32/100)*('Agg Blends'!$L$10/100)*($N$11-$L$26)","v":0},{"$f":"('Agg Blends'!F32/100)*('Agg Blends'!$L$11/100)*($N$11-$L$26)","v":0},{"$f":"('Agg Blends'!G32/100)*('Agg Blends'!$L$12/100)*($N$11-$L$26)","v":0},{"$f":"('Agg Blends'!H32/100)*('Agg Blends'!$L$13/100)*($N$11-$L$26)","v":0},{"$f":"('Agg Blends'!I32/100)*('Agg Blends'!$L$14/100)*($N$11-$L$26)","v":0},{"$f":"('Agg Blends'!J32/100)*('Agg Blends'!$L$16/100)*($N$11-$L$26)","v":0},{"$f":"('Agg Blends'!K32/100)*('Agg Blends'!$L$17/100)*($N$11-$L$26)","v":0}]
[0.15,{"$f":"C25-C26","v":0},0,0,0,0,0,0,0,0,0,"Baghouse #200",null,null,null,null,null,null,{"$error":"#DIV/0!"},{"$f":"('Agg Blends'!D33/100)*('Agg Blends'!$L$9/100)*($N$11-$L$26)","v":0},{"$f":"('Agg Blends'!E33/100)*('Agg Blends'!$L$10/100)*($N$11-$L$26)","v":0},{"$f":"('Agg Blends'!F33/100)*('Agg Blends'!$L$11/100)*($N$11-$L$26)","v":0},{"$f":"('Agg Blends'!G33/100)*('Agg Blends'!$L$12/100)*($N$11-$L$26)","v":0},{"$f":"('Agg Blends'!H33/100)*('Agg Blends'!$L$13/100)*($N$11-$L$26)","v":0},{"$f":"('Agg Blends'!I33/100)*('Agg Blends'!$L$14/100)*($N$11-$L$26)","v":0},{"$f":"('Agg Blends'!J33/100)*('Agg Blends'!$L$16/100)*($N$11-$L$26)","v":0},{"$f":"('Agg Blends'!K33/100)*('Agg Blends'!$L$17/100)*($N$11-$L$26)","v":0}]
[7.4999999999999997E-2,{"$f":"C26","v":0},0,0,0,0,0,0,0,0,0,{"$f":"('Agg Blends'!L35/100)*($N$11)","v":0},null,null,null,null,null,null,{"$f":"(C26/$N$11)*100","v":{"$error":"#DIV/0!"}},{"$f":"('Agg Blends'!D34/100)*('Agg Blends'!$L$9/100)*($N$11-$L$26)","v":0},{"$f":"('Agg Blends'!E34/100)*('Agg Blends'!$L$10/100)*($N$11-$L$26)","v":0},{"$f":"('Agg Blends'!F34/100)*('Agg Blends'!$L$11/100)*($N$11-$L$26)","v":0},{"$f":"('Agg Blends'!G34/100)*('Agg Blends'!$L$12/100)*($N$11-$L$26)","v":0},{"$f":"('Agg Blends'!H34/100)*('Agg Blends'!$L$13/100)*($N$11-$L$26)","v":0},{"$f":"('Agg Blends'!I34/100)*('Agg Blends'!$L$14/100)*($N$11-$L$26)","v":0},{"$f":"('Agg Blends'!J34/100)*('Agg Blends'!$L$16/100)*($N$11-$L$26)","v":0},{"$f":"('Agg Blends'!K34/100)*('Agg Blends'!$L$17/100)*($N$11-$L$26)","v":0}]
[]
[]
[]
[null,null,null,null,"Gmm Specimen"]
[null,"Individual Weights","Cumulative Weights",null,null,null,null,null,null,null,null,"Total Aggregate Wt"]
["Sieve",null,null,{"$f":"'Agg Blends'!$I$9","v":0},{"$f":"'Agg Blends'!$I$10","v":0},{"$f":"'Agg Blends'!$I$11","v":0},{"$f":"'Agg Blends'!$I$12","v":0},{"$f":"'Agg Blends'!$I$13","v":0},{"$f":"'Agg Blends'!$I$14","v":0},{"$f":"'Agg Blends'!$I$16","v":0},{"$f":"'Agg Blends'!$I$17","v":0},null,null,null,null,null,null,null,null,1,2,3,4,5,6,7,8]
[50,{"$f":"C33-C34","v":0},{"$f":"IF(SUM(D33:K33)=0,0,SUM(D33:K33)+$L$46)","v":0},{"$f":"T33","v":0},0,0,0,0,0,0,0,"Binder %",null,null,null,null,null,null,{"$f":"(C33/$N$31)*100","v":{"$error":"#DIV/0!"}},{"$f":"('Agg Blends'!D21/100)*('Agg Blends'!$L$9/100)*($N$31-$L$46)","v":0},{"$f":"('Agg Blends'!E21/100)*('Agg Blends'!$L$10/100)*($N$31-$L$46)","v":0},{"$f":"('Agg Blends'!F21/100)*('Agg Blends'!$L$11/100)*($N$31-$L$46)","v":0},{"$f":"('Agg Blends'!G21/100)*('Agg Blends'!$L$12/100)*($N$31-$L$46)","v":0},{"$f":"('Agg Blends'!H21/100)*('Agg Blends'!$L$13/100)*($N$31-$L$46)","v":0},{"$f":"('Agg Blends'!I21/100)*('Agg Blends'!$L$14/100)*($N$31-$L$46)","v":0},{"$f":"('Agg Blends'!J21/100)*('Agg Blends'!$L$16/100)*($N$31-$L$46)","v":0},{"$f":"('Agg Blends'!K21/100)*('Agg Blends'!$L$17/100)*($N$31-$L$46)","v":0}]
[37.5,0,0,0,0,0,0,0,0,0,0,"Agg Wt",{"$f":"N31","v":0},{"$f":"N31","v":0},{"$f":"N31","v":0},{"$f":"N31","v":0},null,null,{"$f":"(C34/$N$31)*100","v":{"$error":"#DIV/0!"}},{"$f":"('Agg Blends'!D22/100)*('Agg Blends'!$L$9/100)*($N$31-$L$46)","v":0},{"$f":"('Agg Blends'!E22/100)*('Agg Blends'!$L$10/100)*($N$31-$L$46)","v":0},{"$f":"('Agg Blends'!F22/100)*('Agg Blends'!$L$11/100)*($N$31-$L$46)","v":0},{"$f":"('Agg Blends'!G22/100)*('Agg Blends'!$L$12/100)*($N$31-$L$46)","v":0},{"$f":"('Agg Blends'!H22/100)*('Agg Blends'!$L$13/100)*($N$31-$L$46)","v":0},{"$f":"('Agg Blends'!I22/100)*('Agg Blends'!$L$14/100)*($N$31-$L$46)","v":0},{"$f":"('Agg Blends'!J22/100)*('Agg Blends'!$L$16/100)*($N$31-$L$46)","v":0},{"$f":"('Agg Blends'!K22/100)*('Agg Blends'!$L$17/100)*($N$31-$L$46)","v":0}]
[25,0,0,0,0,0,0,0,0,0,0,"Binder Wt",{"$f":"M36-M34","v":0},{"$f":"N36-N34","v":0},{"$f":"O36-O34","v":0},{"$f":"P36-P34","v":0},null,null,{"$error":"#DIV/0!"},{"$f":"('Agg Blends'!D23/100)*('Agg Blends'!$L$9/100)*($N$31-$L$46)","v":0},{"$f":"('Agg Blends'!E23/100)*('Agg Blends'!$L$10/100)*($N$31-$L$46)","v":0},{"$f":"('Agg Blends'!F23/100)*('Agg Blends'!$L$11/100)*($N$31-$L$46)","v":0},{"$f":"('Agg Blends'!G23/100)*('Agg Blends'!$L$12/100)*($N$31-$L$46)","v":0},{"$f":"('Agg Blends'!H23/100)*('Agg Blends'!$L$13/100)*($N$31-$L$46)","v":0},{"$f":"('Agg Blends'!I23/100)*('Agg Blends'!$L$14/100)*($N$31-$L$46)","v":0},{"$f":"('Agg Blends'!J23/100)*('Agg Blends'!$L$16/100)*($N$31-$L$46)","v":0},{"$f":"('Agg Blends'!K23/100)*('Agg Blends'!$L$17/100)*($N$31-$L$46)","v":0}]
[19,0,0,0,0,0,0,0,0,0,0,"Total Wt",{"$f":"(M34/(100-M33))*100","v":0},{"$f":"(N34/(100-N33))*100","v":0},{"$f":"(O34/(100-O33))*100","v":0},{"$f":"(P34/(100-P33))*100","v":0},null,null,{"$error":"#DIV/0!"},{"$f":"('Agg Blends'!D24/100)*('Agg Blends'!$L$9/100)*($N$31-$L$46)","v":0},{"$f":"('Agg Blends'!E24/100)*('Agg Blends'!$L$10/100)*($N$31-$L$46)","v":0},{"$f":"('Agg Blends'!F24/100)*('Agg Blends'!$L$11/100)*($N$31-$L$46)","v":0},{"$f":"('Agg Blends'!G24/100)*('Agg Blends'!$L$12/100)*($N$31-$L$46)","v":0},{"$f":"('Agg Blends'!H24/100)*('Agg Blends'!$L$13/100)*($N$31-$L$46)","v":0},{"$f":"('Agg Blends'!I24/100)*('Agg Blends'!$L$14/100)*($N$31-$L$46)","v":0},{"$f":"('Agg Blends'!J24/100)*('Agg Blends'!$L$16/100)*($N$31-$L$46)","v":0},{"$f":"('Agg Blends'!K24/100)*('Agg Blends'!$L$17/100)*($N$31-$L$46)","v":0}]
[12.5,0,0,0,0,0,0,0,0,0,0,null,null,null,null,null,null,null,{"$error":"#DIV/0!"},{"$f":"('Agg Blends'!D25/100)*('Agg Blends'!$L$9/100)*($N$31-$L$46)","v":0},{"$f":"('Agg Blends'!E25/100)*('Agg Blends'!$L$10/100)*($N$31-$L$46)","v":0},{"$f":"('Agg Blends'!F25/100)*('Agg Blends'!$L$11/100)*($N$31-$L$46)","v":0},{"$f":"('Agg Blends'!G25/100)*('Agg Blends'!$L$12/100)*($N$31-$L$46)","v":0},{"$f":"('Agg Blends'!H25/100)*('Agg Blends'!$L$13/100)*($N$31-$L$46)","v":0},{"$f":"('Agg Blends'!I25/100)*('Agg Blends'!$L$14/100)*($N$31-$L$46)","v":0},{"$f":"('Agg Blends'!J25/100)*('Agg Blends'!$L$16/100)*($N$31-$L$46)","v":0},{"$f":"('Agg Blends'!K25/100)*('Agg Blends'!$L$17/100)*($N$31-$L$46)","v":0}]
[9.5,{"$f":"C38-C39","v":0},0,0,0,0,0,0,0,0,0,null,null,null,null,null,null,null,{"$f":"(C38/$N$31)*100","v":{"$error":"#DIV/0!"}},{"$f":"('Agg Blends'!D26/100)*('Agg Blends'!$L$9/100)*($N$31-$L$46)","v":0},{"$f":"('Agg Blends'!E26/100)*('Agg Blends'!$L$10/100)*($N$31-$L$46)","v":0},{"$f":"('Agg Blends'!F26/100)*('Agg Blends'!$L$11/100)*($N$31-$L$46)","v":0},{"$f":"('Agg Blends'!G26/100)*('Agg Blends'!$L$12/100)*($N$31-$L$46)","v":0},{"$f":"('Agg Blends'!H26/100)*('Agg Blends'!$L$13/100)*($N$31-$L$46)","v":0},{"$f":"('Agg Blends'!I26/100)*('Agg Blends'!$L$14/100)*($N$31-$L$46)","v":0},{"$f":"('Agg Blends'!J26/100)*('Agg Blends'!$L$16/100)*($N$31-$L$46)","v":0},{"$f":"('Agg Blends'!K26/100)*('Agg Blends'!$L$17/100)*($N$31-$L$46)","v":0}]
[6.33,0,0,{"$f":"T39","v":0},0,0,0,0,0,0,0,null,null,null,null,null,null,null,{"$f":"(C39/$N$31)*100","v":{"$error":"#DIV/0!"}},{"$f":"('Agg Blends'!D27/100)*('Agg Blends'!$L$9/100)*($N$31-$L$46)","v":0},{"$f":"('Agg Blends'!E27/100)*('Agg Blends'!$L$10/100)*($N$31-$L$46)","v":0},{"$f":"('Agg Blends'!F27/100)*('Agg Blends'!$L$11/100)*($N$31-$L$46)","v":0},{"$f":"('Agg Blends'!G27/100)*('Agg Blends'!$L$12/100)*($N$31-$L$46)","v":0},{"$f":"('Agg Blends'!H27/100)*('Agg Blends'!$L$13/100)*($N$31-$L$46)","v":0},{"$f":"('Agg Blends'!I27/100)*('Agg Blends'!$L$14/100)*($N$31-$L$46)","v":0},{"$f":"('Agg Blends'!J27/100)*('Agg Blends'!$L$16/100)*($N$31-$L$46)","v":0},{"$f":"('Agg Blends'!K27/100)*('Agg Blends'!$L$17/100)*($N$31-$L$46)","v":0}]
[4.75,0,0,0,0,0,0,0,0,0,0,null,null,null,null,null,null,null,{"$error":"#DIV/0!"},{"$f":"('Agg Blends'!D28/100)*('Agg Blends'!$L$9/100)*($N$31-$L$46)","v":0},{"$f":"('Agg Blends'!E28/100)*('Agg Blends'!$L$10/100)*($N$31-$L$46)","v":0},{"$f":"('Agg Blends'!F28/100)*('Agg Blends'!$L$11/100)*($N$31-$L$46)","v":0},{"$f":"('Agg Blends'!G28/100)*('Agg Blends'!$L$12/100)*($N$31-$L$46)","v":0},{"$f":"('Agg Blends'!H28/100)*('Agg Blends'!$L$13/100)*($N$31-$L$46)","v":0},{"$f":"('Agg Blends'!I28/100)*('Agg Blends'!$L$14/100)*($N$31-$L$46)","v":0},{"$f":"('Agg Blends'!J28/100)*('Agg Blends'!$L$16/100)*($N$31-$L$46)","v":0},{"$f":"('Agg Blends'!K28/100)*('Agg Blends'!$L$17/100)*($N$31-$L$46)","v":0}]
[2.36,0,0,0,0,0,0,0,0,0,0,null,null,null,null,null,null,null,{"$error":"#DIV/0!"},{"$f":"('Agg Blends'!D29/100)*('Agg Blends'!$L$9/100)*($N$31-$L$46)","v":0},{"$f":"('Agg Blends'!E29/100)*('Agg Blends'!$L$10/100)*($N$31-$L$46)","v":0},{"$f":"('Agg Blends'!F29/100)*('Agg Blends'!$L$11/100)*($N$31-$L$46)","v":0},{"$f":"('Agg Blends'!G29/100)*('Agg Blends'!$L$12/100)*($N$31-$L$46)","v":0},{"$f":"('Agg Blends'!H29/100)*('Agg Blends'!$L$13/100)*($N$31-$L$46)","v":0},{"$f":"('Agg Blends'!I29/100)*('Agg Blends'!$L$14/100)*($N$31-$L$46)","v":0},{"$f":"('Agg Blends'!J29/100)*('Agg Blends'!$L$16/100)*($N$31-$L$46)","v":0},{"$f":"('Agg Blends'!K29/100)*('Agg Blends'!$L$17/100)*($N$31-$L$46)","v":0}]
[1.18,0,0,0,0,0,0,0,0,0,0,null,null,null,null,null,null,null,{"$error":"#DIV/0!"},{"$f":"('Agg Blends'!D30/100)*('Agg Blends'!$L$9/100)*($N$31-$L$46)","v":0},{"$f":"('Agg Blends'!E30/100)*('Agg Blends'!$L$10/100)*($N$31-$L$46)","v":0},{"$f":"('Agg Blends'!F30/100)*('Agg Blends'!$L$11/100)*($N$31-$L$46)","v":0},{"$f":"('Agg Blends'!G30/100)*('Agg Blends'!$L$12/100)*($N$31-$L$46)","v":0},{"$f":"('Agg Blends'!H30/100)*('Agg Blends'!$L$13/100)*($N$31-$L$46)","v":0},{"$f":"('Agg Blends'!I30/100)*('Agg Blends'!$L$14/100)*($N$31-$L$46)","v":0},{"$f":"('Agg Blends'!J30/100)*('Agg Blends'!$L$16/100)*($N$31-$L$46)","v":0},{"$f":"('Agg Blends'!K30/100)*('Agg Blends'!$L$17/100)*($N$31-$L$46)","v":0}]
[0.6,0,0,0,0,0,0,0,0,0,0,null,null,null,null,null,null,null,{"$error":"#DIV/0!"},{"$f":"('Agg Blends'!D31/100)*('Agg Blends'!$L$9/100)*($N$31-$L$46)","v":0},{"$f":"('Agg Blends'!E31/100)*('Agg Blends'!$L$10/100)*($N$31-$L$46)","v":0},{"$f":"('Agg Blends'!F31/100)*('Agg Blends'!$L$11/100)*($N$31-$L$46)","v":0},{"$f":"('Agg Blends'!G31/100)*('Agg Blends'!$L$12/100)*($N$31-$L$46)","v":0},{"$f":"('Agg Blends'!H31/100)*('Agg Blends'!$L$13/100)*($N$31-$L$46)","v":0},{"$f":"('Agg Blends'!I31/100)*('Agg Blends'!$L$14/100)*($N$31-$L$46)","v":0},{"$f":"('Agg Blends'!J31/100)*('Agg Blends'!$L$16/100)*($N$31-$L$46)","v":0},{"$f":"('Agg Blends'!K31/100)*('Agg Blends'!$L$17/100)*($N$31-$L$46)","v":0}]
[0.3,0,0,0,0,0,0,0,0,0,0,null,null,null,null,null,null,null,{"$error":"#DIV/0!"},{"$f":"('Agg Blends'!D32/100)*('Agg Blends'!$L$9/100)*($N$31-$L$46)","v":0},{"$f":"('Agg Blends'!E32/100)*('Agg Blends'!$L$10/100)*($N$31-$L$46)","v":0},{"$f":"('Agg Blends'!F32/100)*('Agg Blends'!$L$11/100)*($N$31-$L$46)","v":0},{"$f":"('Agg Blends'!G32/100)*('Agg Blends'!$L$12/100)*($N$31-$L$46)","v":0},{"$f":"('Agg Blends'!H32/100)*('Agg Blends'!$L$13/100)*($N$31-$L$46)","v":0},{"$f":"('Agg Blends'!I32/100)*('Agg Blends'!$L$14/100)*($N$31-$L$46)","v":0},{"$f":"('Agg Blends'!J32/100)*('Agg Blends'!$L$16/100)*($N$31-$L$46)","v":0},{"$f":"('Agg Blends'!K32/100)*('Agg Blends'!$L$17/100)*($N$31-$L$46)","v":0}]
[0.15,{"$f":"C45-C46","v":0},0,0,0,0,0,0,0,0,0,"Baghouse #200",null,null,null,null,null,null,{"$error":"#DIV/0!"},{"$f":"('Agg Blends'!D33/100)*('Agg Blends'!$L$9/100)*($N$31-$L$46)","v":0},{"$f":"('Agg Blends'!E33/100)*('Agg Blends'!$L$10/100)*($N$31-$L$46)","v":0},{"$f":"('Agg Blends'!F33/100)*('Agg Blends'!$L$11/100)*($N$31-$L$46)","v":0},{"$f":"('Agg Blends'!G33/100)*('Agg Blends'!$L$12/100)*($N$31-$L$46)","v":0},{"$f":"('Agg Blends'!H33/100)*('Agg Blends'!$L$13/100)*($N$31-$L$46)","v":0},{"$f":"('Agg Blends'!I33/100)*('Agg Blends'!$L$14/100)*($N$31-$L$46)","v":0},{"$f":"('Agg Blends'!J33/100)*('Agg Blends'!$L$16/100)*($N$31-$L$46)","v":0},{"$f":"('Agg Blends'!K33/100)*('Agg Blends'!$L$17/100)*($N$31-$L$46)","v":0}]
[7.4999999999999997E-2,{"$f":"C46","v":0},0,0,0,0,0,0,0,0,0,{"$f":"('Agg Blends'!L35/100)*($N$31)","v":0},null,null,null,null,null,null,{"$error":"#DIV/0!"},{"$f":"('Agg Blends'!D34/100)*('Agg Blends'!$L$9/100)*($N$31-$L$46)","v":0},{"$f":"('Agg Blends'!E34/100)*('Agg Blends'!$L$10/100)*($N$31-$L$46)","v":0},{"$f":"('Agg Blends'!F34/100)*('Agg Blends'!$L$11/100)*($N$31-$L$46)","v":0},{"$f":"('Agg Blends'!G34/100)*('Agg Blends'!$L$12/100)*($N$31-$L$46)","v":0},{"$f":"('Agg Blends'!H34/100)*('Agg Blends'!$L$13/100)*($N$31-$L$46)","v":0},{"$f":"('Agg Blends'!I34/100)*('Agg Blends'!$L$14/100)*($N$31-$L$46)","v":0},{"$f":"('Agg Blends'!J34/100)*('Agg Blends'!$L$16/100)*($N$31-$L$46)","v":0},{"$f":"('Agg Blends'!K34/100)*('Agg Blends'!$L$17/100)*($N$31-$L$46)","v":0}]

{"sheet":"Blend 2","index":21,"n_rows":46,"n_cols":27,"rows_kept":46,"cut":false,"hidden":false,"merged":[[10,11,10,12],[30,11,30,12],[4,12,4,13],[4,14,4,15],[5,12,5,13],[5,14,5,15],[7,0,7,15],[29,4,29,5],[30,1,31,1],[30,2,31,2],[9,4,9,5],[10,1,11,1],[10,2,11,2],[4,0,4,1],[4,2,4,3],[4,6,4,7],[0,0,0,1],[3,0,3,1],[3,2,3,3],[3,6,3,7],[3,8,3,9],[2,0,2,15],[3,12,3,13],[3,14,3,15],[4,8,4,9],[5,0,5,1],[5,2,5,3],[5,6,5,7],[5,8,5,9]]}
[{"$f":"Setup!A2","v":"ESB-21"}]
[]
["Blend Sheet 2"]
["Producer;",null,{"$f":"Setup!E7","v":0},null,null,null,"Material Class:",null,{"$f":"Setup!E11","v":0},null,null,null,"Nominal Size:",null,{"$f":"Setup!E10","v":0}]
["Designed By:",null,{"$f":"Setup!E9","v":0},null,null,null,"Esals:",null,{"$f":"Setup!E13","v":0},null,null,null,"SRL:",null,{"$f":"Setup!E12","v":0}]
["Date:",null,{"$f":"Setup!E6","v":"00:00:00"},null,null,null,"Rap:",null,{"$f":"Setup!E18","v":0},null,null,null,"PG Grade:",null,{"$f":"Setup!E15","v":0}]
[]
["Blend 2"]
[]
[null,null,null,null,"Gmb Specimen"]
[null,"Individual Weights","Cumulative Weights",null,null,null,null,null,null,null,null,"Total Aggregate Wt"]
["Sieve",null,null,{"$f":"'Agg Blends'!$I$9","v":0},{"$f":"'Agg Blends'!$I$10","v":0},{"$f":"'Agg Blends'!$I$11","v":0},{"$f":"'Agg Blends'!$I$12","v":0},{"$f":"'Agg Blends'!$I$13","v":0},{"$f":"'Agg Blends'!$I$14","v":0},{"$f":"'Agg Blends'!$I$16","v":0},{"$f":"'Agg Blends'!$I$17","v":0},null,null,null,null,null,null,null,null,1,2,3,4,5,6,7,8]
[50,{"$f":"C13-C14","v":0},{"$f":"IF(SUM(D13:K13)=0,0,SUM(D13:K13)+$L$26)","v":0},{"$f":"T13","v":0},0,0,0,0,0,0,0,"Binder %",null,null,null,null,null,null,{"$f":"(C13/$N$11)*100","v":{"$error":"#DIV/0!"}},{"$f":"('Agg Blends'!D21/100)*('Agg Blends'!$M$9/100)*($N$11-$M$26)","v":0},{"$f":"('Agg Blends'!E21/100)*('Agg Blends'!$M$10/100)*($N$11-$M$26)","v":0},{"$f":"('Agg Blends'!F21/100)*('Agg Blends'!$M$11/100)*($N$11-$M$26)","v":0},{"$f":"('Agg Blends'!G21/100)*('Agg Blends'!$M$12/100)*($N$11-$M$26)","v":0},{"$f":"('Agg Blends'!H21/100)*('Agg Blends'!$M$13/100)*($N$11-$M$26)","v":0},{"$f":"('Agg Blends'!I21/100)*('Agg Blends'!$M$14/100)*($N$11-$M$26)","v":0},{"$f":"('Agg Blends'!J21/100)*('Agg Blends'!$M$16/100)*($N$11-$M$26)","v":0},{"$f":"('Agg Blends'!K21/100)*('Agg Blends'!$M$17/100)*($N$11-$M$26)","v":0}]
[37.5,0,{"$f":"IF(SUM(D14:K14)=0,0,SUM(D14:K14)+$L$26)","v":0},0,0,0,0,0,0,0,0,"Agg Wt",{"$f":"N11","v":0},{"$f":"N11","v":0},{"$f":"N11","v":0},{"$f":"N11","v":0},null,null,{"$f":"(C14/$N$11)*100","v":{"$error":"#DIV/0!"}},{"$f":"('Agg Blends'!D22/100)*('Agg Blends'!$M$9/100)*($N$11-$M$26)","v":0},{"$f":"('Agg Blends'!E22/100)*('Agg Blends'!$M$10/100)*($N$11-$M$26)","v":0},{"$f":"('Agg Blends'!F22/100)*('Agg Blends'!$M$11/100)*($N$11-$M$26)","v":0},{"$f":"('Agg Blends'!G22/100)*('Agg Blends'!$M$12/100)*($N$11-$M$26)","v":0},{"$f":"('Agg Blends'!H22/100)*('Agg Blends'!$M$13/100)*($N$11-$M$26)","v":0},{"$f":"('Agg Blends'!I22/100)*('Agg Blends'!$M$14/100)*($N$11-$M$26)","v":0},{"$f":"('Agg Blends'!J22/100)*('Agg Blends'!$M$16/100)*($N$11-$M$26)","v":0},{"$f":"('Agg Blends'!K22/100)*('Agg Blends'!$M$17/100)*($N$11-$M$26)","v":0}]
[25,0,0,{"$f":"T15","v":0},0,0,0,0,0,0,0,"Binder Wt",{"$f":"M16-M14","v":0},{"$f":"N16-N14","v":0},{"$f":"O16-O14","v":0},{"$f":"P16-P14","v":0},null,null,{"$f":"(C15/$N$11)*100","v":{"$error":"#DIV/0!"}},{"$f":"('Agg Blends'!D23/100)*('Agg Blends'!$M$9/100)*($N$11-$M$26)","v":0},{"$f":"('Agg Blends'!E23/100)*('Agg Blends'!$M$10/100)*($N$11-$M$26)","v":0},{"$f":"('Agg Blends'!F23/100)*('Agg Blends'!$M$11/100)*($N$11-$M$26)","v":0},{"$f":"('Agg Blends'!G23/100)*('Agg Blends'!$M$12/100)*($N$11-$M$26)","v":0},{"$f":"('Agg Blends'!H23/100)*('Agg Blends'!$M$13/100)*($N$11-$M$26)","v":0},{"$f":"('Agg Blends'!I23/100)*('Agg Blends'!$M$14/100)*($N$11-$M$26)","v":0},{"$f":"('Agg Blends'!J23/100)*('Agg Blends'!$M$16/100)*($N$11-$M$26)","v":0},{"$f":"('Agg Blends'!K23/100)*('Agg Blends'!$M$17/100)*($N$11-$M$26)","v":0}]
[19,0,0,0,0,0,0,0,0,0,0,"Total Wt",{"$f":"(M14/(100-M13))*100","v":0},{"$f":"(N14/(100-N13))*100","v":0},{"$f":"(O14/(100-O13))*100","v":0},{"$f":"(P14/(100-P13))*100","v":0},null,null,{"$error":"#DIV/0!"},{"$f":"('Agg Blends'!D24/100)*('Agg Blends'!$M$9/100)*($N$11-$M$26)","v":0},{"$f":"('Agg Blends'!E24/100)*('Agg Blends'!$M$10/100)*($N$11-$M$26)","v":0},{"$f":"('Agg Blends'!F24/100)*('Agg Blends'!$M$11/100)*($N$11-$M$26)","v":0},{"$f":"('Agg Blends'!G24/100)*('Agg Blends'!$M$12/100)*($N$11-$M$26)","v":0},{"$f":"('Agg Blends'!H24/100)*('Agg Blends'!$M$13/100)*($N$11-$M$26)","v":0},{"$f":"('Agg Blends'!I24/100)*('Agg Blends'!$M$14/100)*($N$11-$M$26)","v":0},{"$f":"('Agg Blends'!J24/100)*('Agg Blends'!$M$16/100)*($N$11-$M$26)","v":0},{"$f":"('Agg Blends'!K24/100)*('Agg Blends'!$M$17/100)*($N$11-$M$26)","v":0}]
[12.5,0,0,0,0,0,0,0,0,0,0,null,null,null,null,null,null,null,{"$error":"#DIV/0!"},{"$f":"('Agg Blends'!D25/100)*('Agg Blends'!$M$9/100)*($N$11-$M$26)","v":0},{"$f":"('Agg Blends'!E25/100)*('Agg Blends'!$M$10/100)*($N$11-$M$26)","v":0},{"$f":"('Agg Blends'!F25/100)*('Agg Blends'!$M$11/100)*($N$11-$M$26)","v":0},{"$f":"('Agg Blends'!G25/100)*('Agg Blends'!$M$12/100)*($N$11-$M$26)","v":0},{"$f":"('Agg Blends'!H25/100)*('Agg Blends'!$M$13/100)*($N$11-$M$26)","v":0},{"$f":"('Agg Blends'!I25/100)*('Agg Blends'!$M$14/100)*($N$11-$M$26)","v":0},{"$f":"('Agg Blends'!J25/100)*('Agg Blends'!$M$16/100)*($N$11-$M$26)","v":0},{"$f":"('Agg Blends'!K25/100)*('Agg Blends'!$M$17/100)*($N$11-$M$26)","v":0}]
[9.5,{"$f":"C18-C19","v":0},0,0,0,0,0,0,0,0,0,null,null,null,null,null,null,null,{"$error":"#DIV/0!"},{"$f":"('Agg Blends'!D26/100)*('Agg Blends'!$M$9/100)*($N$11-$M$26)","v":0},{"$f":"('Agg Blends'!E26/100)*('Agg Blends'!$M$10/100)*($N$11-$M$26)","v":0},{"$f":"('Agg Blends'!F26/100)*('Agg Blends'!$M$11/100)*($N$11-$M$26)","v":0},{"$f":"('Agg Blends'!G26/100)*('Agg Blends'!$M$12/100)*($N$11-$M$26)","v":0},{"$f":"('Agg Blends'!H26/100)*('Agg Blends'!$M$13/100)*($N$11-$M$26)","v":0},{"$f":"('Agg Blends'!I26/100)*('Agg Blends'!$M$14/100)*($N$11-$M$26)","v":0},{"$f":"('Agg Blends'!J26/100)*('Agg Blends'!$M$16/100)*($N$11-$M$26)","v":0},{"$f":"('Agg Blends'!K26/100)*('Agg Blends'!$M$17/100)*($N$11-$M$26)","v":0}]
[6.33,{"$f":"C19-C20","v":0},0,0,0,0,0,0,0,0,0,null,null,null,null,null,null,null,{"$error":"#DIV/0!"},{"$f":"('Agg Blends'!D27/100)*('Agg Blends'!$M$9/100)*($N$11-$M$26)","v":0},{"$f":"('Agg Blends'!E27/100)*('Agg Blends'!$M$10/100)*($N$11-$M$26)","v":0},{"$f":"('Agg Blends'!F27/100)*('Agg Blends'!$M$11/100)*($N$11-$M$26)","v":0},{"$f":"('Agg Blends'!G27/100)*('Agg Blends'!$M$12/100)*($N$11-$M$26)","v":0},{"$f":"('Agg Blends'!H27/100)*('Agg Blends'!$M$13/100)*($N$11-$M$26)","v":0},{"$f":"('Agg Blends'!I27/100)*('Agg Blends'!$M$14/100)*($N$11-$M$26)","v":0},{"$f":"('Agg Blends'!J27/100)*('Agg Blends'!$M$16/100)*($N$11-$M$26)","v":0},{"$f":"('Agg Blends'!K27/100)*('Agg Blends'!$M$17/100)*($N$11-$M$26)","v":0}]
[4.75,0,0,0,0,0,0,0,0,0,0,null,null,null,null,null,null,null,{"$f":"(C20/$N$11)*100","v":{"$error":"#DIV/0!"}},{"$f":"('Agg Blends'!D28/100)*('Agg Blends'!$M$9/100)*($N$11-$M$26)","v":0},{"$f":"('Agg Blends'!E28/100)*('Agg Blends'!$M$10/100)*($N$11-$M$26)","v":0},{"$f":"('Agg Blends'!F28/100)*('Agg Blends'!$M$11/100)*($N$11-$M$26)","v":0},{"$f":"('Agg Blends'!G28/100)*('Agg Blends'!$M$12/100)*($N$11-$M$26)","v":0},{"$f":"('Agg Blends'!H28/100)*('Agg Blends'!$M$13/100)*($N$11-$M$26)","v":0},{"$f":"('Agg Blends'!I28/100)*('Agg Blends'!$M$14/100)*($N$11-$M$26)","v":0},{"$f":"('Agg Blends'!J28/100)*('Agg Blends'!$M$16/100)*($N$11-$M$26)","v":0},{"$f":"('Agg Blends'!K28/100)*('Agg Blends'!$M$17/100)*($N$11-$M$26)","v":0}]
[2.36,0,0,0,0,0,0,0,0,0,0,null,null,null,null,null,null,null,{"$error":"#DIV/0!"},{"$f":"('Agg Blends'!D29/100)*('Agg Blends'!$M$9/100)*($N$11-$M$26)","v":0},{"$f":"('Agg Blends'!E29/100)*('Agg Blends'!$M$10/100)*($N$11-$M$26)","v":0},{"$f":"('Agg Blends'!F29/100)*('Agg Blends'!$M$11/100)*($N$11-$M$26)","v":0},{"$f":"('Agg Blends'!G29/100)*('Agg Blends'!$M$12/100)*($N$11-$M$26)","v":0},{"$f":"('Agg Blends'!H29/100)*('Agg Blends'!$M$13/100)*($N$11-$M$26)","v":0},{"$f":"('Agg Blends'!I29/100)*('Agg Blends'!$M$14/100)*($N$11-$M$26)","v":0},{"$f":"('Agg Blends'!J29/100)*('Agg Blends'!$M$16/100)*($N$11-$M$26)","v":0},{"$f":"('Agg Blends'!K29/100)*('Agg Blends'!$M$17/100)*($N$11-$M$26)","v":0}]
[1.18,0,0,0,0,0,0,0,0,0,0,null,null,null,null,null,null,null,{"$error":"#DIV/0!"},{"$f":"('Agg Blends'!D30/100)*('Agg Blends'!$M$9/100)*($N$11-$M$26)","v":0},{"$f":"('Agg Blends'!E30/100)*('Agg Blends'!$M$10/100)*($N$11-$M$26)","v":0},{"$f":"('Agg Blends'!F30/100)*('Agg Blends'!$M$11/100)*($N$11-$M$26)","v":0},{"$f":"('Agg Blends'!G30/100)*('Agg Blends'!$M$12/100)*($N$11-$M$26)","v":0},{"$f":"('Agg Blends'!H30/100)*('Agg Blends'!$M$13/100)*($N$11-$M$26)","v":0},{"$f":"('Agg Blends'!I30/100)*('Agg Blends'!$M$14/100)*($N$11-$M$26)","v":0},{"$f":"('Agg Blends'!J30/100)*('Agg Blends'!$M$16/100)*($N$11-$M$26)","v":0},{"$f":"('Agg Blends'!K30/100)*('Agg Blends'!$M$17/100)*($N$11-$M$26)","v":0}]
[0.6,0,0,0,0,0,0,0,0,0,0,null,null,null,null,null,null,null,{"$error":"#DIV/0!"},{"$f":"('Agg Blends'!D31/100)*('Agg Blends'!$M$9/100)*($N$11-$M$26)","v":0},{"$f":"('Agg Blends'!E31/100)*('Agg Blends'!$M$10/100)*($N$11-$M$26)","v":0},{"$f":"('Agg Blends'!F31/100)*('Agg Blends'!$M$11/100)*($N$11-$M$26)","v":0},{"$f":"('Agg Blends'!G31/100)*('Agg Blends'!$M$12/100)*($N$11-$M$26)","v":0},{"$f":"('Agg Blends'!H31/100)*('Agg Blends'!$M$13/100)*($N$11-$M$26)","v":0},{"$f":"('Agg Blends'!I31/100)*('Agg Blends'!$M$14/100)*($N$11-$M$26)","v":0},{"$f":"('Agg Blends'!J31/100)*('Agg Blends'!$M$16/100)*($N$11-$M$26)","v":0},{"$f":"('Agg Blends'!K31/100)*('Agg Blends'!$M$17/100)*($N$11-$M$26)","v":0}]
[0.3,0,0,0,0,0,0,0,0,0,0,null,null,null,null,null,null,null,{"$error":"#DIV/0!"},{"$f":"('Agg Blends'!D32/100)*('Agg Blends'!$M$9/100)*($N$11-$M$26)","v":0},{"$f":"('Agg Blends'!E32/100)*('Agg Blends'!$M$10/100)*($N$11-$M$26)","v":0},{"$f":"('Agg Blends'!F32/100)*('Agg Blends'!$M$11/100)*($N$11-$M$26)","v":0},{"$f":"('Agg Blends'!G32/100)*('Agg Blends'!$M$12/100)*($N$11-$M$26)","v":0},{"$f":"('Agg Blends'!H32/100)*('Agg Blends'!$M$13/100)*($N$11-$M$26)","v":0},{"$f":"('Agg Blends'!I32/100)*('Agg Blends'!$M$14/100)*($N$11-$M$26)","v":0},{"$f":"('Agg Blends'!J32/100)*('Agg Blends'!$M$16/100)*($N$11-$M$26)","v":0},{"$f":"('Agg Blends'!K32/100)*('Agg Blends'!$M$17/100)*($N$11-$M$26)","v":0}]
[0.15,{"$f":"C25-C26","v":0},0,0,0,0,0,0,0,0,0,"Baghouse #200",null,null,null,null,null,null,{"$error":"#DIV/0!"},{"$f":"('Agg Blends'!D33/100)*('Agg Blends'!$M$9/100)*($N$11-$M$26)","v":0},{"$f":"('Agg Blends'!E33/100)*('Agg Blends'!$M$10/100)*($N$11-$M$26)","v":0},{"$f":"('Agg Blends'!F33/100)*('Agg Blends'!$M$11/100)*($N$11-$M$26)","v":0},{"$f":"('Agg Blends'!G33/100)*('Agg Blends'!$M$12/100)*($N$11-$M$26)","v":0},{"$f":"('Agg Blends'!H33/100)*('Agg Blends'!$M$13/100)*($N$11-$M$26)","v":0},{"$f":"('Agg Blends'!I33/100)*('Agg Blends'!$M$14/100)*($N$11-$M$26)","v":0},{"$f":"('Agg Blends'!J33/100)*('Agg Blends'!$M$16/100)*($N$11-$M$26)","v":0},{"$f":"('Agg Blends'!K33/100)*('Agg Blends'!$M$17/100)*($N$11-$M$26)","v":0}]
[7.4999999999999997E-2,{"$f":"C26","v":0},0,0,0,0,0,0,0,0,0,{"$f":"('Agg Blends'!M35/100)*($N$11)","v":0},null,null,null,null,null,null,{"$f":"(C26/$N$11)*100","v":{"$error":"#DIV/0!"}},{"$f":"('Agg Blends'!D34/100)*('Agg Blends'!$M$9/100)*($N$11-$M$26)","v":0},{"$f":"('Agg Blends'!E34/100)*('Agg Blends'!$M$10/100)*($N$11-$M$26)","v":0},{"$f":"('Agg Blends'!F34/100)*('Agg Blends'!$M$11/100)*($N$11-$M$26)","v":0},{"$f":"('Agg Blends'!G34/100)*('Agg Blends'!$M$12/100)*($N$11-$M$26)","v":0},{"$f":"('Agg Blends'!H34/100)*('Agg Blends'!$M$13/100)*($N$11-$M$26)","v":0},{"$f":"('Agg Blends'!I34/100)*('Agg Blends'!$M$14/100)*($N$11-$M$26)","v":0},{"$f":"('Agg Blends'!J34/100)*('Agg Blends'!$M$16/100)*($N$11-$M$26)","v":0},{"$f":"('Agg Blends'!K34/100)*('Agg Blends'!$M$17/100)*($N$11-$M$26)","v":0}]
[]
[]
[]
[null,null,null,null,"Gmm Specimen"]
[null,"Individual Weights","Cumulative Weights",null,null,null,null,null,null,null,null,"Total Aggregate Wt"]
["Sieve",null,null,{"$f":"'Agg Blends'!$I$9","v":0},{"$f":"'Agg Blends'!$I$10","v":0},{"$f":"'Agg Blends'!$I$11","v":0},{"$f":"'Agg Blends'!$I$12","v":0},{"$f":"'Agg Blends'!$I$13","v":0},{"$f":"'Agg Blends'!$I$14","v":0},{"$f":"'Agg Blends'!$I$16","v":0},{"$f":"'Agg Blends'!$I$17","v":0},null,null,null,null,null,null,null,null,1,2,3,4,5,6,7,8]
[50,{"$f":"C33-C34","v":0},{"$f":"IF(SUM(D33:K33)=0,0,SUM(D33:K33)+$L$46)","v":0},{"$f":"T33","v":0},0,0,0,0,0,0,0,"Binder %",null,null,null,null,null,null,{"$f":"(C33/$N$31)*100","v":{"$error":"#DIV/0!"}},{"$f":"('Agg Blends'!D21/100)*('Agg Blends'!$M$9/100)*($N$31-$M$46)","v":0},{"$f":"('Agg Blends'!E21/100)*('Agg Blends'!$M$10/100)*($N$31-$M$46)","v":0},{"$f":"('Agg Blends'!F21/100)*('Agg Blends'!$M$11/100)*($N$31-$M$46)","v":0},{"$f":"('Agg Blends'!G21/100)*('Agg Blends'!$M$12/100)*($N$31-$M$46)","v":0},{"$f":"('Agg Blends'!H21/100)*('Agg Blends'!$M$13/100)*($N$31-$M$46)","v":0},{"$f":"('Agg Blends'!I21/100)*('Agg Blends'!$M$14/100)*($N$31-$M$46)","v":0},{"$f":"('Agg Blends'!J21/100)*('Agg Blends'!$M$16/100)*($N$31-$M$46)","v":0},{"$f":"('Agg Blends'!K21/100)*('Agg Blends'!$M$17/100)*($N$31-$M$46)","v":0}]
[37.5,0,0,0,0,0,0,0,0,0,0,"Agg Wt",{"$f":"N31","v":0},{"$f":"N31","v":0},{"$f":"N31","v":0},{"$f":"N31","v":0},null,null,{"$f":"(C34/$N$31)*100","v":{"$error":"#DIV/0!"}},{"$f":"('Agg Blends'!D22/100)*('Agg Blends'!$M$9/100)*($N$31-$M$46)","v":0},{"$f":"('Agg Blends'!E22/100)*('Agg Blends'!$M$10/100)*($N$31-$M$46)","v":0},{"$f":"('Agg Blends'!F22/100)*('Agg Blends'!$M$11/100)*($N$31-$M$46)","v":0},{"$f":"('Agg Blends'!G22/100)*('Agg Blends'!$M$12/100)*($N$31-$M$46)","v":0},{"$f":"('Agg Blends'!H22/100)*('Agg Blends'!$M$13/100)*($N$31-$M$46)","v":0},{"$f":"('Agg Blends'!I22/100)*('Agg Blends'!$M$14/100)*($N$31-$M$46)","v":0},{"$f":"('Agg Blends'!J22/100)*('Agg Blends'!$M$16/100)*($N$31-$M$46)","v":0},{"$f":"('Agg Blends'!K22/100)*('Agg Blends'!$M$17/100)*($N$31-$M$46)","v":0}]
[25,0,0,0,0,0,0,0,0,0,0,"Binder Wt",{"$f":"M36-M34","v":0},{"$f":"N36-N34","v":0},{"$f":"O36-O34","v":0},{"$f":"P36-P34","v":0},null,null,{"$error":"#DIV/0!"},{"$f":"('Agg Blends'!D23/100)*('Agg Blends'!$M$9/100)*($N$31-$M$46)","v":0},{"$f":"('Agg Blends'!E23/100)*('Agg Blends'!$M$10/100)*($N$31-$M$46)","v":0},{"$f":"('Agg Blends'!F23/100)*('Agg Blends'!$M$11/100)*($N$31-$M$46)","v":0},{"$f":"('Agg Blends'!G23/100)*('Agg Blends'!$M$12/100)*($N$31-$M$46)","v":0},{"$f":"('Agg Blends'!H23/100)*('Agg Blends'!$M$13/100)*($N$31-$M$46)","v":0},{"$f":"('Agg Blends'!I23/100)*('Agg Blends'!$M$14/100)*($N$31-$M$46)","v":0},{"$f":"('Agg Blends'!J23/100)*('Agg Blends'!$M$16/100)*($N$31-$M$46)","v":0},{"$f":"('Agg Blends'!K23/100)*('Agg Blends'!$M$17/100)*($N$31-$M$46)","v":0}]
[19,0,0,0,0,0,0,0,0,0,0,"Total Wt",{"$f":"(M34/(100-M33))*100","v":0},{"$f":"(N34/(100-N33))*100","v":0},{"$f":"(O34/(100-O33))*100","v":0},{"$f":"(P34/(100-P33))*100","v":0},null,null,{"$error":"#DIV/0!"},{"$f":"('Agg Blends'!D24/100)*('Agg Blends'!$M$9/100)*($N$31-$M$46)","v":0},{"$f":"('Agg Blends'!E24/100)*('Agg Blends'!$M$10/100)*($N$31-$M$46)","v":0},{"$f":"('Agg Blends'!F24/100)*('Agg Blends'!$M$11/100)*($N$31-$M$46)","v":0},{"$f":"('Agg Blends'!G24/100)*('Agg Blends'!$M$12/100)*($N$31-$M$46)","v":0},{"$f":"('Agg Blends'!H24/100)*('Agg Blends'!$M$13/100)*($N$31-$M$46)","v":0},{"$f":"('Agg Blends'!I24/100)*('Agg Blends'!$M$14/100)*($N$31-$M$46)","v":0},{"$f":"('Agg Blends'!J24/100)*('Agg Blends'!$M$16/100)*($N$31-$M$46)","v":0},{"$f":"('Agg Blends'!K24/100)*('Agg Blends'!$M$17/100)*($N$31-$M$46)","v":0}]
[12.5,0,0,0,0,0,0,0,0,0,0,null,null,null,null,null,null,null,{"$error":"#DIV/0!"},{"$f":"('Agg Blends'!D25/100)*('Agg Blends'!$M$9/100)*($N$31-$M$46)","v":0},{"$f":"('Agg Blends'!E25/100)*('Agg Blends'!$M$10/100)*($N$31-$M$46)","v":0},{"$f":"('Agg Blends'!F25/100)*('Agg Blends'!$M$11/100)*($N$31-$M$46)","v":0},{"$f":"('Agg Blends'!G25/100)*('Agg Blends'!$M$12/100)*($N$31-$M$46)","v":0},{"$f":"('Agg Blends'!H25/100)*('Agg Blends'!$M$13/100)*($N$31-$M$46)","v":0},{"$f":"('Agg Blends'!I25/100)*('Agg Blends'!$M$14/100)*($N$31-$M$46)","v":0},{"$f":"('Agg Blends'!J25/100)*('Agg Blends'!$M$16/100)*($N$31-$M$46)","v":0},{"$f":"('Agg Blends'!K25/100)*('Agg Blends'!$M$17/100)*($N$31-$M$46)","v":0}]
[9.5,{"$f":"C38-C39","v":0},0,0,0,0,0,0,0,0,0,null,null,null,null,null,null,null,{"$f":"(C38/$N$31)*100","v":{"$error":"#DIV/0!"}},{"$f":"('Agg Blends'!D26/100)*('Agg Blends'!$M$9/100)*($N$31-$M$46)","v":0},{"$f":"('Agg Blends'!E26/100)*('Agg Blends'!$M$10/100)*($N$31-$M$46)","v":0},{"$f":"('Agg Blends'!F26/100)*('Agg Blends'!$M$11/100)*($N$31-$M$46)","v":0},{"$f":"('Agg Blends'!G26/100)*('Agg Blends'!$M$12/100)*($N$31-$M$46)","v":0},{"$f":"('Agg Blends'!H26/100)*('Agg Blends'!$M$13/100)*($N$31-$M$46)","v":0},{"$f":"('Agg Blends'!I26/100)*('Agg Blends'!$M$14/100)*($N$31-$M$46)","v":0},{"$f":"('Agg Blends'!J26/100)*('Agg Blends'!$M$16/100)*($N$31-$M$46)","v":0},{"$f":"('Agg Blends'!K26/100)*('Agg Blends'!$M$17/100)*($N$31-$M$46)","v":0}]
[6.33,0,0,0,0,0,0,0,0,0,0,null,null,null,null,null,null,null,{"$f":"(C39/$N$31)*100","v":{"$error":"#DIV/0!"}},{"$f":"('Agg Blends'!D27/100)*('Agg Blends'!$M$9/100)*($N$31-$M$46)","v":0},{"$f":"('Agg Blends'!E27/100)*('Agg Blends'!$M$10/100)*($N$31-$M$46)","v":0},{"$f":"('Agg Blends'!F27/100)*('Agg Blends'!$M$11/100)*($N$31-$M$46)","v":0},{"$f":"('Agg Blends'!G27/100)*('Agg Blends'!$M$12/100)*($N$31-$M$46)","v":0},{"$f":"('Agg Blends'!H27/100)*('Agg Blends'!$M$13/100)*($N$31-$M$46)","v":0},{"$f":"('Agg Blends'!I27/100)*('Agg Blends'!$M$14/100)*($N$31-$M$46)","v":0},{"$f":"('Agg Blends'!J27/100)*('Agg Blends'!$M$16/100)*($N$31-$M$46)","v":0},{"$f":"('Agg Blends'!K27/100)*('Agg Blends'!$M$17/100)*($N$31-$M$46)","v":0}]
[4.75,0,0,0,0,0,0,0,0,0,0,null,null,null,null,null,null,null,{"$error":"#DIV/0!"},{"$f":"('Agg Blends'!D28/100)*('Agg Blends'!$M$9/100)*($N$31-$M$46)","v":0},{"$f":"('Agg Blends'!E28/100)*('Agg Blends'!$M$10/100)*($N$31-$M$46)","v":0},{"$f":"('Agg Blends'!F28/100)*('Agg Blends'!$M$11/100)*($N$31-$M$46)","v":0},{"$f":"('Agg Blends'!G28/100)*('Agg Blends'!$M$12/100)*($N$31-$M$46)","v":0},{"$f":"('Agg Blends'!H28/100)*('Agg Blends'!$M$13/100)*($N$31-$M$46)","v":0},{"$f":"('Agg Blends'!I28/100)*('Agg Blends'!$M$14/100)*($N$31-$M$46)","v":0},{"$f":"('Agg Blends'!J28/100)*('Agg Blends'!$M$16/100)*($N$31-$M$46)","v":0},{"$f":"('Agg Blends'!K28/100)*('Agg Blends'!$M$17/100)*($N$31-$M$46)","v":0}]
[2.36,0,0,0,0,0,0,0,0,0,0,null,null,null,null,null,null,null,{"$error":"#DIV/0!"},{"$f":"('Agg Blends'!D29/100)*('Agg Blends'!$M$9/100)*($N$31-$M$46)","v":0},{"$f":"('Agg Blends'!E29/100)*('Agg Blends'!$M$10/100)*($N$31-$M$46)","v":0},{"$f":"('Agg Blends'!F29/100)*('Agg Blends'!$M$11/100)*($N$31-$M$46)","v":0},{"$f":"('Agg Blends'!G29/100)*('Agg Blends'!$M$12/100)*($N$31-$M$46)","v":0},{"$f":"('Agg Blends'!H29/100)*('Agg Blends'!$M$13/100)*($N$31-$M$46)","v":0},{"$f":"('Agg Blends'!I29/100)*('Agg Blends'!$M$14/100)*($N$31-$M$46)","v":0},{"$f":"('Agg Blends'!J29/100)*('Agg Blends'!$M$16/100)*($N$31-$M$46)","v":0},{"$f":"('Agg Blends'!K29/100)*('Agg Blends'!$M$17/100)*($N$31-$M$46)","v":0}]
[1.18,0,0,0,0,0,0,0,0,0,0,null,null,null,null,null,null,null,{"$error":"#DIV/0!"},{"$f":"('Agg Blends'!D30/100)*('Agg Blends'!$M$9/100)*($N$31-$M$46)","v":0},{"$f":"('Agg Blends'!E30/100)*('Agg Blends'!$M$10/100)*($N$31-$M$46)","v":0},{"$f":"('Agg Blends'!F30/100)*('Agg Blends'!$M$11/100)*($N$31-$M$46)","v":0},{"$f":"('Agg Blends'!G30/100)*('Agg Blends'!$M$12/100)*($N$31-$M$46)","v":0},{"$f":"('Agg Blends'!H30/100)*('Agg Blends'!$M$13/100)*($N$31-$M$46)","v":0},{"$f":"('Agg Blends'!I30/100)*('Agg Blends'!$M$14/100)*($N$31-$M$46)","v":0},{"$f":"('Agg Blends'!J30/100)*('Agg Blends'!$M$16/100)*($N$31-$M$46)","v":0},{"$f":"('Agg Blends'!K30/100)*('Agg Blends'!$M$17/100)*($N$31-$M$46)","v":0}]
[0.6,0,0,0,0,0,0,0,0,0,0,null,null,null,null,null,null,null,{"$error":"#DIV/0!"},{"$f":"('Agg Blends'!D31/100)*('Agg Blends'!$M$9/100)*($N$31-$M$46)","v":0},{"$f":"('Agg Blends'!E31/100)*('Agg Blends'!$M$10/100)*($N$31-$M$46)","v":0},{"$f":"('Agg Blends'!F31/100)*('Agg Blends'!$M$11/100)*($N$31-$M$46)","v":0},{"$f":"('Agg Blends'!G31/100)*('Agg Blends'!$M$12/100)*($N$31-$M$46)","v":0},{"$f":"('Agg Blends'!H31/100)*('Agg Blends'!$M$13/100)*($N$31-$M$46)","v":0},{"$f":"('Agg Blends'!I31/100)*('Agg Blends'!$M$14/100)*($N$31-$M$46)","v":0},{"$f":"('Agg Blends'!J31/100)*('Agg Blends'!$M$16/100)*($N$31-$M$46)","v":0},{"$f":"('Agg Blends'!K31/100)*('Agg Blends'!$M$17/100)*($N$31-$M$46)","v":0}]
[0.3,0,0,0,0,0,0,0,0,0,0,null,null,null,null,null,null,null,{"$error":"#DIV/0!"},{"$f":"('Agg Blends'!D32/100)*('Agg Blends'!$M$9/100)*($N$31-$M$46)","v":0},{"$f":"('Agg Blends'!E32/100)*('Agg Blends'!$M$10/100)*($N$31-$M$46)","v":0},{"$f":"('Agg Blends'!F32/100)*('Agg Blends'!$M$11/100)*($N$31-$M$46)","v":0},{"$f":"('Agg Blends'!G32/100)*('Agg Blends'!$M$12/100)*($N$31-$M$46)","v":0},{"$f":"('Agg Blends'!H32/100)*('Agg Blends'!$M$13/100)*($N$31-$M$46)","v":0},{"$f":"('Agg Blends'!I32/100)*('Agg Blends'!$M$14/100)*($N$31-$M$46)","v":0},{"$f":"('Agg Blends'!J32/100)*('Agg Blends'!$M$16/100)*($N$31-$M$46)","v":0},{"$f":"('Agg Blends'!K32/100)*('Agg Blends'!$M$17/100)*($N$31-$M$46)","v":0}]
[0.15,{"$f":"C45-C46","v":0},0,0,0,0,0,0,0,0,0,"Baghouse #200",null,null,null,null,null,null,{"$error":"#DIV/0!"},{"$f":"('Agg Blends'!D33/100)*('Agg Blends'!$M$9/100)*($N$31-$M$46)","v":0},{"$f":"('Agg Blends'!E33/100)*('Agg Blends'!$M$10/100)*($N$31-$M$46)","v":0},{"$f":"('Agg Blends'!F33/100)*('Agg Blends'!$M$11/100)*($N$31-$M$46)","v":0},{"$f":"('Agg Blends'!G33/100)*('Agg Blends'!$M$12/100)*($N$31-$M$46)","v":0},{"$f":"('Agg Blends'!H33/100)*('Agg Blends'!$M$13/100)*($N$31-$M$46)","v":0},{"$f":"('Agg Blends'!I33/100)*('Agg Blends'!$M$14/100)*($N$31-$M$46)","v":0},{"$f":"('Agg Blends'!J33/100)*('Agg Blends'!$M$16/100)*($N$31-$M$46)","v":0},{"$f":"('Agg Blends'!K33/100)*('Agg Blends'!$M$17/100)*($N$31-$M$46)","v":0}]
[7.4999999999999997E-2,{"$f":"C46","v":0},0,0,0,0,0,0,0,0,0,{"$f":"('Agg Blends'!M35/100)*($N$31)","v":0},null,null,null,null,null,null,{"$error":"#DIV/0!"},{"$f":"('Agg Blends'!D34/100)*('Agg Blends'!$M$9/100)*($N$31-$M$46)","v":0},{"$f":"('Agg Blends'!E34/100)*('Agg Blends'!$M$10/100)*($N$31-$M$46)","v":0},{"$f":"('Agg Blends'!F34/100)*('Agg Blends'!$M$11/100)*($N$31-$M$46)","v":0},{"$f":"('Agg Blends'!G34/100)*('Agg Blends'!$M$12/100)*($N$31-$M$46)","v":0},{"$f":"('Agg Blends'!H34/100)*('Agg Blends'!$M$13/100)*($N$31-$M$46)","v":0},{"$f":"('Agg Blends'!I34/100)*('Agg Blends'!$M$14/100)*($N$31-$M$46)","v":0},{"$f":"('Agg Blends'!J34/100)*('Agg Blends'!$M$16/100)*($N$31-$M$46)","v":0},{"$f":"('Agg Blends'!K34/100)*('Agg Blends'!$M$17/100)*($N$31-$M$46)","v":0}]

{"sheet":"Blend 3","index":22,"n_rows":46,"n_cols":27,"rows_kept":46,"cut":false,"hidden":false,"merged":[[10,11,10,12],[30,11,30,12],[4,12,4,13],[4,14,4,15],[5,12,5,13],[5,14,5,15],[7,0,7,15],[29,4,29,5],[30,1,31,1],[30,2,31,2],[9,4,9,5],[10,1,11,1],[10,2,11,2],[4,0,4,1],[4,2,4,3],[4,6,4,7],[0,0,0,1],[3,0,3,1],[3,2,3,3],[3,6,3,7],[3,8,3,9],[2,0,2,15],[3,12,3,13],[3,14,3,15],[4,8,4,9],[5,0,5,1],[5,2,5,3],[5,6,5,7],[5,8,5,9]]}
[{"$f":"Setup!A2","v":"ESB-21"}]
[]
["Blend Sheet 3"]
["Producer;",null,{"$f":"Setup!E7","v":0},null,null,null,"Material Class:",null,{"$f":"Setup!E11","v":0},null,null,null,"Nominal Size:",null,{"$f":"Setup!E10","v":0}]
["Designed By:",null,{"$f":"Setup!E9","v":0},null,null,null,"Esals:",null,{"$f":"Setup!E13","v":0},null,null,null,"SRL:",null,{"$f":"Setup!E12","v":0}]
["Date:",null,{"$f":"Setup!E6","v":"00:00:00"},null,null,null,"Rap:",null,{"$f":"Setup!E18","v":0},null,null,null,"PG Grade:",null,{"$f":"Setup!E15","v":0}]
[]
["Blend 3"]
[]
[null,null,null,null,"Gmb Specimen"]
[null,"Individual Weights","Cumulative Weights",null,null,null,null,null,null,null,null,"Total Aggregate Wt"]
["Sieve",null,null,{"$f":"'Agg Blends'!$I$9","v":0},{"$f":"'Agg Blends'!$I$10","v":0},{"$f":"'Agg Blends'!$I$11","v":0},{"$f":"'Agg Blends'!$I$12","v":0},{"$f":"'Agg Blends'!$I$13","v":0},{"$f":"'Agg Blends'!$I$14","v":0},{"$f":"'Agg Blends'!$I$16","v":0},{"$f":"'Agg Blends'!$I$17","v":0},null,null,null,null,null,null,null,null,1,2,3,4,5,6,7,8]
[50,{"$f":"C13-C14","v":0},{"$f":"IF(SUM(D13:K13)=0,0,SUM(D13:K13)+$L$26)","v":0},{"$f":"T13","v":0},0,0,0,0,0,0,0,"Binder %",null,null,null,null,null,null,{"$f":"(C13/$N$11)*100","v":{"$error":"#DIV/0!"}},{"$f":"('Agg Blends'!D21/100)*('Agg Blends'!$N$9/100)*($N$11-$N$26)","v":0},{"$f":"('Agg Blends'!E21/100)*('Agg Blends'!$N$10/100)*($N$11-$N$26)","v":0},{"$f":"('Agg Blends'!F21/100)*('Agg Blends'!$N$11/100)*($N$11-$N$26)","v":0},{"$f":"('Agg Blends'!G21/100)*('Agg Blends'!$N$12/100)*($N$11-$N$26)","v":0},{"$f":"('Agg Blends'!H21/100)*('Agg Blends'!$N$13/100)*($N$11-$N$26)","v":0},{"$f":"('Agg Blends'!I21/100)*('Agg Blends'!$N$14/100)*($N$11-$N$26)","v":0},{"$f":"('Agg Blends'!J21/100)*('Agg Blends'!$N$16/100)*($N$11-$N$26)","v":0},{"$f":"('Agg Blends'!K21/100)*('Agg Blends'!$N$17/100)*($N$11-$N$26)","v":0}]
[37.5,0,0,0,0,0,0,0,0,0,0,"Agg Wt",{"$f":"N11","v":0},{"$f":"N11","v":0},{"$f":"N11","v":0},{"$f":"N11","v":0},null,null,{"$f":"(C14/$N$11)*100","v":{"$error":"#DIV/0!"}},{"$f":"('Agg Blends'!D22/100)*('Agg Blends'!$N$9/100)*($N$11-$N$26)","v":0},{"$f":"('Agg Blends'!E22/100)*('Agg Blends'!$N$10/100)*($N$11-$N$26)","v":0},{"$f":"('Agg Blends'!F22/100)*('Agg Blends'!$N$11/100)*($N$11-$N$26)","v":0},{"$f":"('Agg Blends'!G22/100)*('Agg Blends'!$N$12/100)*($N$11-$N$26)","v":0},{"$f":"('Agg Blends'!H22/100)*('Agg Blends'!$N$13/100)*($N$11-$N$26)","v":0},{"$f":"('Agg Blends'!I22/100)*('Agg Blends'!$N$14/100)*($N$11-$N$26)","v":0},{"$f":"('Agg Blends'!J22/100)*('Agg Blends'!$N$16/100)*($N$11-$N$26)","v":0},{"$f":"('Agg Blends'!K22/100)*('Agg Blends'!$N$17/100)*($N$11-$N$26)","v":0}]
[25,0,0,{"$f":"T15","v":0},0,0,0,0,0,0,0,"Binder Wt",{"$f":"M16-M14","v":0},{"$f":"N16-N14","v":0},{"$f":"O16-O14","v":0},{"$f":"P16-P14","v":0},null,null,{"$f":"(C15/$N$11)*100","v":{"$error":"#DIV/0!"}},{"$f":"('Agg Blends'!D23/100)*('Agg Blends'!$N$9/100)*($N$11-$N$26)","v":0},{"$f":"('Agg Blends'!E23/100)*('Agg Blends'!$N$10/100)*($N$11-$N$26)","v":0},{"$f":"('Agg Blends'!F23/100)*('Agg Blends'!$N$11/100)*($N$11-$N$26)","v":0},{"$f":"('Agg Blends'!G23/100)*('Agg Blends'!$N$12/100)*($N$11-$N$26)","v":0},{"$f":"('Agg Blends'!H23/100)*('Agg Blends'!$N$13/100)*($N$11-$N$26)","v":0},{"$f":"('Agg Blends'!I23/100)*('Agg Blends'!$N$14/100)*($N$11-$N$26)","v":0},{"$f":"('Agg Blends'!J23/100)*('Agg Blends'!$N$16/100)*($N$11-$N$26)","v":0},{"$f":"('Agg Blends'!K23/100)*('Agg Blends'!$N$17/100)*($N$11-$N$26)","v":0}]
[19,0,0,0,0,0,0,0,0,0,0,"Total Wt",{"$f":"(M14/(100-M13))*100","v":0},{"$f":"(N14/(100-N13))*100","v":0},{"$f":"(O14/(100-O13))*100","v":0},{"$f":"(P14/(100-P13))*100","v":0},null,null,{"$error":"#DIV/0!"},{"$f":"('Agg Blends'!D24/100)*('Agg Blends'!$N$9/100)*($N$11-$N$26)","v":0},{"$f":"('Agg Blends'!E24/100)*('Agg Blends'!$N$10/100)*($N$11-$N$26)","v":0},{"$f":"('Agg Blends'!F24/100)*('Agg Blends'!$N$11/100)*($N$11-$N$26)","v":0},{"$f":"('Agg Blends'!G24/100)*('Agg Blends'!$N$12/100)*($N$11-$N$26)","v":0},{"$f":"('Agg Blends'!H24/100)*('Agg Blends'!$N$13/100)*($N$11-$N$26)","v":0},{"$f":"('Agg Blends'!I24/100)*('Agg Blends'!$N$14/100)*($N$11-$N$26)","v":0},{"$f":"('Agg Blends'!J24/100)*('Agg Blends'!$N$16/100)*($N$11-$N$26)","v":0},{"$f":"('Agg Blends'!K24/100)*('Agg Blends'!$N$17/100)*($N$11-$N$26)","v":0}]
[12.5,0,0,0,0,0,0,0,0,0,0,null,null,null,null,null,null,null,{"$error":"#DIV/0!"},{"$f":"('Agg Blends'!D25/100)*('Agg Blends'!$N$9/100)*($N$11-$N$26)","v":0},{"$f":"('Agg Blends'!E25/100)*('Agg Blends'!$N$10/100)*($N$11-$N$26)","v":0},{"$f":"('Agg Blends'!F25/100)*('Agg Blends'!$N$11/100)*($N$11-$N$26)","v":0},{"$f":"('Agg Blends'!G25/100)*('Agg Blends'!$N$12/100)*($N$11-$N$26)","v":0},{"$f":"('Agg Blends'!H25/100)*('Agg Blends'!$N$13/100)*($N$11-$N$26)","v":0},{"$f":"('Agg Blends'!I25/100)*('Agg Blends'!$N$14/100)*($N$11-$N$26)","v":0},{"$f":"('Agg Blends'!J25/100)*('Agg Blends'!$N$16/100)*($N$11-$N$26)","v":0},{"$f":"('Agg Blends'!K25/100)*('Agg Blends'!$N$17/100)*($N$11-$N$26)","v":0}]
[9.5,{"$f":"C18-C19","v":0},0,0,0,0,0,0,0,0,0,null,null,null,null,null,null,null,{"$error":"#DIV/0!"},{"$f":"('Agg Blends'!D26/100)*('Agg Blends'!$N$9/100)*($N$11-$N$26)","v":0},{"$f":"('Agg Blends'!E26/100)*('Agg Blends'!$N$10/100)*($N$11-$N$26)","v":0},{"$f":"('Agg Blends'!F26/100)*('Agg Blends'!$N$11/100)*($N$11-$N$26)","v":0},{"$f":"('Agg Blends'!G26/100)*('Agg Blends'!$N$12/100)*($N$11-$N$26)","v":0},{"$f":"('Agg Blends'!H26/100)*('Agg Blends'!$N$13/100)*($N$11-$N$26)","v":0},{"$f":"('Agg Blends'!I26/100)*('Agg Blends'!$N$14/100)*($N$11-$N$26)","v":0},{"$f":"('Agg Blends'!J26/100)*('Agg Blends'!$N$16/100)*($N$11-$N$26)","v":0},{"$f":"('Agg Blends'!K26/100)*('Agg Blends'!$N$17/100)*($N$11-$N$26)","v":0}]
[6.33,{"$f":"C19-C20","v":0},0,0,0,0,0,0,0,0,0,null,null,null,null,null,null,null,{"$error":"#DIV/0!"},{"$f":"('Agg Blends'!D27/100)*('Agg Blends'!$N$9/100)*($N$11-$N$26)","v":0},{"$f":"('Agg Blends'!E27/100)*('Agg Blends'!$N$10/100)*($N$11-$N$26)","v":0},{"$f":"('Agg Blends'!F27/100)*('Agg Blends'!$N$11/100)*($N$11-$N$26)","v":0},{"$f":"('Agg Blends'!G27/100)*('Agg Blends'!$N$12/100)*($N$11-$N$26)","v":0},{"$f":"('Agg Blends'!H27/100)*('Agg Blends'!$N$13/100)*($N$11-$N$26)","v":0},{"$f":"('Agg Blends'!I27/100)*('Agg Blends'!$N$14/100)*($N$11-$N$26)","v":0},{"$f":"('Agg Blends'!J27/100)*('Agg Blends'!$N$16/100)*($N$11-$N$26)","v":0},{"$f":"('Agg Blends'!K27/100)*('Agg Blends'!$N$17/100)*($N$11-$N$26)","v":0}]
[4.75,0,0,0,0,0,0,0,0,0,0,null,null,null,null,null,null,null,{"$f":"(C20/$N$11)*100","v":{"$error":"#DIV/0!"}},{"$f":"('Agg Blends'!D28/100)*('Agg Blends'!$N$9/100)*($N$11-$N$26)","v":0},{"$f":"('Agg Blends'!E28/100)*('Agg Blends'!$N$10/100)*($N$11-$N$26)","v":0},{"$f":"('Agg Blends'!F28/100)*('Agg Blends'!$N$11/100)*($N$11-$N$26)","v":0},{"$f":"('Agg Blends'!G28/100)*('Agg Blends'!$N$12/100)*($N$11-$N$26)","v":0},{"$f":"('Agg Blends'!H28/100)*('Agg Blends'!$N$13/100)*($N$11-$N$26)","v":0},{"$f":"('Agg Blends'!I28/100)*('Agg Blends'!$N$14/100)*($N$11-$N$26)","v":0},{"$f":"('Agg Blends'!J28/100)*('Agg Blends'!$N$16/100)*($N$11-$N$26)","v":0},{"$f":"('Agg Blends'!K28/100)*('Agg Blends'!$N$17/100)*($N$11-$N$26)","v":0}]
[2.36,0,0,0,0,0,0,0,0,0,0,null,null,null,null,null,null,null,{"$error":"#DIV/0!"},{"$f":"('Agg Blends'!D29/100)*('Agg Blends'!$N$9/100)*($N$11-$N$26)","v":0},{"$f":"('Agg Blends'!E29/100)*('Agg Blends'!$N$10/100)*($N$11-$N$26)","v":0},{"$f":"('Agg Blends'!F29/100)*('Agg Blends'!$N$11/100)*($N$11-$N$26)","v":0},{"$f":"('Agg Blends'!G29/100)*('Agg Blends'!$N$12/100)*($N$11-$N$26)","v":0},{"$f":"('Agg Blends'!H29/100)*('Agg Blends'!$N$13/100)*($N$11-$N$26)","v":0},{"$f":"('Agg Blends'!I29/100)*('Agg Blends'!$N$14/100)*($N$11-$N$26)","v":0},{"$f":"('Agg Blends'!J29/100)*('Agg Blends'!$N$16/100)*($N$11-$N$26)","v":0},{"$f":"('Agg Blends'!K29/100)*('Agg Blends'!$N$17/100)*($N$11-$N$26)","v":0}]
[1.18,0,0,0,0,0,0,0,0,0,0,null,null,null,null,null,null,null,{"$error":"#DIV/0!"},{"$f":"('Agg Blends'!D30/100)*('Agg Blends'!$N$9/100)*($N$11-$N$26)","v":0},{"$f":"('Agg Blends'!E30/100)*('Agg Blends'!$N$10/100)*($N$11-$N$26)","v":0},{"$f":"('Agg Blends'!F30/100)*('Agg Blends'!$N$11/100)*($N$11-$N$26)","v":0},{"$f":"('Agg Blends'!G30/100)*('Agg Blends'!$N$12/100)*($N$11-$N$26)","v":0},{"$f":"('Agg Blends'!H30/100)*('Agg Blends'!$N$13/100)*($N$11-$N$26)","v":0},{"$f":"('Agg Blends'!I30/100)*('Agg Blends'!$N$14/100)*($N$11-$N$26)","v":0},{"$f":"('Agg Blends'!J30/100)*('Agg Blends'!$N$16/100)*($N$11-$N$26)","v":0},{"$f":"('Agg Blends'!K30/100)*('Agg Blends'!$N$17/100)*($N$11-$N$26)","v":0}]
[0.6,0,0,0,0,0,0,0,0,0,0,null,null,null,null,null,null,null,{"$error":"#DIV/0!"},{"$f":"('Agg Blends'!D31/100)*('Agg Blends'!$N$9/100)*($N$11-$N$26)","v":0},{"$f":"('Agg Blends'!E31/100)*('Agg Blends'!$N$10/100)*($N$11-$N$26)","v":0},{"$f":"('Agg Blends'!F31/100)*('Agg Blends'!$N$11/100)*($N$11-$N$26)","v":0},{"$f":"('Agg Blends'!G31/100)*('Agg Blends'!$N$12/100)*($N$11-$N$26)","v":0},{"$f":"('Agg Blends'!H31/100)*('Agg Blends'!$N$13/100)*($N$11-$N$26)","v":0},{"$f":"('Agg Blends'!I31/100)*('Agg Blends'!$N$14/100)*($N$11-$N$26)","v":0},{"$f":"('Agg Blends'!J31/100)*('Agg Blends'!$N$16/100)*($N$11-$N$26)","v":0},{"$f":"('Agg Blends'!K31/100)*('Agg Blends'!$N$17/100)*($N$11-$N$26)","v":0}]
[0.3,0,0,0,0,0,0,0,0,0,0,null,null,null,null,null,null,null,{"$error":"#DIV/0!"},{"$f":"('Agg Blends'!D32/100)*('Agg Blends'!$N$9/100)*($N$11-$N$26)","v":0},{"$f":"('Agg Blends'!E32/100)*('Agg Blends'!$N$10/100)*($N$11-$N$26)","v":0},{"$f":"('Agg Blends'!F32/100)*('Agg Blends'!$N$11/100)*($N$11-$N$26)","v":0},{"$f":"('Agg Blends'!G32/100)*('Agg Blends'!$N$12/100)*($N$11-$N$26)","v":0},{"$f":"('Agg Blends'!H32/100)*('Agg Blends'!$N$13/100)*($N$11-$N$26)","v":0},{"$f":"('Agg Blends'!I32/100)*('Agg Blends'!$N$14/100)*($N$11-$N$26)","v":0},{"$f":"('Agg Blends'!J32/100)*('Agg Blends'!$N$16/100)*($N$11-$N$26)","v":0},{"$f":"('Agg Blends'!K32/100)*('Agg Blends'!$N$17/100)*($N$11-$N$26)","v":0}]
[0.15,{"$f":"C25-C26","v":0},0,0,0,0,0,0,0,0,0,"Baghouse #200",null,null,null,null,null,null,{"$error":"#DIV/0!"},{"$f":"('Agg Blends'!D33/100)*('Agg Blends'!$N$9/100)*($N$11-$N$26)","v":0},{"$f":"('Agg Blends'!E33/100)*('Agg Blends'!$N$10/100)*($N$11-$N$26)","v":0},{"$f":"('Agg Blends'!F33/100)*('Agg Blends'!$N$11/100)*($N$11-$N$26)","v":0},{"$f":"('Agg Blends'!G33/100)*('Agg Blends'!$N$12/100)*($N$11-$N$26)","v":0},{"$f":"('Agg Blends'!H33/100)*('Agg Blends'!$N$13/100)*($N$11-$N$26)","v":0},{"$f":"('Agg Blends'!I33/100)*('Agg Blends'!$N$14/100)*($N$11-$N$26)","v":0},{"$f":"('Agg Blends'!J33/100)*('Agg Blends'!$N$16/100)*($N$11-$N$26)","v":0},{"$f":"('Agg Blends'!K33/100)*('Agg Blends'!$N$17/100)*($N$11-$N$26)","v":0}]
[7.4999999999999997E-2,{"$f":"C26","v":0},0,0,0,0,0,0,0,0,0,{"$f":"('Agg Blends'!L35/100)*($N$11)","v":0},null,null,null,null,null,null,{"$f":"(C26/$N$11)*100","v":{"$error":"#DIV/0!"}},{"$f":"('Agg Blends'!D34/100)*('Agg Blends'!$N$9/100)*($N$11-$N$26)","v":0},{"$f":"('Agg Blends'!E34/100)*('Agg Blends'!$N$10/100)*($N$11-$N$26)","v":0},{"$f":"('Agg Blends'!F34/100)*('Agg Blends'!$N$11/100)*($N$11-$N$26)","v":0},{"$f":"('Agg Blends'!G34/100)*('Agg Blends'!$N$12/100)*($N$11-$N$26)","v":0},{"$f":"('Agg Blends'!H34/100)*('Agg Blends'!$N$13/100)*($N$11-$N$26)","v":0},{"$f":"('Agg Blends'!I34/100)*('Agg Blends'!$N$14/100)*($N$11-$N$26)","v":0},{"$f":"('Agg Blends'!J34/100)*('Agg Blends'!$N$16/100)*($N$11-$N$26)","v":0},{"$f":"('Agg Blends'!K34/100)*('Agg Blends'!$N$17/100)*($N$11-$N$26)","v":0}]
[]
[]
[]
[null,null,null,null,"Gmm Specimen"]
[null,"Individual Weights","Cumulative Weights",null,null,null,null,null,null,null,null,"Total Aggregate Wt"]
["Sieve",null,null,{"$f":"'Agg Blends'!$I$9","v":0},{"$f":"'Agg Blends'!$I$10","v":0},{"$f":"'Agg Blends'!$I$11","v":0},{"$f":"'Agg Blends'!$I$12","v":0},{"$f":"'Agg Blends'!$I$13","v":0},{"$f":"'Agg Blends'!$I$14","v":0},{"$f":"'Agg Blends'!$I$16","v":0},{"$f":"'Agg Blends'!$I$17","v":0},null,null,null,null,null,null,null,null,1,2,3,4,5,6,7,8]
[50,{"$f":"C33-C34","v":0},{"$f":"IF(SUM(D33:K33)=0,0,SUM(D33:K33)+$L$46)","v":0},{"$f":"T33","v":0},0,0,0,0,0,0,0,"Binder %",null,null,null,null,null,null,{"$f":"(C33/$N$31)*100","v":{"$error":"#DIV/0!"}},{"$f":"('Agg Blends'!D21/100)*('Agg Blends'!$N$9/100)*($N$31-$N$46)","v":0},{"$f":"('Agg Blends'!E21/100)*('Agg Blends'!$N$10/100)*($N$31-$N$46)","v":0},{"$f":"('Agg Blends'!F21/100)*('Agg Blends'!$N$11/100)*($N$31-$N$46)","v":0},{"$f":"('Agg Blends'!G21/100)*('Agg Blends'!$N$12/100)*($N$31-$N$46)","v":0},{"$f":"('Agg Blends'!H21/100)*('Agg Blends'!$N$13/100)*($N$31-$N$46)","v":0},{"$f":"('Agg Blends'!I21/100)*('Agg Blends'!$N$14/100)*($N$31-$N$46)","v":0},{"$f":"('Agg Blends'!J21/100)*('Agg Blends'!$N$16/100)*($N$31-$N$46)","v":0},{"$f":"('Agg Blends'!K21/100)*('Agg Blends'!$N$17/100)*($N$31-$N$46)","v":0}]
[37.5,0,0,0,0,0,0,0,0,0,0,"Agg Wt",{"$f":"N31","v":0},{"$f":"N31","v":0},{"$f":"N31","v":0},{"$f":"N31","v":0},null,null,{"$f":"(C34/$N$31)*100","v":{"$error":"#DIV/0!"}},{"$f":"('Agg Blends'!D22/100)*('Agg Blends'!$N$9/100)*($N$31-$N$46)","v":0},{"$f":"('Agg Blends'!E22/100)*('Agg Blends'!$N$10/100)*($N$31-$N$46)","v":0},{"$f":"('Agg Blends'!F22/100)*('Agg Blends'!$N$11/100)*($N$31-$N$46)","v":0},{"$f":"('Agg Blends'!G22/100)*('Agg Blends'!$N$12/100)*($N$31-$N$46)","v":0},{"$f":"('Agg Blends'!H22/100)*('Agg Blends'!$N$13/100)*($N$31-$N$46)","v":0},{"$f":"('Agg Blends'!I22/100)*('Agg Blends'!$N$14/100)*($N$31-$N$46)","v":0},{"$f":"('Agg Blends'!J22/100)*('Agg Blends'!$N$16/100)*($N$31-$N$46)","v":0},{"$f":"('Agg Blends'!K22/100)*('Agg Blends'!$N$17/100)*($N$31-$N$46)","v":0}]
[25,0,0,0,0,0,0,0,0,0,0,"Binder Wt",{"$f":"M36-M34","v":0},{"$f":"N36-N34","v":0},{"$f":"O36-O34","v":0},{"$f":"P36-P34","v":0},null,null,{"$error":"#DIV/0!"},{"$f":"('Agg Blends'!D23/100)*('Agg Blends'!$N$9/100)*($N$31-$N$46)","v":0},{"$f":"('Agg Blends'!E23/100)*('Agg Blends'!$N$10/100)*($N$31-$N$46)","v":0},{"$f":"('Agg Blends'!F23/100)*('Agg Blends'!$N$11/100)*($N$31-$N$46)","v":0},{"$f":"('Agg Blends'!G23/100)*('Agg Blends'!$N$12/100)*($N$31-$N$46)","v":0},{"$f":"('Agg Blends'!H23/100)*('Agg Blends'!$N$13/100)*($N$31-$N$46)","v":0},{"$f":"('Agg Blends'!I23/100)*('Agg Blends'!$N$14/100)*($N$31-$N$46)","v":0},{"$f":"('Agg Blends'!J23/100)*('Agg Blends'!$N$16/100)*($N$31-$N$46)","v":0},{"$f":"('Agg Blends'!K23/100)*('Agg Blends'!$N$17/100)*($N$31-$N$46)","v":0}]
[19,0,0,0,0,0,0,0,0,0,0,"Total Wt",{"$f":"(M34/(100-M33))*100","v":0},{"$f":"(N34/(100-N33))*100","v":0},{"$f":"(O34/(100-O33))*100","v":0},{"$f":"(P34/(100-P33))*100","v":0},null,null,{"$error":"#DIV/0!"},{"$f":"('Agg Blends'!D24/100)*('Agg Blends'!$N$9/100)*($N$31-$N$46)","v":0},{"$f":"('Agg Blends'!E24/100)*('Agg Blends'!$N$10/100)*($N$31-$N$46)","v":0},{"$f":"('Agg Blends'!F24/100)*('Agg Blends'!$N$11/100)*($N$31-$N$46)","v":0},{"$f":"('Agg Blends'!G24/100)*('Agg Blends'!$N$12/100)*($N$31-$N$46)","v":0},{"$f":"('Agg Blends'!H24/100)*('Agg Blends'!$N$13/100)*($N$31-$N$46)","v":0},{"$f":"('Agg Blends'!I24/100)*('Agg Blends'!$N$14/100)*($N$31-$N$46)","v":0},{"$f":"('Agg Blends'!J24/100)*('Agg Blends'!$N$16/100)*($N$31-$N$46)","v":0},{"$f":"('Agg Blends'!K24/100)*('Agg Blends'!$N$17/100)*($N$31-$N$46)","v":0}]
[12.5,0,0,0,0,0,0,0,0,0,0,null,null,null,null,null,null,null,{"$error":"#DIV/0!"},{"$f":"('Agg Blends'!D25/100)*('Agg Blends'!$N$9/100)*($N$31-$N$46)","v":0},{"$f":"('Agg Blends'!E25/100)*('Agg Blends'!$N$10/100)*($N$31-$N$46)","v":0},{"$f":"('Agg Blends'!F25/100)*('Agg Blends'!$N$11/100)*($N$31-$N$46)","v":0},{"$f":"('Agg Blends'!G25/100)*('Agg Blends'!$N$12/100)*($N$31-$N$46)","v":0},{"$f":"('Agg Blends'!H25/100)*('Agg Blends'!$N$13/100)*($N$31-$N$46)","v":0},{"$f":"('Agg Blends'!I25/100)*('Agg Blends'!$N$14/100)*($N$31-$N$46)","v":0},{"$f":"('Agg Blends'!J25/100)*('Agg Blends'!$N$16/100)*($N$31-$N$46)","v":0},{"$f":"('Agg Blends'!K25/100)*('Agg Blends'!$N$17/100)*($N$31-$N$46)","v":0}]
[9.5,{"$f":"C38-C39","v":0},0,0,0,0,0,0,0,0,0,null,null,null,null,null,null,null,{"$f":"(C38/$N$31)*100","v":{"$error":"#DIV/0!"}},{"$f":"('Agg Blends'!D26/100)*('Agg Blends'!$N$9/100)*($N$31-$N$46)","v":0},{"$f":"('Agg Blends'!E26/100)*('Agg Blends'!$N$10/100)*($N$31-$N$46)","v":0},{"$f":"('Agg Blends'!F26/100)*('Agg Blends'!$N$11/100)*($N$31-$N$46)","v":0},{"$f":"('Agg Blends'!G26/100)*('Agg Blends'!$N$12/100)*($N$31-$N$46)","v":0},{"$f":"('Agg Blends'!H26/100)*('Agg Blends'!$N$13/100)*($N$31-$N$46)","v":0},{"$f":"('Agg Blends'!I26/100)*('Agg Blends'!$N$14/100)*($N$31-$N$46)","v":0},{"$f":"('Agg Blends'!J26/100)*('Agg Blends'!$N$16/100)*($N$31-$N$46)","v":0},{"$f":"('Agg Blends'!K26/100)*('Agg Blends'!$N$17/100)*($N$31-$N$46)","v":0}]
[6.33,0,0,0,0,0,0,0,0,0,0,null,null,null,null,null,null,null,{"$f":"(C39/$N$31)*100","v":{"$error":"#DIV/0!"}},{"$f":"('Agg Blends'!D27/100)*('Agg Blends'!$N$9/100)*($N$31-$N$46)","v":0},{"$f":"('Agg Blends'!E27/100)*('Agg Blends'!$N$10/100)*($N$31-$N$46)","v":0},{"$f":"('Agg Blends'!F27/100)*('Agg Blends'!$N$11/100)*($N$31-$N$46)","v":0},{"$f":"('Agg Blends'!G27/100)*('Agg Blends'!$N$12/100)*($N$31-$N$46)","v":0},{"$f":"('Agg Blends'!H27/100)*('Agg Blends'!$N$13/100)*($N$31-$N$46)","v":0},{"$f":"('Agg Blends'!I27/100)*('Agg Blends'!$N$14/100)*($N$31-$N$46)","v":0},{"$f":"('Agg Blends'!J27/100)*('Agg Blends'!$N$16/100)*($N$31-$N$46)","v":0},{"$f":"('Agg Blends'!K27/100)*('Agg Blends'!$N$17/100)*($N$31-$N$46)","v":0}]
[4.75,0,0,0,0,0,0,0,0,0,0,null,null,null,null,null,null,null,{"$error":"#DIV/0!"},{"$f":"('Agg Blends'!D28/100)*('Agg Blends'!$N$9/100)*($N$31-$N$46)","v":0},{"$f":"('Agg Blends'!E28/100)*('Agg Blends'!$N$10/100)*($N$31-$N$46)","v":0},{"$f":"('Agg Blends'!F28/100)*('Agg Blends'!$N$11/100)*($N$31-$N$46)","v":0},{"$f":"('Agg Blends'!G28/100)*('Agg Blends'!$N$12/100)*($N$31-$N$46)","v":0},{"$f":"('Agg Blends'!H28/100)*('Agg Blends'!$N$13/100)*($N$31-$N$46)","v":0},{"$f":"('Agg Blends'!I28/100)*('Agg Blends'!$N$14/100)*($N$31-$N$46)","v":0},{"$f":"('Agg Blends'!J28/100)*('Agg Blends'!$N$16/100)*($N$31-$N$46)","v":0},{"$f":"('Agg Blends'!K28/100)*('Agg Blends'!$N$17/100)*($N$31-$N$46)","v":0}]
[2.36,0,0,0,0,0,0,0,0,0,0,null,null,null,null,null,null,null,{"$error":"#DIV/0!"},{"$f":"('Agg Blends'!D29/100)*('Agg Blends'!$N$9/100)*($N$31-$N$46)","v":0},{"$f":"('Agg Blends'!E29/100)*('Agg Blends'!$N$10/100)*($N$31-$N$46)","v":0},{"$f":"('Agg Blends'!F29/100)*('Agg Blends'!$N$11/100)*($N$31-$N$46)","v":0},{"$f":"('Agg Blends'!G29/100)*('Agg Blends'!$N$12/100)*($N$31-$N$46)","v":0},{"$f":"('Agg Blends'!H29/100)*('Agg Blends'!$N$13/100)*($N$31-$N$46)","v":0},{"$f":"('Agg Blends'!I29/100)*('Agg Blends'!$N$14/100)*($N$31-$N$46)","v":0},{"$f":"('Agg Blends'!J29/100)*('Agg Blends'!$N$16/100)*($N$31-$N$46)","v":0},{"$f":"('Agg Blends'!K29/100)*('Agg Blends'!$N$17/100)*($N$31-$N$46)","v":0}]
[1.18,0,0,0,0,0,0,0,0,0,0,null,null,null,null,null,null,null,{"$error":"#DIV/0!"},{"$f":"('Agg Blends'!D30/100)*('Agg Blends'!$N$9/100)*($N$31-$N$46)","v":0},{"$f":"('Agg Blends'!E30/100)*('Agg Blends'!$N$10/100)*($N$31-$N$46)","v":0},{"$f":"('Agg Blends'!F30/100)*('Agg Blends'!$N$11/100)*($N$31-$N$46)","v":0},{"$f":"('Agg Blends'!G30/100)*('Agg Blends'!$N$12/100)*($N$31-$N$46)","v":0},{"$f":"('Agg Blends'!H30/100)*('Agg Blends'!$N$13/100)*($N$31-$N$46)","v":0},{"$f":"('Agg Blends'!I30/100)*('Agg Blends'!$N$14/100)*($N$31-$N$46)","v":0},{"$f":"('Agg Blends'!J30/100)*('Agg Blends'!$N$16/100)*($N$31-$N$46)","v":0},{"$f":"('Agg Blends'!K30/100)*('Agg Blends'!$N$17/100)*($N$31-$N$46)","v":0}]
[0.6,0,0,0,0,0,0,0,0,0,0,null,null,null,null,null,null,null,{"$error":"#DIV/0!"},{"$f":"('Agg Blends'!D31/100)*('Agg Blends'!$N$9/100)*($N$31-$N$46)","v":0},{"$f":"('Agg Blends'!E31/100)*('Agg Blends'!$N$10/100)*($N$31-$N$46)","v":0},{"$f":"('Agg Blends'!F31/100)*('Agg Blends'!$N$11/100)*($N$31-$N$46)","v":0},{"$f":"('Agg Blends'!G31/100)*('Agg Blends'!$N$12/100)*($N$31-$N$46)","v":0},{"$f":"('Agg Blends'!H31/100)*('Agg Blends'!$N$13/100)*($N$31-$N$46)","v":0},{"$f":"('Agg Blends'!I31/100)*('Agg Blends'!$N$14/100)*($N$31-$N$46)","v":0},{"$f":"('Agg Blends'!J31/100)*('Agg Blends'!$N$16/100)*($N$31-$N$46)","v":0},{"$f":"('Agg Blends'!K31/100)*('Agg Blends'!$N$17/100)*($N$31-$N$46)","v":0}]
[0.3,0,0,0,0,0,0,0,0,0,0,null,null,null,null,null,null,null,{"$error":"#DIV/0!"},{"$f":"('Agg Blends'!D32/100)*('Agg Blends'!$N$9/100)*($N$31-$N$46)","v":0},{"$f":"('Agg Blends'!E32/100)*('Agg Blends'!$N$10/100)*($N$31-$N$46)","v":0},{"$f":"('Agg Blends'!F32/100)*('Agg Blends'!$N$11/100)*($N$31-$N$46)","v":0},{"$f":"('Agg Blends'!G32/100)*('Agg Blends'!$N$12/100)*($N$31-$N$46)","v":0},{"$f":"('Agg Blends'!H32/100)*('Agg Blends'!$N$13/100)*($N$31-$N$46)","v":0},{"$f":"('Agg Blends'!I32/100)*('Agg Blends'!$N$14/100)*($N$31-$N$46)","v":0},{"$f":"('Agg Blends'!J32/100)*('Agg Blends'!$N$16/100)*($N$31-$N$46)","v":0},{"$f":"('Agg Blends'!K32/100)*('Agg Blends'!$N$17/100)*($N$31-$N$46)","v":0}]
[0.15,{"$f":"C45-C46","v":0},0,0,0,0,0,0,0,0,0,"Baghouse #200",null,null,null,null,null,null,{"$error":"#DIV/0!"},{"$f":"('Agg Blends'!D33/100)*('Agg Blends'!$N$9/100)*($N$31-$N$46)","v":0},{"$f":"('Agg Blends'!E33/100)*('Agg Blends'!$N$10/100)*($N$31-$N$46)","v":0},{"$f":"('Agg Blends'!F33/100)*('Agg Blends'!$N$11/100)*($N$31-$N$46)","v":0},{"$f":"('Agg Blends'!G33/100)*('Agg Blends'!$N$12/100)*($N$31-$N$46)","v":0},{"$f":"('Agg Blends'!H33/100)*('Agg Blends'!$N$13/100)*($N$31-$N$46)","v":0},{"$f":"('Agg Blends'!I33/100)*('Agg Blends'!$N$14/100)*($N$31-$N$46)","v":0},{"$f":"('Agg Blends'!J33/100)*('Agg Blends'!$N$16/100)*($N$31-$N$46)","v":0},{"$f":"('Agg Blends'!K33/100)*('Agg Blends'!$N$17/100)*($N$31-$N$46)","v":0}]
[7.4999999999999997E-2,{"$f":"C46","v":0},0,0,0,0,0,0,0,0,0,{"$f":"('Agg Blends'!L35/100)*($N$31)","v":0},null,null,null,null,null,null,{"$error":"#DIV/0!"},{"$f":"('Agg Blends'!D34/100)*('Agg Blends'!$N$9/100)*($N$31-$N$46)","v":0},{"$f":"('Agg Blends'!E34/100)*('Agg Blends'!$N$10/100)*($N$31-$N$46)","v":0},{"$f":"('Agg Blends'!F34/100)*('Agg Blends'!$N$11/100)*($N$31-$N$46)","v":0},{"$f":"('Agg Blends'!G34/100)*('Agg Blends'!$N$12/100)*($N$31-$N$46)","v":0},{"$f":"('Agg Blends'!H34/100)*('Agg Blends'!$N$13/100)*($N$31-$N$46)","v":0},{"$f":"('Agg Blends'!I34/100)*('Agg Blends'!$N$14/100)*($N$31-$N$46)","v":0},{"$f":"('Agg Blends'!J34/100)*('Agg Blends'!$N$16/100)*($N$31-$N$46)","v":0},{"$f":"('Agg Blends'!K34/100)*('Agg Blends'!$N$17/100)*($N$31-$N$46)","v":0}]