{"text_format":"1","workbook":"xlsx","n_sheets":22,"sheets":["S1","S2","S3","S4","S5","S6","S7","S8","S9","S10","S11","S12","Chart 1-24","Chart 25-48","Chart 49-72","Chart 73-96","Chart 97-120","Chart 121-144","S13","S14","Avg","AP"],"not_rendered":{"charts":48,"images":34,"macros":1,"external_links":1,"defined_names":12,"comments":0,"pivot_tables":0},"unopened":[],"bounds":{"document_bytes":16777216,"sheet_cells":100000,"rows_first":2000,"rows_last":500,"rows_between":2000,"halvings":0,"cell_chars":16384,"cell_head_chars":4096},"cells_cut":0,"cells_raw":0,"read":"whole","date_system":"1900"}

{"sheet":"S1","index":0,"n_rows":40,"n_cols":20,"rows_kept":40,"cut":false,"hidden":false,"merged":[[29,8,29,9],[29,10,29,11],[29,12,29,13],[6,3,6,8],[20,0,20,1],[20,2,20,3],[20,4,20,5],[20,6,20,7],[11,2,11,3],[11,4,11,5],[11,6,11,7],[26,8,26,9],[26,10,26,11],[26,12,26,13],[20,12,20,13],[7,10,7,11],[7,12,7,13],[20,8,20,9],[20,10,20,11],[11,8,11,9],[11,10,11,11],[11,12,11,13],[1,2,1,7],[2,2,2,7],[3,2,3,7],[0,8,3,9],[10,0,10,1],[7,8,7,9],[8,8,8,9],[7,0,7,1],[7,2,7,3],[4,0,4,1],[38,12,38,13],[38,2,38,3],[39,6,41,7],[39,8,41,9],[39,10,41,11],[39,12,41,13],[38,6,38,7],[38,8,38,9],[38,10,38,11],[21,12,23,13],[2,10,2,11],[2,12,2,13],[21,0,23,1],[21,2,23,3],[21,4,23,5],[21,6,23,7],[9,0,9,1],[5,3,5,8],[8,0,8,1],[8,2,8,3],[8,4,8,5],[8,6,8,7],[11,0,11,1],[7,4,7,5],[7,6,7,7],[25,4,25,5],[25,6,25,7],[8,10,8,11],[8,12,8,13],[0,0,3,1],[1,10,1,11],[1,12,1,13],[25,8,25,9],[25,10,25,11],[25,0,25,1],[25,2,25,3],[25,12,25,13],[3,10,3,11],[3,12,3,13],[21,8,23,9],[21,10,23,11],[39,0,41,1],[39,2,41,3],[39,4,41,5],[38,4,38,5],[38,0,38,1],[26,4,26,5],[26,0,26,1],[26,6,26,7],[29,0,29,1],[28,0,28,1],[27,0,27,1],[26,2,26,3],[29,2,29,3],[29,4,29,5],[29,6,29,7]]}
[]
[null,null,"COMMONWEALTH OF PENNSYLVANIA",null,null,null,null,null,null,null,"DISTRICT"]
[null,null,"DEPARTMENT OF TRANSPORTATION",null,null,null,null,null,null,null,"PLANT CODE",null,null,null,null,null,null,null,null,"B1"]
[null,null,"PENNSYLVANIA TURNPIKE COMMISSION",null,null,null,null,null,null,null,"AGG SIZE",null,"B3",null,null,null,null,null,null,"B2"]
["Aggregate 2023",null,null,null,null,null,null,null,null,null,null,null,null,null,null,null,null,null,null,"B3"]
[null,null,null,"Material Test Results for Type B Fine Aggregate"]
[null,null,null,"Washed Gradation"]
["Sample No."]
["Date"]
["St Wt Before Wash",null,null,"% Loss",null,"% Loss",null,"% Loss",null,"% Loss",null,"% Loss",null,"% Loss"]
["Dry Wt After Wash",null,null,{"$f":"IF(ISBLANK(C10),\" \",IF(ISBLANK(C13),\" \",(C11-C13)/C11*100))","v":" "},null,{"$f":"IF(ISBLANK(E10),\" \",IF(ISBLANK(E13),\" \",(E11-E13)/E11*100))","v":" "},null,{"$f":"IF(ISBLANK(G10),\" \",IF(ISBLANK(G13),\" \",(G11-G13)/G11*100))","v":" "},null,{"$f":"IF(ISBLANK(I10),\" \",IF(ISBLANK(I13),\" \",(I11-I13)/I11*100))","v":" "},null,{"$f":"IF(ISBLANK(K10),\" \",IF(ISBLANK(K13),\" \",(K11-K13)/K11*100))","v":" "},null,{"$f":"IF(ISBLANK(M10),\" \",IF(ISBLANK(M13),\" \",(M11-M13)/M11*100))","v":" "}]
["Wt. Loss",null,{"$f":"IF(ISBLANK(C10),\" \",IF(ISBLANK(C11),\" \",C10-C11))","v":" "},null,{"$f":"IF(ISBLANK(E10),\" \",IF(ISBLANK(E11),\" \",E10-E11))","v":" "},null,{"$f":"IF(ISBLANK(G10),\" \",IF(ISBLANK(G11),\" \",G10-G11))","v":" "},null,{"$f":"IF(ISBLANK(I10),\" \",IF(ISBLANK(I11),\" \",I10-I11))","v":" "},null,{"$f":"IF(ISBLANK(K10),\" \",IF(ISBLANK(K11),\" \",K10-K11))","v":" "},null,{"$f":"IF(ISBLANK(M10),\" \",IF(ISBLANK(M11),\" \",M10-M11))","v":" "}]
[100,0.375,null,{"$f":"IF(ISBLANK(C$10),\"  \",IF(ISBLANK(C$11),\" \",IF(ISBLANK(C13),\" \",ROUND((C13+C$12)/C$10*100,1))))","v":"  "},null,{"$f":"IF(ISBLANK(E$10),\"  \",IF(ISBLANK(E$11),\" \",IF(ISBLANK(E13),\" \",ROUND((E13+E$12)/E$10*100,1))))","v":"  "},null,{"$f":"IF(ISBLANK(G$10),\"  \",IF(ISBLANK(G$11),\" \",IF(ISBLANK(G13),\" \",ROUND((G13+G$12)/G$10*100,1))))","v":"  "},null,{"$f":"IF(ISBLANK(I$10),\"  \",IF(ISBLANK(I$11),\" \",IF(ISBLANK(I13),\" \",ROUND((I13+I$12)/I$10*100,1))))","v":"  "},null,{"$f":"IF(ISBLANK(K$10),\"  \",IF(ISBLANK(K$11),\" \",IF(ISBLANK(K13),\" \",ROUND((K13+K$12)/K$10*100,1))))","v":"  "},null,{"$f":"IF(ISBLANK(M$10),\"  \",IF(ISBLANK(M$11),\" \",IF(ISBLANK(M13),\" \",ROUND((M13+M$12)/M$10*100,1))))","v":"  "}]
[{"$f":"IF($M$4=\"B1\",\"95-100\",IF($M$4=\"B2\",\"100\",IF($M$4=\"B3\",\"80-100\",IF($M$4,\" \",\"95-100\"))))","v":"80-100"},4,null,{"$f":"IF(ISBLANK(C$10),\"  \",IF(ISBLANK(C$11),\" \",IF(ISBLANK(C14),\" \",ROUND((C14+C$12)/C$10*100,0))))","v":"  "},null,{"$f":"IF(ISBLANK(E$10),\"  \",IF(ISBLANK(E$11),\" \",IF(ISBLANK(E14),\" \",ROUND((E14+E$12)/E$10*100,0))))","v":"  "},null,{"$f":"IF(ISBLANK(G$10),\"  \",IF(ISBLANK(G$11),\" \",IF(ISBLANK(G14),\" \",ROUND((G14+G$12)/G$10*100,0))))","v":"  "},null,{"$f":"IF(ISBLANK(I$10),\"  \",IF(ISBLANK(I$11),\" \",IF(ISBLANK(I14),\" \",ROUND((I14+I$12)/I$10*100,0))))","v":"  "},".",{"$f":"IF(ISBLANK(K$10),\"  \",IF(ISBLANK(K$11),\" \",IF(ISBLANK(K14),\" \",ROUND((K14+K$12)/K$10*100,0))))","v":"  "},null,{"$f":"IF(ISBLANK(M$10),\"  \",IF(ISBLANK(M$11),\" \",IF(ISBLANK(M14),\" \",ROUND((M14+M$12)/M$10*100,0))))","v":"  "}]
[{"$f":"IF($M$4=\"B1\",\"70-100\",IF($M$4=\"B2\",\"95-100\",IF($M$4=\"B3\",\"65-100\",IF($M$4,\" \",\"70-100\"))))","v":"65-100"},8,null,"  ",null,"  ",null,"  ",null,"  ",null,"  ",null,"  "]
[{"$f":"IF($M$4=\"B1\",\"40-80\",IF($M$4=\"B2\",\"85-100\",IF($M$4=\"B3\",\"40-80\",IF($M$4,\" \",\"40-80\"))))","v":"40-80"},16,null,"  ",null,"  ",null,"  ",null,"  ",null,"  ",null,"  "]
[{"$f":"IF($M$4=\"B1\",\"20-65\",IF($M$4=\"B2\",\"65-90\",IF($M$4=\"B3\",\"20-65\",IF($M$4,\" \",\"25-65\"))))","v":"20-65"},30,null,"  ",null,"  ",null,"  ",null,"  ",null,"  ",null,"  "]
[{"$f":"IF($M$4=\"B1\",\"7-40\",IF($M$4=\"B2\",\"30-60\",IF($M$4=\"B3\",\"7-40\",IF($M$4,\" \",\"7-40\"))))","v":"7-40"},50,null,"  ",null,"  ",null,"  ",null,"  ",null,"  ",null,"  "]
[{"$f":"IF($M$4=\"B1\",\"2-20\",IF($M$4=\"B2\",\"5-25\",IF($M$4=\"B3\",\"2-20\",IF($M$4,\" \",\"2-20\"))))","v":"2-20"},100,null,"  ",null,"  ",null,"  ",null,"  ",null,"  ",null,"  "]
[{"$f":"IF($M$4=\"B1\",\"0-10\",IF($M$4=\"B2\",\"0-5\",IF($M$4=\"B3\",\"0-10\",IF($M$4,\" \",\"0-10\"))))","v":"0-10"},200,null,{"$f":"IF(ISBLANK(C$10),\"  \",IF(ISBLANK(C$11),\" \",IF(ISBLANK(C20),\" \",ROUND((C20+C$12)/C$10*100,2))))","v":"  "},null,{"$f":"IF(ISBLANK(E$10),\"  \",IF(ISBLANK(E$11),\" \",IF(ISBLANK(E20),\" \",ROUND((E20+E$12)/E$10*100,2))))","v":"  "},null,{"$f":"IF(ISBLANK(G$10),\"  \",IF(ISBLANK(G$11),\" \",IF(ISBLANK(G20),\" \",ROUND((G20+G$12)/G$10*100,2))))","v":"  "},null,{"$f":"IF(ISBLANK(I$10),\"  \",IF(ISBLANK(I$11),\" \",IF(ISBLANK(I20),\" \",ROUND((I20+I$12)/I$10*100,2))))","v":"  "},null,{"$f":"IF(ISBLANK(K$10),\"  \",IF(ISBLANK(K$11),\" \",IF(ISBLANK(K20),\" \",ROUND((K20+K$12)/K$10*100,2))))","v":"  "},null,{"$f":"IF(ISBLANK(M$10),\"  \",IF(ISBLANK(M$11),\" \",IF(ISBLANK(M20),\" \",ROUND((M20+M$12)/M$10*100,2))))","v":"  "}]
["Tested By"]
["Remarks"]
[]
[]
[]
["Sample No."]
["Date"]
["St Wt Before Wash",null,null,"% Loss",null,"% Loss",null,"% Loss",null,"% Loss",null,"% Loss",null,"% Loss"]
["Dry Wt After Wash",null,null,{"$f":"IF(ISBLANK(C28),\" \",IF(ISBLANK(C31),\" \",(C29-C31)/C29*100))","v":" "},null,{"$f":"IF(ISBLANK(E28),\" \",IF(ISBLANK(E31),\" \",(E29-E31)/E29*100))","v":" "},null,{"$f":"IF(ISBLANK(G28),\" \",IF(ISBLANK(G31),\" \",(G29-G31)/G29*100))","v":" "},null,{"$f":"IF(ISBLANK(I28),\" \",IF(ISBLANK(I31),\" \",(I29-I31)/I29*100))","v":" "},null,{"$f":"IF(ISBLANK(K28),\" \",IF(ISBLANK(K31),\" \",(K29-K31)/K29*100))","v":" "},null,{"$f":"IF(ISBLANK(M28),\" \",IF(ISBLANK(M31),\" \",(M29-M31)/M29*100))","v":" "}]
["Wt. Loss",null,{"$f":"IF(ISBLANK(C28),\" \",IF(ISBLANK(C29),\" \",C28-C29))","v":" "},null,{"$f":"IF(ISBLANK(E28),\" \",IF(ISBLANK(E29),\" \",E28-E29))","v":" "},null,{"$f":"IF(ISBLANK(G28),\" \",IF(ISBLANK(G29),\" \",G28-G29))","v":" "},null,{"$f":"IF(ISBLANK(I28),\" \",IF(ISBLANK(I29),\" \",I28-I29))","v":" "},null,{"$f":"IF(ISBLANK(K28),\" \",IF(ISBLANK(K29),\" \",K28-K29))","v":" "},null,{"$f":"IF(ISBLANK(M28),\" \",IF(ISBLANK(M29),\" \",M28-M29))","v":" "}]
[100,0.375,null,{"$f":"IF(ISBLANK(C$28),\"  \",IF(ISBLANK(C$29),\" \",IF(ISBLANK(C31),\" \",ROUND((C31+C$30)/C$28*100,1))))","v":"  "},null,{"$f":"IF(ISBLANK(E$28),\"  \",IF(ISBLANK(E$29),\" \",IF(ISBLANK(E31),\" \",ROUND((E31+E$30)/E$28*100,1))))","v":"  "},null,{"$f":"IF(ISBLANK(G$28),\"  \",IF(ISBLANK(G$29),\" \",IF(ISBLANK(G31),\" \",ROUND((G31+G$30)/G$28*100,1))))","v":"  "},null,{"$f":"IF(ISBLANK(I$28),\"  \",IF(ISBLANK(I$29),\" \",IF(ISBLANK(I31),\" \",ROUND((I31+I$30)/I$28*100,1))))","v":"  "},null,{"$f":"IF(ISBLANK(K$28),\"  \",IF(ISBLANK(K$29),\" \",IF(ISBLANK(K31),\" \",ROUND((K31+K$30)/K$28*100,1))))","v":"  "},null,{"$f":"IF(ISBLANK(M$28),\"  \",IF(ISBLANK(M$29),\" \",IF(ISBLANK(M31),\" \",ROUND((M31+M$30)/M$28*100,1))))","v":"  "}]
[{"$f":"IF($M$4=\"B1\",\"95-100\",IF($M$4=\"B2\",\"100\",IF($M$4=\"B3\",\"80-100\",IF($M$4,\" \",\"95-100\"))))","v":"80-100"},4,null,{"$f":"IF(ISBLANK(C$28),\"  \",IF(ISBLANK(C$29),\" \",IF(ISBLANK(C32),\" \",ROUND((C32+C$30)/C$28*100,0))))","v":"  "},null,{"$f":"IF(ISBLANK(E$28),\"  \",IF(ISBLANK(E$29),\" \",IF(ISBLANK(E32),\" \",ROUND((E32+E$30)/E$28*100,0))))","v":"  "},null,{"$f":"IF(ISBLANK(G$28),\"  \",IF(ISBLANK(G$29),\" \",IF(ISBLANK(G32),\" \",ROUND((G32+G$30)/G$28*100,0))))","v":"  "},null,{"$f":"IF(ISBLANK(I$28),\"  \",IF(ISBLANK(I$29),\" \",IF(ISBLANK(I32),\" \",ROUND((I32+I$30)/I$28*100,0))))","v":"  "},null,{"$f":"IF(ISBLANK(K$28),\"  \",IF(ISBLANK(K$29),\" \",IF(ISBLANK(K32),\" \",ROUND((K32+K$30)/K$28*100,0))))","v":"  "},null,{"$f":"IF(ISBLANK(M$28),\"  \",IF(ISBLANK(M$29),\" \",IF(ISBLANK(M32),\" \",ROUND((M32+M$30)/M$28*100,0))))","v":"  "}]
[{"$f":"IF($M$4=\"B1\",\"70-100\",IF($M$4=\"B2\",\"95-100\",IF($M$4=\"B3\",\"65-100\",IF($M$4,\" \",\"70-100\"))))","v":"65-100"},8,null,"  ",null,"  ",null,"  ",null,"  ",null,"  ",null,"  "]
[{"$f":"IF($M$4=\"B1\",\"40-80\",IF($M$4=\"B2\",\"85-100\",IF($M$4=\"B3\",\"40-80\",IF($M$4,\" \",\"40-80\"))))","v":"40-80"},16,null,"  ",null,"  ",null,"  ",null,"  ",null,"  ",null,"  "]
[{"$f":"IF($M$4=\"B1\",\"20-65\",IF($M$4=\"B2\",\"65-90\",IF($M$4=\"B3\",\"20-65\",IF($M$4,\" \",\"25-65\"))))","v":"20-65"},30,null,"  ",null,"  ",null,"  ",null,"  ",null,"  ",null,"  "]
[{"$f":"IF($M$4=\"B1\",\"7-40\",IF($M$4=\"B2\",\"30-60\",IF($M$4=\"B3\",\"7-40\",IF($M$4,\" \",\"7-40\"))))","v":"7-40"},50,null,"  ",null,"  ",null,"  ",null,"  ",null,"  ",null,"  "]
[{"$f":"IF($M$4=\"B1\",\"2-20\",IF($M$4=\"B2\",\"5-25\",IF($M$4=\"B3\",\"2-20\",IF($M$4,\" \",\"2-20\"))))","v":"2-20"},100,null,"  ",null,"  ",null,"  ",null,"  ",null,"  ",null,"  "]
[{"$f":"IF($M$4=\"B1\",\"0-10\",IF($M$4=\"B2\",\"0-5\",IF($M$4=\"B3\",\"0-10\",IF($M$4,\" \",\"0-10\"))))","v":"0-10"},200,null,{"$f":"IF(ISBLANK(C$28),\"  \",IF(ISBLANK(C$29),\" \",IF(ISBLANK(C38),\" \",ROUND((C38+C$30)/C$28*100,2))))","v":"  "},null,{"$f":"IF(ISBLANK(E$28),\"  \",IF(ISBLANK(E$29),\" \",IF(ISBLANK(E38),\" \",ROUND((E38+E$30)/E$28*100,2))))","v":"  "},null,{"$f":"IF(ISBLANK(G$28),\"  \",IF(ISBLANK(G$29),\" \",IF(ISBLANK(G38),\" \",ROUND((G38+G$30)/G$28*100,2))))","v":"  "},null,{"$f":"IF(ISBLANK(I$28),\"  \",IF(ISBLANK(I$29),\" \",IF(ISBLANK(I38),\" \",ROUND((I38+I$30)/I$28*100,2))))","v":"  "},null,{"$f":"IF(ISBLANK(K$28),\"  \",IF(ISBLANK(K$29),\" \",IF(ISBLANK(K38),\" \",ROUND((K38+K$30)/K$28*100,2))))","v":"  "},null,{"$f":"IF(ISBLANK(M$28),\"  \",IF(ISBLANK(M$29),\" \",IF(ISBLANK(M38),\" \",ROUND((M38+M$30)/M$28*100,2))))","v":"  "}]
["Tested By"]
["Remarks"]

{"sheet":"S2","index":1,"n_rows":40,"n_cols":14,"rows_kept":40,"cut":false,"hidden":true,"merged":[[11,6,11,7],[11,8,11,9],[11,10,11,11],[11,12,11,13],[29,2,29,3],[29,4,29,5],[29,6,29,7],[29,8,29,9],[29,10,29,11],[29,12,29,13],[1,12,1,13],[2,10,2,11],[2,12,2,13],[3,10,3,11],[3,12,3,13],[8,4,8,5],[8,10,8,11],[3,2,3,7],[7,0,7,1],[7,2,7,3],[7,4,7,5],[7,6,7,7],[0,0,3,1],[4,0,4,1],[5,3,5,8],[0,8,3,9],[1,2,1,7],[2,2,2,7],[6,3,6,8],[7,8,7,9],[1,10,1,11],[7,10,7,11],[7,12,7,13],[38,0,38,1],[38,2,38,3],[38,4,38,5],[20,2,20,3],[25,2,25,3],[38,8,38,9],[38,10,38,11],[38,12,38,13],[8,12,8,13],[8,6,8,7],[8,8,8,9],[9,0,9,1],[8,0,8,1],[8,2,8,3],[39,0,41,1],[10,0,10,1],[29,0,29,1],[28,0,28,1],[11,0,11,1],[25,0,25,1],[27,0,27,1],[21,0,23,1],[20,0,20,1],[26,0,26,1],[39,2,41,3],[39,4,41,5],[11,2,11,3],[11,4,11,5],[38,6,38,7],[39,6,41,7],[21,2,23,3],[21,4,23,5],[21,6,23,7],[20,4,20,5],[20,6,20,7],[26,2,26,3],[26,4,26,5],[26,6,26,7],[25,4,25,5],[25,6,25,7],[39,8,41,9],[39,10,41,11],[39,12,41,13],[20,10,20,11],[20,12,20,13],[21,8,23,9],[21,10,23,11],[21,12,23,13],[20,8,20,9],[25,10,25,11],[25,12,25,13],[26,8,26,9],[26,10,26,11],[26,12,26,13],[25,8,25,9]]}
[]
[null,null,"COMMONWEALTH OF PENNSYLVANIA",null,null,null,null,null,null,null,"DISTRICT",null,{"$f":"IF(ISBLANK('S1'!M2),\" \",'S1'!M2)","v":" "}]
[null,null,"DEPARTMENT OF TRANSPORTATION",null,null,null,null,null,null,null,"PLANT CODE",null,{"$f":"IF(ISBLANK('S1'!M3),\" \",'S1'!M3)","v":" "}]
[null,null,"PENNSYLVANIA TURNPIKE COMMISSION",null,null,null,null,null,null,null,"AGG SIZE",null,{"$f":"IF(ISBLANK('S1'!M4),\" \",'S1'!M4)","v":"B3"}]
[{"$f":"'S1'!A5","v":"Aggregate 2023"}]
[null,null,null,"Material Test Results for Type A Fine Aggregate"]
[null,null,null,"Washed Gradation"]
["Sample No."]
["Date"]
["St Wt Before Wash",null,null,"% Loss",null,"% Loss",null,"% Loss",null,"% Loss",null,"% Loss",null,"% Loss"]
["Dry Wt After Wash",null,null,{"$f":"IF(ISBLANK(C10),\" \",IF(ISBLANK(C13),\" \",(C11-C13)/C11*100))","v":" "},null,{"$f":"IF(ISBLANK(E10),\" \",IF(ISBLANK(E13),\" \",(E11-E13)/E11*100))","v":" "},null,{"$f":"IF(ISBLANK(G10),\" \",IF(ISBLANK(G13),\" \",(G11-G13)/G11*100))","v":" "},null,{"$f":"IF(ISBLANK(I10),\" \",IF(ISBLANK(I13),\" \",(I11-I13)/I11*100))","v":" "},null,{"$f":"IF(ISBLANK(K10),\" \",IF(ISBLANK(K13),\" \",(K11-K13)/K11*100))","v":" "},null,{"$f":"IF(ISBLANK(M10),\" \",IF(ISBLANK(M13),\" \",(M11-M13)/M11*100))","v":" "}]
["Wt. Loss",null,{"$f":"IF(ISBLANK(C10),\" \",IF(ISBLANK(C11),\" \",C10-C11))","v":" "},null,{"$f":"IF(ISBLANK(E10),\" \",IF(ISBLANK(E11),\" \",E10-E11))","v":" "},null,{"$f":"IF(ISBLANK(G10),\" \",IF(ISBLANK(G11),\" \",G10-G11))","v":" "},null,{"$f":"IF(ISBLANK(I10),\" \",IF(ISBLANK(I11),\" \",I10-I11))","v":" "},null,{"$f":"IF(ISBLANK(K10),\" \",IF(ISBLANK(K11),\" \",K10-K11))","v":" "},null,{"$f":"IF(ISBLANK(M10),\" \",IF(ISBLANK(M11),\" \",M10-M11))","v":" "}]
[100,0.375,null,{"$f":"IF(ISBLANK(C$10),\"  \",IF(ISBLANK(C$11),\" \",IF(ISBLANK(C13),\" \",ROUND((C13+C$12)/C$10*100,1))))","v":"  "},null,{"$f":"IF(ISBLANK(E$10),\"  \",IF(ISBLANK(E$11),\" \",IF(ISBLANK(E13),\" \",ROUND((E13+E$12)/E$10*100,1))))","v":"  "},null,{"$f":"IF(ISBLANK(G$10),\"  \",IF(ISBLANK(G$11),\" \",IF(ISBLANK(G13),\" \",ROUND((G13+G$12)/G$10*100,1))))","v":"  "},null,{"$f":"IF(ISBLANK(I$10),\"  \",IF(ISBLANK(I$11),\" \",IF(ISBLANK(I13),\" \",ROUND((I13+I$12)/I$10*100,1))))","v":"  "},null,{"$f":"IF(ISBLANK(K$10),\"  \",IF(ISBLANK(K$11),\" \",IF(ISBLANK(K13),\" \",ROUND((K13+K$12)/K$10*100,1))))","v":"  "},null,{"$f":"IF(ISBLANK(M$10),\"  \",IF(ISBLANK(M$11),\" \",IF(ISBLANK(M13),\" \",ROUND((M13+M$12)/M$10*100,1))))","v":"  "}]
[{"$f":"IF($M$4=\"B1\",\"95-100\",IF($M$4=\"B2\",\"100\",IF($M$4=\"B3\",\"80-100\",IF($M$4,\" \",\"95-100\"))))","v":"80-100"},4,null,{"$f":"IF(ISBLANK(C$10),\"  \",IF(ISBLANK(C$11),\" \",IF(ISBLANK(C14),\" \",ROUND((C14+C$12)/C$10*100,0))))","v":"  "},null,{"$f":"IF(ISBLANK(E$10),\"  \",IF(ISBLANK(E$11),\" \",IF(ISBLANK(E14),\" \",ROUND((E14+E$12)/E$10*100,0))))","v":"  "},null,{"$f":"IF(ISBLANK(G$10),\"  \",IF(ISBLANK(G$11),\" \",IF(ISBLANK(G14),\" \",ROUND((G14+G$12)/G$10*100,0))))","v":"  "},null,{"$f":"IF(ISBLANK(I$10),\"  \",IF(ISBLANK(I$11),\" \",IF(ISBLANK(I14),\" \",ROUND((I14+I$12)/I$10*100,0))))","v":"  "},null,{"$f":"IF(ISBLANK(K$10),\"  \",IF(ISBLANK(K$11),\" \",IF(ISBLANK(K14),\" \",ROUND((K14+K$12)/K$10*100,0))))","v":"  "},null,{"$f":"IF(ISBLANK(M$10),\"  \",IF(ISBLANK(M$11),\" \",IF(ISBLANK(M14),\" \",ROUND((M14+M$12)/M$10*100,0))))","v":"  "}]
[{"$f":"IF($M$4=\"B1\",\"70-100\",IF($M$4=\"B2\",\"95-100\",IF($M$4=\"B3\",\"65-100\",IF($M$4,\" \",\"70-100\"))))","v":"65-100"},8,null,"  ",null,"  ",null,"  ",null,"  ",null,"  ",null,"  "]
[{"$f":"IF($M$4=\"B1\",\"40-80\",IF($M$4=\"B2\",\"85-100\",IF($M$4=\"B3\",\"40-80\",IF($M$4,\" \",\"40-80\"))))","v":"40-80"},16,null,"  ",null,"  ",null,"  ",null,"  ",null,"  ",null,"  "]
[{"$f":"IF($M$4=\"B1\",\"20-65\",IF($M$4=\"B2\",\"65-90\",IF($M$4=\"B3\",\"20-65\",IF($M$4,\" \",\"25-65\"))))","v":"20-65"},30,null,"  ",null,"  ",null,"  ",null,"  ",null,"  ",null,"  "]
[{"$f":"IF($M$4=\"B1\",\"7-40\",IF($M$4=\"B2\",\"30-60\",IF($M$4=\"B3\",\"7-40\",IF($M$4,\" \",\"7-40\"))))","v":"7-40"},50,null,"  ",null,"  ",null,"  ",null,"  ",null,"  ",null,"  "]
[{"$f":"IF($M$4=\"B1\",\"2-20\",IF($M$4=\"B2\",\"5-25\",IF($M$4=\"B3\",\"2-20\",IF($M$4,\" \",\"2-20\"))))","v":"2-20"},100,null,"  ",null,"  ",null,"  ",null,"  ",null,"  ",null,"  "]
[{"$f":"IF($M$4=\"B1\",\"0-10\",IF($M$4=\"B2\",\"0-5\",IF($M$4=\"B3\",\"0-10\",IF($M$4,\" \",\"0-10\"))))","v":"0-10"},200,null,{"$f":"IF(ISBLANK(C$10),\"  \",IF(ISBLANK(C$11),\" \",IF(ISBLANK(C20),\" \",ROUND((C20+C$12)/C$10*100,2))))","v":"  "},null,{"$f":"IF(ISBLANK(E$10),\"  \",IF(ISBLANK(E$11),\" \",IF(ISBLANK(E20),\" \",ROUND((E20+E$12)/E$10*100,2))))","v":"  "},null,{"$f":"IF(ISBLANK(G$10),\"  \",IF(ISBLANK(G$11),\" \",IF(ISBLANK(G20),\" \",ROUND((G20+G$12)/G$10*100,2))))","v":"  "},null,{"$f":"IF(ISBLANK(I$10),\"  \",IF(ISBLANK(I$11),\" \",IF(ISBLANK(I20),\" \",ROUND((I20+I$12)/I$10*100,2))))","v":"  "},null,{"$f":"IF(ISBLANK(K$10),\"  \",IF(ISBLANK(K$11),\" \",IF(ISBLANK(K20),\" \",ROUND((K20+K$12)/K$10*100,2))))","v":"  "},null,{"$f":"IF(ISBLANK(M$10),\"  \",IF(ISBLANK(M$11),\" \",IF(ISBLANK(M20),\" \",ROUND((M20+M$12)/M$10*100,2))))","v":"  "}]
["Tested By"]
["Remarks"]
[]
[]
[]
["Sample No."]
["Date"]
["St Wt Before Wash",null,null,"% Loss",null,"% Loss",null,"% Loss",null,"% Loss",null,"% Loss",null,"% Loss"]
["Dry Wt After Wash",null,null,{"$f":"IF(ISBLANK(C28),\" \",IF(ISBLANK(C31),\" \",(C29-C31)/C29*100))","v":" "},null,{"$f":"IF(ISBLANK(E28),\" \",IF(ISBLANK(E31),\" \",(E29-E31)/E29*100))","v":" "},null,{"$f":"IF(ISBLANK(G28),\" \",IF(ISBLANK(G31),\" \",(G29-G31)/G29*100))","v":" "},null,{"$f":"IF(ISBLANK(I28),\" \",IF(ISBLANK(I31),\" \",(I29-I31)/I29*100))","v":" "},null,{"$f":"IF(ISBLANK(K28),\" \",IF(ISBLANK(K31),\" \",(K29-K31)/K29*100))","v":" "},null,{"$f":"IF(ISBLANK(M28),\" \",IF(ISBLANK(M31),\" \",(M29-M31)/M29*100))","v":" "}]
["Wt. Loss",null,{"$f":"IF(ISBLANK(C28),\" \",IF(ISBLANK(C29),\" \",C28-C29))","v":" "},null,{"$f":"IF(ISBLANK(E28),\" \",IF(ISBLANK(E29),\" \",E28-E29))","v":" "},null,{"$f":"IF(ISBLANK(G28),\" \",IF(ISBLANK(G29),\" \",G28-G29))","v":" "},null,{"$f":"IF(ISBLANK(I28),\" \",IF(ISBLANK(I29),\" \",I28-I29))","v":" "},null,{"$f":"IF(ISBLANK(K28),\" \",IF(ISBLANK(K29),\" \",K28-K29))","v":" "},null,{"$f":"IF(ISBLANK(M28),\" \",IF(ISBLANK(M29),\" \",M28-M29))","v":" "}]
[100,0.375,null,{"$f":"IF(ISBLANK(C$28),\"  \",IF(ISBLANK(C$29),\" \",IF(ISBLANK(C31),\" \",ROUND((C31+C$30)/C$28*100,1))))","v":"  "},null,{"$f":"IF(ISBLANK(E$28),\"  \",IF(ISBLANK(E$29),\" \",IF(ISBLANK(E31),\" \",ROUND((E31+E$30)/E$28*100,1))))","v":"  "},null,{"$f":"IF(ISBLANK(G$28),\"  \",IF(ISBLANK(G$29),\" \",IF(ISBLANK(G31),\" \",ROUND((G31+G$30)/G$28*100,1))))","v":"  "},null,{"$f":"IF(ISBLANK(I$28),\"  \",IF(ISBLANK(I$29),\" \",IF(ISBLANK(I31),\" \",ROUND((I31+I$30)/I$28*100,1))))","v":"  "},null,{"$f":"IF(ISBLANK(K$28),\"  \",IF(ISBLANK(K$29),\" \",IF(ISBLANK(K31),\" \",ROUND((K31+K$30)/K$28*100,1))))","v":"  "},null,{"$f":"IF(ISBLANK(M$28),\"  \",IF(ISBLANK(M$29),\" \",IF(ISBLANK(M31),\" \",ROUND((M31+M$30)/M$28*100,1))))","v":"  "}]
[{"$f":"IF($M$4=\"B1\",\"95-100\",IF($M$4=\"B2\",\"100\",IF($M$4=\"B3\",\"80-100\",IF($M$4,\" \",\"95-100\"))))","v":"80-100"},4,null,{"$f":"IF(ISBLANK(C$28),\"  \",IF(ISBLANK(C$29),\" \",IF(ISBLANK(C32),\" \",ROUND((C32+C$30)/C$28*100,0))))","v":"  "},null,{"$f":"IF(ISBLANK(E$28),\"  \",IF(ISBLANK(E$29),\" \",IF(ISBLANK(E32),\" \",ROUND((E32+E$30)/E$28*100,0))))","v":"  "},null,{"$f":"IF(ISBLANK(G$28),\"  \",IF(ISBLANK(G$29),\" \",IF(ISBLANK(G32),\" \",ROUND((G32+G$30)/G$28*100,0))))","v":"  "},null,{"$f":"IF(ISBLANK(I$28),\"  \",IF(ISBLANK(I$29),\" \",IF(ISBLANK(I32),\" \",ROUND((I32+I$30)/I$28*100,0))))","v":"  "},null,{"$f":"IF(ISBLANK(K$28),\"  \",IF(ISBLANK(K$29),\" \",IF(ISBLANK(K32),\" \",ROUND((K32+K$30)/K$28*100,0))))","v":"  "},null,{"$f":"IF(ISBLANK(M$28),\"  \",IF(ISBLANK(M$29),\" \",IF(ISBLANK(M32),\" \",ROUND((M32+M$30)/M$28*100,0))))","v":"  "}]
[{"$f":"IF($M$4=\"B1\",\"70-100\",IF($M$4=\"B2\",\"95-100\",IF($M$4=\"B3\",\"65-100\",IF($M$4,\" \",\"70-100\"))))","v":"65-100"},8,null,"  ",null,"  ",null,"  ",null,"  ",null,"  ",null,"  "]
[{"$f":"IF($M$4=\"B1\",\"40-80\",IF($M$4=\"B2\",\"85-100\",IF($M$4=\"B3\",\"40-80\",IF($M$4,\" \",\"40-80\"))))","v":"40-80"},16,null,"  ",null,"  ",null,"  ",null,"  ",null,"  ",null,"  "]
[{"$f":"IF($M$4=\"B1\",\"20-65\",IF($M$4=\"B2\",\"65-90\",IF($M$4=\"B3\",\"20-65\",IF($M$4,\" \",\"25-65\"))))","v":"20-65"},30,null,"  ",null,"  ",null,"  ",null,"  ",null,"  ",null,"  "]
[{"$f":"IF($M$4=\"B1\",\"7-40\",IF($M$4=\"B2\",\"30-60\",IF($M$4=\"B3\",\"7-40\",IF($M$4,\" \",\"7-40\"))))","v":"7-40"},50,null,"  ",null,"  ",null,"  ",null,"  ",null,"  ",null,"  "]
[{"$f":"IF($M$4=\"B1\",\"2-20\",IF($M$4=\"B2\",\"5-25\",IF($M$4=\"B3\",\"2-20\",IF($M$4,\" \",\"2-20\"))))","v":"2-20"},100,null,"  ",null,"  ",null,"  ",null,"  ",null,"  ",null,"  "]
[{"$f":"IF($M$4=\"B1\",\"0-10\",IF($M$4=\"B2\",\"0-5\",IF($M$4=\"B3\",\"0-10\",IF($M$4,\" \",\"0-10\"))))","v":"0-10"},200,null,{"$f":"IF(ISBLANK(C$28),\"  \",IF(ISBLANK(C$29),\" \",IF(ISBLANK(C38),\" \",ROUND((C38+C$30)/C$28*100,2))))","v":"  "},null,{"$f":"IF(ISBLANK(E$28),\"  \",IF(ISBLANK(E$29),\" \",IF(ISBLANK(E38),\" \",ROUND((E38+E$30)/E$28*100,2))))","v":"  "},null,{"$f":"IF(ISBLANK(G$28),\"  \",IF(ISBLANK(G$29),\" \",IF(ISBLANK(G38),\" \",ROUND((G38+G$30)/G$28*100,2))))","v":"  "},null,{"$f":"IF(ISBLANK(I$28),\"  \",IF(ISBLANK(I$29),\" \",IF(ISBLANK(I38),\" \",ROUND((I38+I$30)/I$28*100,2))))","v":"  "},null,{"$f":"IF(ISBLANK(K$28),\"  \",IF(ISBLANK(K$29),\" \",IF(ISBLANK(K38),\" \",ROUND((K38+K$30)/K$28*100,2))))","v":"  "},null,{"$f":"IF(ISBLANK(M$28),\"  \",IF(ISBLANK(M$29),\" \",IF(ISBLANK(M38),\" \",ROUND((M38+M$30)/M$28*100,2))))","v":"  "}]
["Tested By"]
["Remarks"]

{"sheet":"S3","index":2,"n_rows":40,"n_cols":14,"rows_kept":40,"cut":false,"hidden":true,"merged":[[11,6,11,7],[11,8,11,9],[11,10,11,11],[11,12,11,13],[29,2,29,3],[29,4,29,5],[29,6,29,7],[29,8,29,9],[29,10,29,11],[29,12,29,13],[20,10,20,11],[20,12,20,13],[21,6,23,7],[21,8,23,9],[21,10,23,11],[21,12,23,13],[10,0,10,1],[9,0,9,1],[7,10,7,11],[0,0,3,1],[1,10,1,11],[0,8,3,9],[1,2,1,7],[2,2,2,7],[3,2,3,7],[4,0,4,1],[5,3,5,8],[7,8,7,9],[7,2,7,3],[7,4,7,5],[7,6,7,7],[6,3,6,8],[27,0,27,1],[25,0,25,1],[25,2,25,3],[25,4,25,5],[11,0,11,1],[11,2,11,3],[11,4,11,5],[21,0,23,1],[21,2,23,3],[21,4,23,5],[20,0,20,1],[20,2,20,3],[20,4,20,5],[29,0,29,1],[1,12,1,13],[2,10,2,11],[2,12,2,13],[3,10,3,11],[3,12,3,13],[7,12,7,13],[8,0,8,1],[8,2,8,3],[8,4,8,5],[8,6,8,7],[8,8,8,9],[8,10,8,11],[7,0,7,1],[8,12,8,13],[28,0,28,1],[20,6,20,7],[20,8,20,9],[25,12,25,13],[26,0,26,1],[26,2,26,3],[26,4,26,5],[26,6,26,7],[26,8,26,9],[26,10,26,11],[26,12,26,13],[25,6,25,7],[25,8,25,9],[25,10,25,11],[38,10,38,11],[38,12,38,13],[39,0,41,1],[39,2,41,3],[39,4,41,5],[39,6,41,7],[39,8,41,9],[39,10,41,11],[39,12,41,13],[38,0,38,1],[38,2,38,3],[38,4,38,5],[38,6,38,7],[38,8,38,9]]}
[]
[null,null,"COMMONWEALTH OF PENNSYLVANIA",null,null,null,null,null,null,null,"DISTRICT",null,{"$f":"IF(ISBLANK('S1'!M2),\" \",'S1'!M2)","v":" "}]
[null,null,"DEPARTMENT OF TRANSPORTATION",null,null,null,null,null,null,null,"PLANT CODE",null,{"$f":"IF(ISBLANK('S1'!M3),\" \",'S1'!M3)","v":" "}]
[null,null,"PENNSYLVANIA TURNPIKE COMMISSION",null,null,null,null,null,null,null,"AGG SIZE",null,{"$f":"IF(ISBLANK('S1'!M4),\" \",'S1'!M4)","v":"B3"}]
[{"$f":"'S1'!A5","v":"Aggregate 2023"}]
[null,null,null,"Material Test Results for Type A Fine Aggregate"]
[null,null,null,"Washed Gradation"]
["Sample No."]
["Date"]
["St Wt Before Wash",null,null,"% Loss",null,"% Loss",null,"% Loss",null,"% Loss",null,"% Loss",null,"% Loss"]
["Dry Wt After Wash",null,null,{"$f":"IF(ISBLANK(C10),\" \",IF(ISBLANK(C13),\" \",(C11-C13)/C11*100))","v":" "},null,{"$f":"IF(ISBLANK(E10),\" \",IF(ISBLANK(E13),\" \",(E11-E13)/E11*100))","v":" "},null,{"$f":"IF(ISBLANK(G10),\" \",IF(ISBLANK(G13),\" \",(G11-G13)/G11*100))","v":" "},null,{"$f":"IF(ISBLANK(I10),\" \",IF(ISBLANK(I13),\" \",(I11-I13)/I11*100))","v":" "},null,{"$f":"IF(ISBLANK(K10),\" \",IF(ISBLANK(K13),\" \",(K11-K13)/K11*100))","v":" "},null,{"$f":"IF(ISBLANK(M10),\" \",IF(ISBLANK(M13),\" \",(M11-M13)/M11*100))","v":" "}]
["Wt. Loss",null,{"$f":"IF(ISBLANK(C10),\" \",IF(ISBLANK(C11),\" \",C10-C11))","v":" "},null,{"$f":"IF(ISBLANK(E10),\" \",IF(ISBLANK(E11),\" \",E10-E11))","v":" "},null,{"$f":"IF(ISBLANK(G10),\" \",IF(ISBLANK(G11),\" \",G10-G11))","v":" "},null,{"$f":"IF(ISBLANK(I10),\" \",IF(ISBLANK(I11),\" \",I10-I11))","v":" "},null,{"$f":"IF(ISBLANK(K10),\" \",IF(ISBLANK(K11),\" \",K10-K11))","v":" "},null,{"$f":"IF(ISBLANK(M10),\" \",IF(ISBLANK(M11),\" \",M10-M11))","v":" "}]
[100,0.375,null,{"$f":"IF(ISBLANK(C$10),\"  \",IF(ISBLANK(C$11),\" \",IF(ISBLANK(C13),\" \",ROUND((C13+C$12)/C$10*100,1))))","v":"  "},null,{"$f":"IF(ISBLANK(E$10),\"  \",IF(ISBLANK(E$11),\" \",IF(ISBLANK(E13),\" \",ROUND((E13+E$12)/E$10*100,1))))","v":"  "},null,{"$f":"IF(ISBLANK(G$10),\"  \",IF(ISBLANK(G$11),\" \",IF(ISBLANK(G13),\" \",ROUND((G13+G$12)/G$10*100,1))))","v":"  "},null,{"$f":"IF(ISBLANK(I$10),\"  \",IF(ISBLANK(I$11),\" \",IF(ISBLANK(I13),\" \",ROUND((I13+I$12)/I$10*100,1))))","v":"  "},null,{"$f":"IF(ISBLANK(K$10),\"  \",IF(ISBLANK(K$11),\" \",IF(ISBLANK(K13),\" \",ROUND((K13+K$12)/K$10*100,1))))","v":"  "},null,{"$f":"IF(ISBLANK(M$10),\"  \",IF(ISBLANK(M$11),\" \",IF(ISBLANK(M13),\" \",ROUND((M13+M$12)/M$10*100,1))))","v":"  "}]
[{"$f":"IF($M$4=\"B1\",\"95-100\",IF($M$4=\"B2\",\"100\",IF($M$4=\"B3\",\"80-100\",IF($M$4,\" \",\"95-100\"))))","v":"80-100"},4,null,{"$f":"IF(ISBLANK(C$10),\"  \",IF(ISBLANK(C$11),\" \",IF(ISBLANK(C14),\" \",ROUND((C14+C$12)/C$10*100,0))))","v":"  "},null,{"$f":"IF(ISBLANK(E$10),\"  \",IF(ISBLANK(E$11),\" \",IF(ISBLANK(E14),\" \",ROUND((E14+E$12)/E$10*100,0))))","v":"  "},null,{"$f":"IF(ISBLANK(G$10),\"  \",IF(ISBLANK(G$11),\" \",IF(ISBLANK(G14),\" \",ROUND((G14+G$12)/G$10*100,0))))","v":"  "},null,{"$f":"IF(ISBLANK(I$10),\"  \",IF(ISBLANK(I$11),\" \",IF(ISBLANK(I14),\" \",ROUND((I14+I$12)/I$10*100,0))))","v":"  "},null,{"$f":"IF(ISBLANK(K$10),\"  \",IF(ISBLANK(K$11),\" \",IF(ISBLANK(K14),\" \",ROUND((K14+K$12)/K$10*100,0))))","v":"  "},null,{"$f":"IF(ISBLANK(M$10),\"  \",IF(ISBLANK(M$11),\" \",IF(ISBLANK(M14),\" \",ROUND((M14+M$12)/M$10*100,0))))","v":"  "}]
[{"$f":"IF($M$4=\"B1\",\"70-100\",IF($M$4=\"B2\",\"95-100\",IF($M$4=\"B3\",\"65-100\",IF($M$4,\" \",\"70-100\"))))","v":"65-100"},8,null,"  ",null,"  ",null,"  ",null,"  ",null,"  ",null,"  "]
[{"$f":"IF($M$4=\"B1\",\"40-80\",IF($M$4=\"B2\",\"85-100\",IF($M$4=\"B3\",\"40-80\",IF($M$4,\" \",\"40-80\"))))","v":"40-80"},16,null,"  ",null,"  ",null,"  ",null,"  ",null,"  ",null,"  "]
[{"$f":"IF($M$4=\"B1\",\"20-65\",IF($M$4=\"B2\",\"65-90\",IF($M$4=\"B3\",\"20-65\",IF($M$4,\" \",\"25-65\"))))","v":"20-65"},30,null,"  ",null,"  ",null,"  ",null,"  ",null,"  ",null,"  "]
[{"$f":"IF($M$4=\"B1\",\"7-40\",IF($M$4=\"B2\",\"30-60\",IF($M$4=\"B3\",\"7-40\",IF($M$4,\" \",\"7-40\"))))","v":"7-40"},50,null,"  ",null,"  ",null,"  ",null,"  ",null,"  ",null,"  "]
[{"$f":"IF($M$4=\"B1\",\"2-20\",IF($M$4=\"B2\",\"5-25\",IF($M$4=\"B3\",\"2-20\",IF($M$4,\" \",\"2-20\"))))","v":"2-20"},100,null,"  ",null,"  ",null,"  ",null,"  ",null,"  ",null,"  "]
[{"$f":"IF($M$4=\"B1\",\"0-10\",IF($M$4=\"B2\",\"0-5\",IF($M$4=\"B3\",\"0-10\",IF($M$4,\" \",\"0-10\"))))","v":"0-10"},200,null,{"$f":"IF(ISBLANK(C$10),\"  \",IF(ISBLANK(C$11),\" \",IF(ISBLANK(C20),\" \",ROUND((C20+C$12)/C$10*100,2))))","v":"  "},null,{"$f":"IF(ISBLANK(E$10),\"  \",IF(ISBLANK(E$11),\" \",IF(ISBLANK(E20),\" \",ROUND((E20+E$12)/E$10*100,2))))","v":"  "},null,{"$f":"IF(ISBLANK(G$10),\"  \",IF(ISBLANK(G$11),\" \",IF(ISBLANK(G20),\" \",ROUND((G20+G$12)/G$10*100,2))))","v":"  "},null,{"$f":"IF(ISBLANK(I$10),\"  \",IF(ISBLANK(I$11),\" \",IF(ISBLANK(I20),\" \",ROUND((I20+I$12)/I$10*100,2))))","v":"  "},null,{"$f":"IF(ISBLANK(K$10),\"  \",IF(ISBLANK(K$11),\" \",IF(ISBLANK(K20),\" \",ROUND((K20+K$12)/K$10*100,2))))","v":"  "},null,{"$f":"IF(ISBLANK(M$10),\"  \",IF(ISBLANK(M$11),\" \",IF(ISBLANK(M20),\" \",ROUND((M20+M$12)/M$10*100,2))))","v":"  "}]
["Tested By"]
["Remarks"]
[]
[]
[]
["Sample No."]
["Date"]
["St Wt Before Wash",null,null,"% Loss",null,"% Loss",null,"% Loss",null,"% Loss",null,"% Loss",null,"% Loss"]
["Dry Wt After Wash",null,null,{"$f":"IF(ISBLANK(C28),\" \",IF(ISBLANK(C31),\" \",(C29-C31)/C29*100))","v":" "},null,{"$f":"IF(ISBLANK(E28),\" \",IF(ISBLANK(E31),\" \",(E29-E31)/E29*100))","v":" "},null,{"$f":"IF(ISBLANK(G28),\" \",IF(ISBLANK(G31),\" \",(G29-G31)/G29*100))","v":" "},null,{"$f":"IF(ISBLANK(I28),\" \",IF(ISBLANK(I31),\" \",(I29-I31)/I29*100))","v":" "},null,{"$f":"IF(ISBLANK(K28),\" \",IF(ISBLANK(K31),\" \",(K29-K31)/K29*100))","v":" "},null,{"$f":"IF(ISBLANK(M28),\" \",IF(ISBLANK(M31),\" \",(M29-M31)/M29*100))","v":" "}]
["Wt. Loss",null,{"$f":"IF(ISBLANK(C28),\" \",IF(ISBLANK(C29),\" \",C28-C29))","v":" "},null,{"$f":"IF(ISBLANK(E28),\" \",IF(ISBLANK(E29),\" \",E28-E29))","v":" "},null,{"$f":"IF(ISBLANK(G28),\" \",IF(ISBLANK(G29),\" \",G28-G29))","v":" "},null,{"$f":"IF(ISBLANK(I28),\" \",IF(ISBLANK(I29),\" \",I28-I29))","v":" "},null,{"$f":"IF(ISBLANK(K28),\" \",IF(ISBLANK(K29),\" \",K28-K29))","v":" "},null,{"$f":"IF(ISBLANK(M28),\" \",IF(ISBLANK(M29),\" \",M28-M29))","v":" "}]
[100,0.375,null,{"$f":"IF(ISBLANK(C$28),\"  \",IF(ISBLANK(C$29),\" \",IF(ISBLANK(C31),\" \",ROUND((C31+C$30)/C$28*100,1))))","v":"  "},null,{"$f":"IF(ISBLANK(E$28),\"  \",IF(ISBLANK(E$29),\" \",IF(ISBLANK(E31),\" \",ROUND((E31+E$30)/E$28*100,1))))","v":"  "},null,{"$f":"IF(ISBLANK(G$28),\"  \",IF(ISBLANK(G$29),\" \",IF(ISBLANK(G31),\" \",ROUND((G31+G$30)/G$28*100,1))))","v":"  "},null,{"$f":"IF(ISBLANK(I$28),\"  \",IF(ISBLANK(I$29),\" \",IF(ISBLANK(I31),\" \",ROUND((I31+I$30)/I$28*100,1))))","v":"  "},null,{"$f":"IF(ISBLANK(K$28),\"  \",IF(ISBLANK(K$29),\" \",IF(ISBLANK(K31),\" \",ROUND((K31+K$30)/K$28*100,1))))","v":"  "},null,{"$f":"IF(ISBLANK(M$28),\"  \",IF(ISBLANK(M$29),\" \",IF(ISBLANK(M31),\" \",ROUND((M31+M$30)/M$28*100,1))))","v":"  "}]
[{"$f":"IF($M$4=\"B1\",\"95-100\",IF($M$4=\"B2\",\"100\",IF($M$4=\"B3\",\"80-100\",IF($M$4,\" \",\"95-100\"))))","v":"80-100"},4,null,{"$f":"IF(ISBLANK(C$28),\"  \",IF(ISBLANK(C$29),\" \",IF(ISBLANK(C32),\" \",ROUND((C32+C$30)/C$28*100,0))))","v":"  "},null,{"$f":"IF(ISBLANK(E$28),\"  \",IF(ISBLANK(E$29),\" \",IF(ISBLANK(E32),\" \",ROUND((E32+E$30)/E$28*100,0))))","v":"  "},null,{"$f":"IF(ISBLANK(G$28),\"  \",IF(ISBLANK(G$29),\" \",IF(ISBLANK(G32),\" \",ROUND((G32+G$30)/G$28*100,0))))","v":"  "},null,{"$f":"IF(ISBLANK(I$28),\"  \",IF(ISBLANK(I$29),\" \",IF(ISBLANK(I32),\" \",ROUND((I32+I$30)/I$28*100,0))))","v":"  "},null,{"$f":"IF(ISBLANK(K$28),\"  \",IF(ISBLANK(K$29),\" \",IF(ISBLANK(K32),\" \",ROUND((K32+K$30)/K$28*100,0))))","v":"  "},null,{"$f":"IF(ISBLANK(M$28),\"  \",IF(ISBLANK(M$29),\" \",IF(ISBLANK(M32),\" \",ROUND((M32+M$30)/M$28*100,0))))","v":"  "}]
[{"$f":"IF($M$4=\"B1\",\"70-100\",IF($M$4=\"B2\",\"95-100\",IF($M$4=\"B3\",\"65-100\",IF($M$4,\" \",\"70-100\"))))","v":"65-100"},8,null,"  ",null,"  ",null,"  ",null,"  ",null,"  ",null,"  "]
[{"$f":"IF($M$4=\"B1\",\"40-80\",IF($M$4=\"B2\",\"85-100\",IF($M$4=\"B3\",\"40-80\",IF($M$4,\" \",\"40-80\"))))","v":"40-80"},16,null,"  ",null,"  ",null,"  ",null,"  ",null,"  ",null,"  "]
[{"$f":"IF($M$4=\"B1\",\"20-65\",IF($M$4=\"B2\",\"65-90\",IF($M$4=\"B3\",\"20-65\",IF($M$4,\" \",\"25-65\"))))","v":"20-65"},30,null,"  ",null,"  ",null,"  ",null,"  ",null,"  ",null,"  "]
[{"$f":"IF($M$4=\"B1\",\"7-40\",IF($M$4=\"B2\",\"30-60\",IF($M$4=\"B3\",\"7-40\",IF($M$4,\" \",\"7-40\"))))","v":"7-40"},50,null,"  ",null,"  ",null,"  ",null,"  ",null,"  ",null,"  "]
[{"$f":"IF($M$4=\"B1\",\"2-20\",IF($M$4=\"B2\",\"5-25\",IF($M$4=\"B3\",\"2-20\",IF($M$4,\" \",\"2-20\"))))","v":"2-20"},100,null,"  ",null,"  ",null,"  ",null,"  ",null,"  ",null,"  "]
[{"$f":"IF($M$4=\"B1\",\"0-10\",IF($M$4=\"B2\",\"0-5\",IF($M$4=\"B3\",\"0-10\",IF($M$4,\" \",\"0-10\"))))","v":"0-10"},200,null,{"$f":"IF(ISBLANK(C$28),\"  \",IF(ISBLANK(C$29),\" \",IF(ISBLANK(C38),\" \",ROUND((C38+C$30)/C$28*100,2))))","v":"  "},null,{"$f":"IF(ISBLANK(E$28),\"  \",IF(ISBLANK(E$29),\" \",IF(ISBLANK(E38),\" \",ROUND((E38+E$30)/E$28*100,2))))","v":"  "},null,{"$f":"IF(ISBLANK(G$28),\"  \",IF(ISBLANK(G$29),\" \",IF(ISBLANK(G38),\" \",ROUND((G38+G$30)/G$28*100,2))))","v":"  "},null,{"$f":"IF(ISBLANK(I$28),\"  \",IF(ISBLANK(I$29),\" \",IF(ISBLANK(I38),\" \",ROUND((I38+I$30)/I$28*100,2))))","v":"  "},null,{"$f":"IF(ISBLANK(K$28),\"  \",IF(ISBLANK(K$29),\" \",IF(ISBLANK(K38),\" \",ROUND((K38+K$30)/K$28*100,2))))","v":"  "},null,{"$f":"IF(ISBLANK(M$28),\"  \",IF(ISBLANK(M$29),\" \",IF(ISBLANK(M38),\" \",ROUND((M38+M$30)/M$28*100,2))))","v":"  "}]
["Tested By"]
["Remarks"]

{"sheet":"S4","index":3,"n_rows":40,"n_cols":14,"rows_kept":40,"cut":false,"hidden":true,"merged":[[11,6,11,7],[11,8,11,9],[11,10,11,11],[11,12,11,13],[29,2,29,3],[29,4,29,5],[29,6,29,7],[29,8,29,9],[29,10,29,11],[29,12,29,13],[20,10,20,11],[20,12,20,13],[21,6,23,7],[21,8,23,9],[21,10,23,11],[21,12,23,13],[10,0,10,1],[9,0,9,1],[7,10,7,11],[0,0,3,1],[1,10,1,11],[0,8,3,9],[1,2,1,7],[2,2,2,7],[3,2,3,7],[4,0,4,1],[5,3,5,8],[7,8,7,9],[7,2,7,3],[7,4,7,5],[7,6,7,7],[6,3,6,8],[27,0,27,1],[25,0,25,1],[25,2,25,3],[25,4,25,5],[11,0,11,1],[11,2,11,3],[11,4,11,5],[21,0,23,1],[21,2,23,3],[21,4,23,5],[20,0,20,1],[20,2,20,3],[20,4,20,5],[29,0,29,1],[1,12,1,13],[2,10,2,11],[2,12,2,13],[3,10,3,11],[3,12,3,13],[7,12,7,13],[8,0,8,1],[8,2,8,3],[8,4,8,5],[8,6,8,7],[8,8,8,9],[8,10,8,11],[7,0,7,1],[8,12,8,13],[28,0,28,1],[20,6,20,7],[20,8,20,9],[25,12,25,13],[26,0,26,1],[26,2,26,3],[26,4,26,5],[26,6,26,7],[26,8,26,9],[26,10,26,11],[26,12,26,13],[25,6,25,7],[25,8,25,9],[25,10,25,11],[38,10,38,11],[38,12,38,13],[39,0,41,1],[39,2,41,3],[39,4,41,5],[39,6,41,7],[39,8,41,9],[39,10,41,11],[39,12,41,13],[38,0,38,1],[38,2,38,3],[38,4,38,5],[38,6,38,7],[38,8,38,9]]}
[]
[null,null,"COMMONWEALTH OF PENNSYLVANIA",null,null,null,null,null,null,null,"DISTRICT",null,{"$f":"IF(ISBLANK('S1'!M2),\" \",'S1'!M2)","v":" "}]
[null,null,"DEPARTMENT OF TRANSPORTATION",null,null,null,null,null,null,null,"PLANT CODE",null,{"$f":"IF(ISBLANK('S1'!M3),\" \",'S1'!M3)","v":" "}]
[null,null,"PENNSYLVANIA TURNPIKE COMMISSION",null,null,null,null,null,null,null,"AGG SIZE",null,{"$f":"IF(ISBLANK('S1'!M4),\" \",'S1'!M4)","v":"B3"}]
[{"$f":"'S1'!A5","v":"Aggregate 2023"}]
[null,null,null,"Material Test Results for Type A Fine Aggregate"]
[null,null,null,"Washed Gradation"]
["Sample No."]
["Date"]
["St Wt Before Wash",null,null,"% Loss",null,"% Loss",null,"% Loss",null,"% Loss",null,"% Loss",null,"% Loss"]
["Dry Wt After Wash",null,null,{"$f":"IF(ISBLANK(C10),\" \",IF(ISBLANK(C13),\" \",(C11-C13)/C11*100))","v":" "},null,{"$f":"IF(ISBLANK(E10),\" \",IF(ISBLANK(E13),\" \",(E11-E13)/E11*100))","v":" "},null,{"$f":"IF(ISBLANK(G10),\" \",IF(ISBLANK(G13),\" \",(G11-G13)/G11*100))","v":" "},null,{"$f":"IF(ISBLANK(I10),\" \",IF(ISBLANK(I13),\" \",(I11-I13)/I11*100))","v":" "},null,{"$f":"IF(ISBLANK(K10),\" \",IF(ISBLANK(K13),\" \",(K11-K13)/K11*100))","v":" "},null,{"$f":"IF(ISBLANK(M10),\" \",IF(ISBLANK(M13),\" \",(M11-M13)/M11*100))","v":" "}]
["Wt. Loss",null,{"$f":"IF(ISBLANK(C10),\" \",IF(ISBLANK(C11),\" \",C10-C11))","v":" "},null,{"$f":"IF(ISBLANK(E10),\" \",IF(ISBLANK(E11),\" \",E10-E11))","v":" "},null,{"$f":"IF(ISBLANK(G10),\" \",IF(ISBLANK(G11),\" \",G10-G11))","v":" "},null,{"$f":"IF(ISBLANK(I10),\" \",IF(ISBLANK(I11),\" \",I10-I11))","v":" "},null,{"$f":"IF(ISBLANK(K10),\" \",IF(ISBLANK(K11),\" \",K10-K11))","v":" "},null,{"$f":"IF(ISBLANK(M10),\" \",IF(ISBLANK(M11),\" \",M10-M11))","v":" "}]
[100,0.375,null,{"$f":"IF(ISBLANK(C$10),\"  \",IF(ISBLANK(C$11),\" \",IF(ISBLANK(C13),\" \",ROUND((C13+C$12)/C$10*100,1))))","v":"  "},null,{"$f":"IF(ISBLANK(E$10),\"  \",IF(ISBLANK(E$11),\" \",IF(ISBLANK(E13),\" \",ROUND((E13+E$12)/E$10*100,1))))","v":"  "},null,{"$f":"IF(ISBLANK(G$10),\"  \",IF(ISBLANK(G$11),\" \",IF(ISBLANK(G13),\" \",ROUND((G13+G$12)/G$10*100,1))))","v":"  "},null,{"$f":"IF(ISBLANK(I$10),\"  \",IF(ISBLANK(I$11),\" \",IF(ISBLANK(I13),\" \",ROUND((I13+I$12)/I$10*100,1))))","v":"  "},null,{"$f":"IF(ISBLANK(K$10),\"  \",IF(ISBLANK(K$11),\" \",IF(ISBLANK(K13),\" \",ROUND((K13+K$12)/K$10*100,1))))","v":"  "},null,{"$f":"IF(ISBLANK(M$10),\"  \",IF(ISBLANK(M$11),\" \",IF(ISBLANK(M13),\" \",ROUND((M13+M$12)/M$10*100,1))))","v":"  "}]
[{"$f":"IF($M$4=\"B1\",\"95-100\",IF($M$4=\"B2\",\"100\",IF($M$4=\"B3\",\"80-100\",IF($M$4,\" \",\"95-100\"))))","v":"80-100"},4,null,{"$f":"IF(ISBLANK(C$10),\"  \",IF(ISBLANK(C$11),\" \",IF(ISBLANK(C14),\" \",ROUND((C14+C$12)/C$10*100,0))))","v":"  "},null,{"$f":"IF(ISBLANK(E$10),\"  \",IF(ISBLANK(E$11),\" \",IF(ISBLANK(E14),\" \",ROUND((E14+E$12)/E$10*100,0))))","v":"  "},null,{"$f":"IF(ISBLANK(G$10),\"  \",IF(ISBLANK(G$11),\" \",IF(ISBLANK(G14),\" \",ROUND((G14+G$12)/G$10*100,0))))","v":"  "},null,{"$f":"IF(ISBLANK(I$10),\"  \",IF(ISBLANK(I$11),\" \",IF(ISBLANK(I14),\" \",ROUND((I14+I$12)/I$10*100,0))))","v":"  "},null,{"$f":"IF(ISBLANK(K$10),\"  \",IF(ISBLANK(K$11),\" \",IF(ISBLANK(K14),\" \",ROUND((K14+K$12)/K$10*100,0))))","v":"  "},null,{"$f":"IF(ISBLANK(M$10),\"  \",IF(ISBLANK(M$11),\" \",IF(ISBLANK(M14),\" \",ROUND((M14+M$12)/M$10*100,0))))","v":"  "}]
[{"$f":"IF($M$4=\"B1\",\"70-100\",IF($M$4=\"B2\",\"95-100\",IF($M$4=\"B3\",\"65-100\",IF($M$4,\" \",\"70-100\"))))","v":"65-100"},8,null,"  ",null,"  ",null,"  ",null,"  ",null,"  ",null,"  "]
[{"$f":"IF($M$4=\"B1\",\"40-80\",IF($M$4=\"B2\",\"85-100\",IF($M$4=\"B3\",\"40-80\",IF($M$4,\" \",\"40-80\"))))","v":"40-80"},16,null,"  ",null,"  ",null,"  ",null,"  ",null,"  ",null,"  "]
[{"$f":"IF($M$4=\"B1\",\"20-65\",IF($M$4=\"B2\",\"65-90\",IF($M$4=\"B3\",\"20-65\",IF($M$4,\" \",\"25-65\"))))","v":"20-65"},30,null,"  ",null,"  ",null,"  ",null,"  ",null,"  ",null,"  "]
[{"$f":"IF($M$4=\"B1\",\"7-40\",IF($M$4=\"B2\",\"30-60\",IF($M$4=\"B3\",\"7-40\",IF($M$4,\" \",\"7-40\"))))","v":"7-40"},50,null,"  ",null,"  ",null,"  ",null,"  ",null,"  ",null,"  "]
[{"$f":"IF($M$4=\"B1\",\"2-20\",IF($M$4=\"B2\",\"5-25\",IF($M$4=\"B3\",\"2-20\",IF($M$4,\" \",\"2-20\"))))","v":"2-20"},100,null,"  ",null,"  ",null,"  ",null,"  ",null,"  ",null,"  "]
[{"$f":"IF($M$4=\"B1\",\"0-10\",IF($M$4=\"B2\",\"0-5\",IF($M$4=\"B3\",\"0-10\",IF($M$4,\" \",\"0-10\"))))","v":"0-10"},200,null,{"$f":"IF(ISBLANK(C$10),\"  \",IF(ISBLANK(C$11),\" \",IF(ISBLANK(C20),\" \",ROUND((C20+C$12)/C$10*100,2))))","v":"  "},null,{"$f":"IF(ISBLANK(E$10),\"  \",IF(ISBLANK(E$11),\" \",IF(ISBLANK(E20),\" \",ROUND((E20+E$12)/E$10*100,2))))","v":"  "},null,{"$f":"IF(ISBLANK(G$10),\"  \",IF(ISBLANK(G$11),\" \",IF(ISBLANK(G20),\" \",ROUND((G20+G$12)/G$10*100,2))))","v":"  "},null,{"$f":"IF(ISBLANK(I$10),\"  \",IF(ISBLANK(I$11),\" \",IF(ISBLANK(I20),\" \",ROUND((I20+I$12)/I$10*100,2))))","v":"  "},null,{"$f":"IF(ISBLANK(K$10),\"  \",IF(ISBLANK(K$11),\" \",IF(ISBLANK(K20),\" \",ROUND((K20+K$12)/K$10*100,2))))","v":"  "},null,{"$f":"IF(ISBLANK(M$10),\"  \",IF(ISBLANK(M$11),\" \",IF(ISBLANK(M20),\" \",ROUND((M20+M$12)/M$10*100,2))))","v":"  "}]
["Tested By"]
["Remarks"]
[]
[]
[]
["Sample No."]
["Date"]
["St Wt Before Wash",null,null,"% Loss",null,"% Loss",null,"% Loss",null,"% Loss",null,"% Loss",null,"% Loss"]
["Dry Wt After Wash",null,null,{"$f":"IF(ISBLANK(C28),\" \",IF(ISBLANK(C31),\" \",(C29-C31)/C29*100))","v":" "},null,{"$f":"IF(ISBLANK(E28),\" \",IF(ISBLANK(E31),\" \",(E29-E31)/E29*100))","v":" "},null,{"$f":"IF(ISBLANK(G28),\" \",IF(ISBLANK(G31),\" \",(G29-G31)/G29*100))","v":" "},null,{"$f":"IF(ISBLANK(I28),\" \",IF(ISBLANK(I31),\" \",(I29-I31)/I29*100))","v":" "},null,{"$f":"IF(ISBLANK(K28),\" \",IF(ISBLANK(K31),\" \",(K29-K31)/K29*100))","v":" "},null,{"$f":"IF(ISBLANK(M28),\" \",IF(ISBLANK(M31),\" \",(M29-M31)/M29*100))","v":" "}]
["Wt. Loss",null,{"$f":"IF(ISBLANK(C28),\" \",IF(ISBLANK(C29),\" \",C28-C29))","v":" "},null,{"$f":"IF(ISBLANK(E28),\" \",IF(ISBLANK(E29),\" \",E28-E29))","v":" "},null,{"$f":"IF(ISBLANK(G28),\" \",IF(ISBLANK(G29),\" \",G28-G29))","v":" "},null,{"$f":"IF(ISBLANK(I28),\" \",IF(ISBLANK(I29),\" \",I28-I29))","v":" "},null,{"$f":"IF(ISBLANK(K28),\" \",IF(ISBLANK(K29),\" \",K28-K29))","v":" "},null,{"$f":"IF(ISBLANK(M28),\" \",IF(ISBLANK(M29),\" \",M28-M29))","v":" "}]
[100,0.375,null,{"$f":"IF(ISBLANK(C$28),\"  \",IF(ISBLANK(C$29),\" \",IF(ISBLANK(C31),\" \",ROUND((C31+C$30)/C$28*100,1))))","v":"  "},null,{"$f":"IF(ISBLANK(E$28),\"  \",IF(ISBLANK(E$29),\" \",IF(ISBLANK(E31),\" \",ROUND((E31+E$30)/E$28*100,1))))","v":"  "},null,{"$f":"IF(ISBLANK(G$28),\"  \",IF(ISBLANK(G$29),\" \",IF(ISBLANK(G31),\" \",ROUND((G31+G$30)/G$28*100,1))))","v":"  "},null,{"$f":"IF(ISBLANK(I$28),\"  \",IF(ISBLANK(I$29),\" \",IF(ISBLANK(I31),\" \",ROUND((I31+I$30)/I$28*100,1))))","v":"  "},null,{"$f":"IF(ISBLANK(K$28),\"  \",IF(ISBLANK(K$29),\" \",IF(ISBLANK(K31),\" \",ROUND((K31+K$30)/K$28*100,1))))","v":"  "},null,{"$f":"IF(ISBLANK(M$28),\"  \",IF(ISBLANK(M$29),\" \",IF(ISBLANK(M31),\" \",ROUND((M31+M$30)/M$28*100,1))))","v":"  "}]
[{"$f":"IF($M$4=\"B1\",\"95-100\",IF($M$4=\"B2\",\"100\",IF($M$4=\"B3\",\"80-100\",IF($M$4,\" \",\"95-100\"))))","v":"80-100"},4,null,{"$f":"IF(ISBLANK(C$28),\"  \",IF(ISBLANK(C$29),\" \",IF(ISBLANK(C32),\" \",ROUND((C32+C$30)/C$28*100,0))))","v":"  "},null,{"$f":"IF(ISBLANK(E$28),\"  \",IF(ISBLANK(E$29),\" \",IF(ISBLANK(E32),\" \",ROUND((E32+E$30)/E$28*100,0))))","v":"  "},null,{"$f":"IF(ISBLANK(G$28),\"  \",IF(ISBLANK(G$29),\" \",IF(ISBLANK(G32),\" \",ROUND((G32+G$30)/G$28*100,0))))","v":"  "},null,{"$f":"IF(ISBLANK(I$28),\"  \",IF(ISBLANK(I$29),\" \",IF(ISBLANK(I32),\" \",ROUND((I32+I$30)/I$28*100,0))))","v":"  "},null,{"$f":"IF(ISBLANK(K$28),\"  \",IF(ISBLANK(K$29),\" \",IF(ISBLANK(K32),\" \",ROUND((K32+K$30)/K$28*100,0))))","v":"  "},null,{"$f":"IF(ISBLANK(M$28),\"  \",IF(ISBLANK(M$29),\" \",IF(ISBLANK(M32),\" \",ROUND((M32+M$30)/M$28*100,0))))","v":"  "}]
[{"$f":"IF($M$4=\"B1\",\"70-100\",IF($M$4=\"B2\",\"95-100\",IF($M$4=\"B3\",\"65-100\",IF($M$4,\" \",\"70-100\"))))","v":"65-100"},8,null,"  ",null,"  ",null,"  ",null,"  ",null,"  ",null,"  "]
[{"$f":"IF($M$4=\"B1\",\"40-80\",IF($M$4=\"B2\",\"85-100\",IF($M$4=\"B3\",\"40-80\",IF($M$4,\" \",\"40-80\"))))","v":"40-80"},16,null,"  ",null,"  ",null,"  ",null,"  ",null,"  ",null,"  "]
[{"$f":"IF($M$4=\"B1\",\"20-65\",IF($M$4=\"B2\",\"65-90\",IF($M$4=\"B3\",\"20-65\",IF($M$4,\" \",\"25-65\"))))","v":"20-65"},30,null,"  ",null,"  ",null,"  ",null,"  ",null,"  ",null,"  "]
[{"$f":"IF($M$4=\"B1\",\"7-40\",IF($M$4=\"B2\",\"30-60\",IF($M$4=\"B3\",\"7-40\",IF($M$4,\" \",\"7-40\"))))","v":"7-40"},50,null,"  ",null,"  ",null,"  ",null,"  ",null,"  ",null,"  "]
[{"$f":"IF($M$4=\"B1\",\"2-20\",IF($M$4=\"B2\",\"5-25\",IF($M$4=\"B3\",\"2-20\",IF($M$4,\" \",\"2-20\"))))","v":"2-20"},100,null,"  ",null,"  ",null,"  ",null,"  ",null,"  ",null,"  "]
[{"$f":"IF($M$4=\"B1\",\"0-10\",IF($M$4=\"B2\",\"0-5\",IF($M$4=\"B3\",\"0-10\",IF($M$4,\" \",\"0-10\"))))","v":"0-10"},200,null,{"$f":"IF(ISBLANK(C$28),\"  \",IF(ISBLANK(C$29),\" \",IF(ISBLANK(C38),\" \",ROUND((C38+C$30)/C$28*100,2))))","v":"  "},null,{"$f":"IF(ISBLANK(E$28),\"  \",IF(ISBLANK(E$29),\" \",IF(ISBLANK(E38),\" \",ROUND((E38+E$30)/E$28*100,2))))","v":"  "},null,{"$f":"IF(ISBLANK(G$28),\"  \",IF(ISBLANK(G$29),\" \",IF(ISBLANK(G38),\" \",ROUND((G38+G$30)/G$28*100,2))))","v":"  "},null,{"$f":"IF(ISBLANK(I$28),\"  \",IF(ISBLANK(I$29),\" \",IF(ISBLANK(I38),\" \",ROUND((I38+I$30)/I$28*100,2))))","v":"  "},null,{"$f":"IF(ISBLANK(K$28),\"  \",IF(ISBLANK(K$29),\" \",IF(ISBLANK(K38),\" \",ROUND((K38+K$30)/K$28*100,2))))","v":"  "},null,{"$f":"IF(ISBLANK(M$28),\"  \",IF(ISBLANK(M$29),\" \",IF(ISBLANK(M38),\" \",ROUND((M38+M$30)/M$28*100,2))))","v":"  "}]
["Tested By"]
["Remarks"]

{"sheet":"S5","index":4,"n_rows":40,"n_cols":14,"rows_kept":40,"cut":false,"hidden":true,"merged":[[11,6,11,7],[11,8,11,9],[11,10,11,11],[11,12,11,13],[29,2,29,3],[29,4,29,5],[29,6,29,7],[29,8,29,9],[29,10,29,11],[29,12,29,13],[20,10,20,11],[20,12,20,13],[21,6,23,7],[21,8,23,9],[21,10,23,11],[21,12,23,13],[10,0,10,1],[9,0,9,1],[7,10,7,11],[0,0,3,1],[1,10,1,11],[0,8,3,9],[1,2,1,7],[2,2,2,7],[3,2,3,7],[4,0,4,1],[5,3,5,8],[7,8,7,9],[7,2,7,3],[7,4,7,5],[7,6,7,7],[6,3,6,8],[27,0,27,1],[25,0,25,1],[25,2,25,3],[25,4,25,5],[11,0,11,1],[11,2,11,3],[11,4,11,5],[21,0,23,1],[21,2,23,3],[21,4,23,5],[20,0,20,1],[20,2,20,3],[20,4,20,5],[29,0,29,1],[1,12,1,13],[2,10,2,11],[2,12,2,13],[3,10,3,11],[3,12,3,13],[7,12,7,13],[8,0,8,1],[8,2,8,3],[8,4,8,5],[8,6,8,7],[8,8,8,9],[8,10,8,11],[7,0,7,1],[8,12,8,13],[28,0,28,1],[20,6,20,7],[20,8,20,9],[25,12,25,13],[26,0,26,1],[26,2,26,3],[26,4,26,5],[26,6,26,7],[26,8,26,9],[26,10,26,11],[26,12,26,13],[25,6,25,7],[25,8,25,9],[25,10,25,11],[38,10,38,11],[38,12,38,13],[39,0,41,1],[39,2,41,3],[39,4,41,5],[39,6,41,7],[39,8,41,9],[39,10,41,11],[39,12,41,13],[38,0,38,1],[38,2,38,3],[38,4,38,5],[38,6,38,7],[38,8,38,9]]}
[]
[null,null,"COMMONWEALTH OF PENNSYLVANIA",null,null,null,null,null,null,null,"DISTRICT",null,{"$f":"IF(ISBLANK('S1'!M2),\" \",'S1'!M2)","v":" "}]
[null,null,"DEPARTMENT OF TRANSPORTATION",null,null,null,null,null,null,null,"PLANT CODE",null,{"$f":"IF(ISBLANK('S1'!M3),\" \",'S1'!M3)","v":" "}]
[null,null,"PENNSYLVANIA TURNPIKE COMMISSION",null,null,null,null,null,null,null,"AGG SIZE",null,{"$f":"IF(ISBLANK('S1'!M4),\" \",'S1'!M4)","v":"B3"}]
[{"$f":"'S1'!A5","v":"Aggregate 2023"}]
[null,null,null,"Material Test Results for Type A Fine Aggregate"]
[null,null,null,"Washed Gradation"]
["Sample No."]
["Date"]
["St Wt Before Wash",null,null,"% Loss",null,"% Loss",null,"% Loss",null,"% Loss",null,"% Loss",null,"% Loss"]
["Dry Wt After Wash",null,null,{"$f":"IF(ISBLANK(C10),\" \",IF(ISBLANK(C13),\" \",(C11-C13)/C11*100))","v":" "},null,{"$f":"IF(ISBLANK(E10),\" \",IF(ISBLANK(E13),\" \",(E11-E13)/E11*100))","v":" "},null,{"$f":"IF(ISBLANK(G10),\" \",IF(ISBLANK(G13),\" \",(G11-G13)/G11*100))","v":" "},null,{"$f":"IF(ISBLANK(I10),\" \",IF(ISBLANK(I13),\" \",(I11-I13)/I11*100))","v":" "},null,{"$f":"IF(ISBLANK(K10),\" \",IF(ISBLANK(K13),\" \",(K11-K13)/K11*100))","v":" "},null,{"$f":"IF(ISBLANK(M10),\" \",IF(ISBLANK(M13),\" \",(M11-M13)/M11*100))","v":" "}]
["Wt. Loss",null,{"$f":"IF(ISBLANK(C10),\" \",IF(ISBLANK(C11),\" \",C10-C11))","v":" "},null,{"$f":"IF(ISBLANK(E10),\" \",IF(ISBLANK(E11),\" \",E10-E11))","v":" "},null,{"$f":"IF(ISBLANK(G10),\" \",IF(ISBLANK(G11),\" \",G10-G11))","v":" "},null,{"$f":"IF(ISBLANK(I10),\" \",IF(ISBLANK(I11),\" \",I10-I11))","v":" "},null,{"$f":"IF(ISBLANK(K10),\" \",IF(ISBLANK(K11),\" \",K10-K11))","v":" "},null,{"$f":"IF(ISBLANK(M10),\" \",IF(ISBLANK(M11),\" \",M10-M11))","v":" "}]
[100,0.375,null,{"$f":"IF(ISBLANK(C$10),\"  \",IF(ISBLANK(C$11),\" \",IF(ISBLANK(C13),\" \",ROUND((C13+C$12)/C$10*100,1))))","v":"  "},null,{"$f":"IF(ISBLANK(E$10),\"  \",IF(ISBLANK(E$11),\" \",IF(ISBLANK(E13),\" \",ROUND((E13+E$12)/E$10*100,1))))","v":"  "},null,{"$f":"IF(ISBLANK(G$10),\"  \",IF(ISBLANK(G$11),\" \",IF(ISBLANK(G13),\" \",ROUND((G13+G$12)/G$10*100,1))))","v":"  "},null,{"$f":"IF(ISBLANK(I$10),\"  \",IF(ISBLANK(I$11),\" \",IF(ISBLANK(I13),\" \",ROUND((I13+I$12)/I$10*100,1))))","v":"  "},null,{"$f":"IF(ISBLANK(K$10),\"  \",IF(ISBLANK(K$11),\" \",IF(ISBLANK(K13),\" \",ROUND((K13+K$12)/K$10*100,1))))","v":"  "},null,{"$f":"IF(ISBLANK(M$10),\"  \",IF(ISBLANK(M$11),\" \",IF(ISBLANK(M13),\" \",ROUND((M13+M$12)/M$10*100,1))))","v":"  "}]
[{"$f":"IF($M$4=\"B1\",\"95-100\",IF($M$4=\"B2\",\"100\",IF($M$4=\"B3\",\"80-100\",IF($M$4,\" \",\"95-100\"))))","v":"80-100"},4,null,{"$f":"IF(ISBLANK(C$10),\"  \",IF(ISBLANK(C$11),\" \",IF(ISBLANK(C14),\" \",ROUND((C14+C$12)/C$10*100,0))))","v":"  "},null,{"$f":"IF(ISBLANK(E$10),\"  \",IF(ISBLANK(E$11),\" \",IF(ISBLANK(E14),\" \",ROUND((E14+E$12)/E$10*100,0))))","v":"  "},null,{"$f":"IF(ISBLANK(G$10),\"  \",IF(ISBLANK(G$11),\" \",IF(ISBLANK(G14),\" \",ROUND((G14+G$12)/G$10*100,0))))","v":"  "},null,{"$f":"IF(ISBLANK(I$10),\"  \",IF(ISBLANK(I$11),\" \",IF(ISBLANK(I14),\" \",ROUND((I14+I$12)/I$10*100,0))))","v":"  "},null,{"$f":"IF(ISBLANK(K$10),\"  \",IF(ISBLANK(K$11),\" \",IF(ISBLANK(K14),\" \",ROUND((K14+K$12)/K$10*100,0))))","v":"  "},null,{"$f":"IF(ISBLANK(M$10),\"  \",IF(ISBLANK(M$11),\" \",IF(ISBLANK(M14),\" \",ROUND((M14+M$12)/M$10*100,0))))","v":"  "}]
[{"$f":"IF($M$4=\"B1\",\"70-100\",IF($M$4=\"B2\",\"95-100\",IF($M$4=\"B3\",\"65-100\",IF($M$4,\" \",\"70-100\"))))","v":"65-100"},8,null,"  ",null,"  ",null,"  ",null,"  ",null,"  ",null,"  "]
[{"$f":"IF($M$4=\"B1\",\"40-80\",IF($M$4=\"B2\",\"85-100\",IF($M$4=\"B3\",\"40-80\",IF($M$4,\" \",\"40-80\"))))","v":"40-80"},16,null,"  ",null,"  ",null,"  ",null,"  ",null,"  ",null,"  "]
[{"$f":"IF($M$4=\"B1\",\"20-65\",IF($M$4=\"B2\",\"65-90\",IF($M$4=\"B3\",\"20-65\",IF($M$4,\" \",\"25-65\"))))","v":"20-65"},30,null,"  ",null,"  ",null,"  ",null,"  ",null,"  ",null,"  "]
[{"$f":"IF($M$4=\"B1\",\"7-40\",IF($M$4=\"B2\",\"30-60\",IF($M$4=\"B3\",\"7-40\",IF($M$4,\" \",\"7-40\"))))","v":"7-40"},50,null,"  ",null,"  ",null,"  ",null,"  ",null,"  ",null,"  "]
[{"$f":"IF($M$4=\"B1\",\"2-20\",IF($M$4=\"B2\",\"5-25\",IF($M$4=\"B3\",\"2-20\",IF($M$4,\" \",\"2-20\"))))","v":"2-20"},100,null,"  ",null,"  ",null,"  ",null,"  ",null,"  ",null,"  "]
[{"$f":"IF($M$4=\"B1\",\"0-10\",IF($M$4=\"B2\",\"0-5\",IF($M$4=\"B3\",\"0-10\",IF($M$4,\" \",\"0-10\"))))","v":"0-10"},200,null,{"$f":"IF(ISBLANK(C$10),\"  \",IF(ISBLANK(C$11),\" \",IF(ISBLANK(C20),\" \",ROUND((C20+C$12)/C$10*100,2))))","v":"  "},null,{"$f":"IF(ISBLANK(E$10),\"  \",IF(ISBLANK(E$11),\" \",IF(ISBLANK(E20),\" \",ROUND((E20+E$12)/E$10*100,2))))","v":"  "},null,{"$f":"IF(ISBLANK(G$10),\"  \",IF(ISBLANK(G$11),\" \",IF(ISBLANK(G20),\" \",ROUND((G20+G$12)/G$10*100,2))))","v":"  "},null,{"$f":"IF(ISBLANK(I$10),\"  \",IF(ISBLANK(I$11),\" \",IF(ISBLANK(I20),\" \",ROUND((I20+I$12)/I$10*100,2))))","v":"  "},null,{"$f":"IF(ISBLANK(K$10),\"  \",IF(ISBLANK(K$11),\" \",IF(ISBLANK(K20),\" \",ROUND((K20+K$12)/K$10*100,2))))","v":"  "},null,{"$f":"IF(ISBLANK(M$10),\"  \",IF(ISBLANK(M$11),\" \",IF(ISBLANK(M20),\" \",ROUND((M20+M$12)/M$10*100,2))))","v":"  "}]
["Tested By"]
["Remarks"]
[]
[]
[]
["Sample No."]
["Date"]
["St Wt Before Wash",null,null,"% Loss",null,"% Loss",null,"% Loss",null,"% Loss",null,"% Loss",null,"% Loss"]
["Dry Wt After Wash",null,null,{"$f":"IF(ISBLANK(C28),\" \",IF(ISBLANK(C31),\" \",(C29-C31)/C29*100))","v":" "},null,{"$f":"IF(ISBLANK(E28),\" \",IF(ISBLANK(E31),\" \",(E29-E31)/E29*100))","v":" "},null,{"$f":"IF(ISBLANK(G28),\" \",IF(ISBLANK(G31),\" \",(G29-G31)/G29*100))","v":" "},null,{"$f":"IF(ISBLANK(I28),\" \",IF(ISBLANK(I31),\" \",(I29-I31)/I29*100))","v":" "},null,{"$f":"IF(ISBLANK(K28),\" \",IF(ISBLANK(K31),\" \",(K29-K31)/K29*100))","v":" "},null,{"$f":"IF(ISBLANK(M28),\" \",IF(ISBLANK(M31),\" \",(M29-M31)/M29*100))","v":" "}]
["Wt. Loss",null,{"$f":"IF(ISBLANK(C28),\" \",IF(ISBLANK(C29),\" \",C28-C29))","v":" "},null,{"$f":"IF(ISBLANK(E28),\" \",IF(ISBLANK(E29),\" \",E28-E29))","v":" "},null,{"$f":"IF(ISBLANK(G28),\" \",IF(ISBLANK(G29),\" \",G28-G29))","v":" "},null,{"$f":"IF(ISBLANK(I28),\" \",IF(ISBLANK(I29),\" \",I28-I29))","v":" "},null,{"$f":"IF(ISBLANK(K28),\" \",IF(ISBLANK(K29),\" \",K28-K29))","v":" "},null,{"$f":"IF(ISBLANK(M28),\" \",IF(ISBLANK(M29),\" \",M28-M29))","v":" "}]
[100,0.375,null,{"$f":"IF(ISBLANK(C$28),\"  \",IF(ISBLANK(C$29),\" \",IF(ISBLANK(C31),\" \",ROUND((C31+C$30)/C$28*100,1))))","v":"  "},null,{"$f":"IF(ISBLANK(E$28),\"  \",IF(ISBLANK(E$29),\" \",IF(ISBLANK(E31),\" \",ROUND((E31+E$30)/E$28*100,1))))","v":"  "},null,{"$f":"IF(ISBLANK(G$28),\"  \",IF(ISBLANK(G$29),\" \",IF(ISBLANK(G31),\" \",ROUND((G31+G$30)/G$28*100,1))))","v":"  "},null,{"$f":"IF(ISBLANK(I$28),\"  \",IF(ISBLANK(I$29),\" \",IF(ISBLANK(I31),\" \",ROUND((I31+I$30)/I$28*100,1))))","v":"  "},null,{"$f":"IF(ISBLANK(K$28),\"  \",IF(ISBLANK(K$29),\" \",IF(ISBLANK(K31),\" \",ROUND((K31+K$30)/K$28*100,1))))","v":"  "},null,{"$f":"IF(ISBLANK(M$28),\"  \",IF(ISBLANK(M$29),\" \",IF(ISBLANK(M31),\" \",ROUND((M31+M$30)/M$28*100,1))))","v":"  "}]
[{"$f":"IF($M$4=\"B1\",\"95-100\",IF($M$4=\"B2\",\"100\",IF($M$4=\"B3\",\"80-100\",IF($M$4,\" \",\"95-100\"))))","v":"80-100"},4,null,{"$f":"IF(ISBLANK(C$28),\"  \",IF(ISBLANK(C$29),\" \",IF(ISBLANK(C32),\" \",ROUND((C32+C$30)/C$28*100,0))))","v":"  "},null,{"$f":"IF(ISBLANK(E$28),\"  \",IF(ISBLANK(E$29),\" \",IF(ISBLANK(E32),\" \",ROUND((E32+E$30)/E$28*100,0))))","v":"  "},null,{"$f":"IF(ISBLANK(G$28),\"  \",IF(ISBLANK(G$29),\" \",IF(ISBLANK(G32),\" \",ROUND((G32+G$30)/G$28*100,0))))","v":"  "},null,{"$f":"IF(ISBLANK(I$28),\"  \",IF(ISBLANK(I$29),\" \",IF(ISBLANK(I32),\" \",ROUND((I32+I$30)/I$28*100,0))))","v":"  "},null,{"$f":"IF(ISBLANK(K$28),\"  \",IF(ISBLANK(K$29),\" \",IF(ISBLANK(K32),\" \",ROUND((K32+K$30)/K$28*100,0))))","v":"  "},null,{"$f":"IF(ISBLANK(M$28),\"  \",IF(ISBLANK(M$29),\" \",IF(ISBLANK(M32),\" \",ROUND((M32+M$30)/M$28*100,0))))","v":"  "}]
[{"$f":"IF($M$4=\"B1\",\"70-100\",IF($M$4=\"B2\",\"95-100\",IF($M$4=\"B3\",\"65-100\",IF($M$4,\" \",\"70-100\"))))","v":"65-100"},8,null,"  ",null,"  ",null,"  ",null,"  ",null,"  ",null,"  "]
[{"$f":"IF($M$4=\"B1\",\"40-80\",IF($M$4=\"B2\",\"85-100\",IF($M$4=\"B3\",\"40-80\",IF($M$4,\" \",\"40-80\"))))","v":"40-80"},16,null,"  ",null,"  ",null,"  ",null,"  ",null,"  ",null,"  "]
[{"$f":"IF($M$4=\"B1\",\"20-65\",IF($M$4=\"B2\",\"65-90\",IF($M$4=\"B3\",\"20-65\",IF($M$4,\" \",\"25-65\"))))","v":"20-65"},30,null,"  ",null,"  ",null,"  ",null,"  ",null,"  ",null,"  "]
[{"$f":"IF($M$4=\"B1\",\"7-40\",IF($M$4=\"B2\",\"30-60\",IF($M$4=\"B3\",\"7-40\",IF($M$4,\" \",\"7-40\"))))","v":"7-40"},50,null,"  ",null,"  ",null,"  ",null,"  ",null,"  ",null,"  "]
[{"$f":"IF($M$4=\"B1\",\"2-20\",IF($M$4=\"B2\",\"5-25\",IF($M$4=\"B3\",\"2-20\",IF($M$4,\" \",\"2-20\"))))","v":"2-20"},100,null,"  ",null,"  ",null,"  ",null,"  ",null,"  ",null,"  "]
[{"$f":"IF($M$4=\"B1\",\"0-10\",IF($M$4=\"B2\",\"0-5\",IF($M$4=\"B3\",\"0-10\",IF($M$4,\" \",\"0-10\"))))","v":"0-10"},200,null,{"$f":"IF(ISBLANK(C$28),\"  \",IF(ISBLANK(C$29),\" \",IF(ISBLANK(C38),\" \",ROUND((C38+C$30)/C$28*100,2))))","v":"  "},null,{"$f":"IF(ISBLANK(E$28),\"  \",IF(ISBLANK(E$29),\" \",IF(ISBLANK(E38),\" \",ROUND((E38+E$30)/E$28*100,2))))","v":"  "},null,{"$f":"IF(ISBLANK(G$28),\"  \",IF(ISBLANK(G$29),\" \",IF(ISBLANK(G38),\" \",ROUND((G38+G$30)/G$28*100,2))))","v":"  "},null,{"$f":"IF(ISBLANK(I$28),\"  \",IF(ISBLANK(I$29),\" \",IF(ISBLANK(I38),\" \",ROUND((I38+I$30)/I$28*100,2))))","v":"  "},null,{"$f":"IF(ISBLANK(K$28),\"  \",IF(ISBLANK(K$29),\" \",IF(ISBLANK(K38),\" \",ROUND((K38+K$30)/K$28*100,2))))","v":"  "},null,{"$f":"IF(ISBLANK(M$28),\"  \",IF(ISBLANK(M$29),\" \",IF(ISBLANK(M38),\" \",ROUND((M38+M$30)/M$28*100,2))))","v":"  "}]
["Tested By"]
["Remarks"]

{"sheet":"S6","index":5,"n_rows":40,"n_cols":14,"rows_kept":40,"cut":false,"hidden":true,"merged":[[11,6,11,7],[11,8,11,9],[11,10,11,11],[11,12,11,13],[29,2,29,3],[29,4,29,5],[29,6,29,7],[29,8,29,9],[29,10,29,11],[29,12,29,13],[20,10,20,11],[20,12,20,13],[21,6,23,7],[21,8,23,9],[21,10,23,11],[21,12,23,13],[10,0,10,1],[9,0,9,1],[7,10,7,11],[0,0,3,1],[1,10,1,11],[0,8,3,9],[1,2,1,7],[2,2,2,7],[3,2,3,7],[4,0,4,1],[5,3,5,8],[7,8,7,9],[7,2,7,3],[7,4,7,5],[7,6,7,7],[6,3,6,8],[27,0,27,1],[25,0,25,1],[25,2,25,3],[25,4,25,5],[11,0,11,1],[11,2,11,3],[11,4,11,5],[21,0,23,1],[21,2,23,3],[21,4,23,5],[20,0,20,1],[20,2,20,3],[20,4,20,5],[29,0,29,1],[1,12,1,13],[2,10,2,11],[2,12,2,13],[3,10,3,11],[3,12,3,13],[7,12,7,13],[8,0,8,1],[8,2,8,3],[8,4,8,5],[8,6,8,7],[8,8,8,9],[8,10,8,11],[7,0,7,1],[8,12,8,13],[28,0,28,1],[20,6,20,7],[20,8,20,9],[25,12,25,13],[26,0,26,1],[26,2,26,3],[26,4,26,5],[26,6,26,7],[26,8,26,9],[26,10,26,11],[26,12,26,13],[25,6,25,7],[25,8,25,9],[25,10,25,11],[38,10,38,11],[38,12,38,13],[39,0,41,1],[39,2,41,3],[39,4,41,5],[39,6,41,7],[39,8,41,9],[39,10,41,11],[39,12,41,13],[38,0,38,1],[38,2,38,3],[38,4,38,5],[38,6,38,7],[38,8,38,9]]}
[]
[null,null,"COMMONWEALTH OF PENNSYLVANIA",null,null,null,null,null,null,null,"DISTRICT",null,{"$f":"IF(ISBLANK('S1'!M2),\" \",'S1'!M2)","v":" "}]
[null,null,"DEPARTMENT OF TRANSPORTATION",null,null,null,null,null,null,null,"PLANT CODE",null,{"$f":"IF(ISBLANK('S1'!M3),\" \",'S1'!M3)","v":" "}]
[null,null,"PENNSYLVANIA TURNPIKE COMMISSION",null,null,null,null,null,null,null,"AGG SIZE",null,{"$f":"IF(ISBLANK('S1'!M4),\" \",'S1'!M4)","v":"B3"}]
[{"$f":"'S1'!A5","v":"Aggregate 2023"}]
[null,null,null,"Material Test Results for Type A Fine Aggregate"]
[null,null,null,"Washed Gradation"]
["Sample No."]
["Date"]
["St Wt Before Wash",null,null,"% Loss",null,"% Loss",null,"% Loss",null,"% Loss",null,"% Loss",null,"% Loss"]
["Dry Wt After Wash",null,null,{"$f":"IF(ISBLANK(C10),\" \",IF(ISBLANK(C13),\" \",(C11-C13)/C11*100))","v":" "},null,{"$f":"IF(ISBLANK(E10),\" \",IF(ISBLANK(E13),\" \",(E11-E13)/E11*100))","v":" "},null,{"$f":"IF(ISBLANK(G10),\" \",IF(ISBLANK(G13),\" \",(G11-G13)/G11*100))","v":" "},null,{"$f":"IF(ISBLANK(I10),\" \",IF(ISBLANK(I13),\" \",(I11-I13)/I11*100))","v":" "},null,{"$f":"IF(ISBLANK(K10),\" \",IF(ISBLANK(K13),\" \",(K11-K13)/K11*100))","v":" "},null,{"$f":"IF(ISBLANK(M10),\" \",IF(ISBLANK(M13),\" \",(M11-M13)/M11*100))","v":" "}]
["Wt. Loss",null,{"$f":"IF(ISBLANK(C10),\" \",IF(ISBLANK(C11),\" \",C10-C11))","v":" "},null,{"$f":"IF(ISBLANK(E10),\" \",IF(ISBLANK(E11),\" \",E10-E11))","v":" "},null,{"$f":"IF(ISBLANK(G10),\" \",IF(ISBLANK(G11),\" \",G10-G11))","v":" "},null,{"$f":"IF(ISBLANK(I10),\" \",IF(ISBLANK(I11),\" \",I10-I11))","v":" "},null,{"$f":"IF(ISBLANK(K10),\" \",IF(ISBLANK(K11),\" \",K10-K11))","v":" "},null,{"$f":"IF(ISBLANK(M10),\" \",IF(ISBLANK(M11),\" \",M10-M11))","v":" "}]
[100,0.375,null,{"$f":"IF(ISBLANK(C$10),\"  \",IF(ISBLANK(C$11),\" \",IF(ISBLANK(C13),\" \",ROUND((C13+C$12)/C$10*100,1))))","v":"  "},null,{"$f":"IF(ISBLANK(E$10),\"  \",IF(ISBLANK(E$11),\" \",IF(ISBLANK(E13),\" \",ROUND((E13+E$12)/E$10*100,1))))","v":"  "},null,{"$f":"IF(ISBLANK(G$10),\"  \",IF(ISBLANK(G$11),\" \",IF(ISBLANK(G13),\" \",ROUND((G13+G$12)/G$10*100,1))))","v":"  "},null,{"$f":"IF(ISBLANK(I$10),\"  \",IF(ISBLANK(I$11),\" \",IF(ISBLANK(I13),\" \",ROUND((I13+I$12)/I$10*100,1))))","v":"  "},null,{"$f":"IF(ISBLANK(K$10),\"  \",IF(ISBLANK(K$11),\" \",IF(ISBLANK(K13),\" \",ROUND((K13+K$12)/K$10*100,1))))","v":"  "},null,{"$f":"IF(ISBLANK(M$10),\"  \",IF(ISBLANK(M$11),\" \",IF(ISBLANK(M13),\" \",ROUND((M13+M$12)/M$10*100,1))))","v":"  "}]
[{"$f":"IF($M$4=\"B1\",\"95-100\",IF($M$4=\"B2\",\"100\",IF($M$4=\"B3\",\"80-100\",IF($M$4,\" \",\"95-100\"))))","v":"80-100"},4,null,{"$f":"IF(ISBLANK(C$10),\"  \",IF(ISBLANK(C$11),\" \",IF(ISBLANK(C14),\" \",ROUND((C14+C$12)/C$10*100,0))))","v":"  "},null,{"$f":"IF(ISBLANK(E$10),\"  \",IF(ISBLANK(E$11),\" \",IF(ISBLANK(E14),\" \",ROUND((E14+E$12)/E$10*100,0))))","v":"  "},null,{"$f":"IF(ISBLANK(G$10),\"  \",IF(ISBLANK(G$11),\" \",IF(ISBLANK(G14),\" \",ROUND((G14+G$12)/G$10*100,0))))","v":"  "},null,{"$f":"IF(ISBLANK(I$10),\"  \",IF(ISBLANK(I$11),\" \",IF(ISBLANK(I14),\" \",ROUND((I14+I$12)/I$10*100,0))))","v":"  "},null,{"$f":"IF(ISBLANK(K$10),\"  \",IF(ISBLANK(K$11),\" \",IF(ISBLANK(K14),\" \",ROUND((K14+K$12)/K$10*100,0))))","v":"  "},null,{"$f":"IF(ISBLANK(M$10),\"  \",IF(ISBLANK(M$11),\" \",IF(ISBLANK(M14),\" \",ROUND((M14+M$12)/M$10*100,0))))","v":"  "}]
[{"$f":"IF($M$4=\"B1\",\"70-100\",IF($M$4=\"B2\",\"95-100\",IF($M$4=\"B3\",\"65-100\",IF($M$4,\" \",\"70-100\"))))","v":"65-100"},8,null,"  ",null,"  ",null,"  ",null,"  ",null,"  ",null,"  "]
[{"$f":"IF($M$4=\"B1\",\"40-80\",IF($M$4=\"B2\",\"85-100\",IF($M$4=\"B3\",\"40-80\",IF($M$4,\" \",\"40-80\"))))","v":"40-80"},16,null,"  ",null,"  ",null,"  ",null,"  ",null,"  ",null,"  "]
[{"$f":"IF($M$4=\"B1\",\"20-65\",IF($M$4=\"B2\",\"65-90\",IF($M$4=\"B3\",\"20-65\",IF($M$4,\" \",\"25-65\"))))","v":"20-65"},30,null,"  ",null,"  ",null,"  ",null,"  ",null,"  ",null,"  "]
[{"$f":"IF($M$4=\"B1\",\"7-40\",IF($M$4=\"B2\",\"30-60\",IF($M$4=\"B3\",\"7-40\",IF($M$4,\" \",\"7-40\"))))","v":"7-40"},50,null,"  ",null,"  ",null,"  ",null,"  ",null,"  ",null,"  "]
[{"$f":"IF($M$4=\"B1\",\"2-20\",IF($M$4=\"B2\",\"5-25\",IF($M$4=\"B3\",\"2-20\",IF($M$4,\" \",\"2-20\"))))","v":"2-20"},100,null,"  ",null,"  ",null,"  ",null,"  ",null,"  ",null,"  "]
[{"$f":"IF($M$4=\"B1\",\"0-10\",IF($M$4=\"B2\",\"0-5\",IF($M$4=\"B3\",\"0-10\",IF($M$4,\" \",\"0-10\"))))","v":"0-10"},200,null,{"$f":"IF(ISBLANK(C$10),\"  \",IF(ISBLANK(C$11),\" \",IF(ISBLANK(C20),\" \",ROUND((C20+C$12)/C$10*100,2))))","v":"  "},null,{"$f":"IF(ISBLANK(E$10),\"  \",IF(ISBLANK(E$11),\" \",IF(ISBLANK(E20),\" \",ROUND((E20+E$12)/E$10*100,2))))","v":"  "},null,{"$f":"IF(ISBLANK(G$10),\"  \",IF(ISBLANK(G$11),\" \",IF(ISBLANK(G20),\" \",ROUND((G20+G$12)/G$10*100,2))))","v":"  "},null,{"$f":"IF(ISBLANK(I$10),\"  \",IF(ISBLANK(I$11),\" \",IF(ISBLANK(I20),\" \",ROUND((I20+I$12)/I$10*100,2))))","v":"  "},null,{"$f":"IF(ISBLANK(K$10),\"  \",IF(ISBLANK(K$11),\" \",IF(ISBLANK(K20),\" \",ROUND((K20+K$12)/K$10*100,2))))","v":"  "},null,{"$f":"IF(ISBLANK(M$10),\"  \",IF(ISBLANK(M$11),\" \",IF(ISBLANK(M20),\" \",ROUND((M20+M$12)/M$10*100,2))))","v":"  "}]
["Tested By"]
["Remarks"]
[]
[]
[]
["Sample No."]
["Date"]
["St Wt Before Wash",null,null,"% Loss",null,"% Loss",null,"% Loss",null,"% Loss",null,"% Loss",null,"% Loss"]
["Dry Wt After Wash",null,null,{"$f":"IF(ISBLANK(C28),\" \",IF(ISBLANK(C31),\" \",(C29-C31)/C29*100))","v":" "},null,{"$f":"IF(ISBLANK(E28),\" \",IF(ISBLANK(E31),\" \",(E29-E31)/E29*100))","v":" "},null,{"$f":"IF(ISBLANK(G28),\" \",IF(ISBLANK(G31),\" \",(G29-G31)/G29*100))","v":" "},null,{"$f":"IF(ISBLANK(I28),\" \",IF(ISBLANK(I31),\" \",(I29-I31)/I29*100))","v":" "},null,{"$f":"IF(ISBLANK(K28),\" \",IF(ISBLANK(K31),\" \",(K29-K31)/K29*100))","v":" "},null,{"$f":"IF(ISBLANK(M28),\" \",IF(ISBLANK(M31),\" \",(M29-M31)/M29*100))","v":" "}]
["Wt. Loss",null,{"$f":"IF(ISBLANK(C28),\" \",IF(ISBLANK(C29),\" \",C28-C29))","v":" "},null,{"$f":"IF(ISBLANK(E28),\" \",IF(ISBLANK(E29),\" \",E28-E29))","v":" "},null,{"$f":"IF(ISBLANK(G28),\" \",IF(ISBLANK(G29),\" \",G28-G29))","v":" "},null,{"$f":"IF(ISBLANK(I28),\" \",IF(ISBLANK(I29),\" \",I28-I29))","v":" "},null,{"$f":"IF(ISBLANK(K28),\" \",IF(ISBLANK(K29),\" \",K28-K29))","v":" "},null,{"$f":"IF(ISBLANK(M28),\" \",IF(ISBLANK(M29),\" \",M28-M29))","v":" "}]
[100,0.375,null,{"$f":"IF(ISBLANK(C$28),\"  \",IF(ISBLANK(C$29),\" \",IF(ISBLANK(C31),\" \",ROUND((C31+C$30)/C$28*100,1))))","v":"  "},null,{"$f":"IF(ISBLANK(E$28),\"  \",IF(ISBLANK(E$29),\" \",IF(ISBLANK(E31),\" \",ROUND((E31+E$30)/E$28*100,1))))","v":"  "},null,{"$f":"IF(ISBLANK(G$28),\"  \",IF(ISBLANK(G$29),\" \",IF(ISBLANK(G31),\" \",ROUND((G31+G$30)/G$28*100,1))))","v":"  "},null,{"$f":"IF(ISBLANK(I$28),\"  \",IF(ISBLANK(I$29),\" \",IF(ISBLANK(I31),\" \",ROUND((I31+I$30)/I$28*100,1))))","v":"  "},null,{"$f":"IF(ISBLANK(K$28),\"  \",IF(ISBLANK(K$29),\" \",IF(ISBLANK(K31),\" \",ROUND((K31+K$30)/K$28*100,1))))","v":"  "},null,{"$f":"IF(ISBLANK(M$28),\"  \",IF(ISBLANK(M$29),\" \",IF(ISBLANK(M31),\" \",ROUND((M31+M$30)/M$28*100,1))))","v":"  "}]
[{"$f":"IF($M$4=\"B1\",\"95-100\",IF($M$4=\"B2\",\"100\",IF($M$4=\"B3\",\"80-100\",IF($M$4,\" \",\"95-100\"))))","v":"80-100"},4,null,{"$f":"IF(ISBLANK(C$28),\"  \",IF(ISBLANK(C$29),\" \",IF(ISBLANK(C32),\" \",ROUND((C32+C$30)/C$28*100,0))))","v":"  "},null,{"$f":"IF(ISBLANK(E$28),\"  \",IF(ISBLANK(E$29),\" \",IF(ISBLANK(E32),\" \",ROUND((E32+E$30)/E$28*100,0))))","v":"  "},null,{"$f":"IF(ISBLANK(G$28),\"  \",IF(ISBLANK(G$29),\" \",IF(ISBLANK(G32),\" \",ROUND((G32+G$30)/G$28*100,0))))","v":"  "},null,{"$f":"IF(ISBLANK(I$28),\"  \",IF(ISBLANK(I$29),\" \",IF(ISBLANK(I32),\" \",ROUND((I32+I$30)/I$28*100,0))))","v":"  "},null,{"$f":"IF(ISBLANK(K$28),\"  \",IF(ISBLANK(K$29),\" \",IF(ISBLANK(K32),\" \",ROUND((K32+K$30)/K$28*100,0))))","v":"  "},null,{"$f":"IF(ISBLANK(M$28),\"  \",IF(ISBLANK(M$29),\" \",IF(ISBLANK(M32),\" \",ROUND((M32+M$30)/M$28*100,0))))","v":"  "}]
[{"$f":"IF($M$4=\"B1\",\"70-100\",IF($M$4=\"B2\",\"95-100\",IF($M$4=\"B3\",\"65-100\",IF($M$4,\" \",\"70-100\"))))","v":"65-100"},8,null,"  ",null,"  ",null,"  ",null,"  ",null,"  ",null,"  "]
[{"$f":"IF($M$4=\"B1\",\"40-80\",IF($M$4=\"B2\",\"85-100\",IF($M$4=\"B3\",\"40-80\",IF($M$4,\" \",\"40-80\"))))","v":"40-80"},16,null,"  ",null,"  ",null,"  ",null,"  ",null,"  ",null,"  "]
[{"$f":"IF($M$4=\"B1\",\"20-65\",IF($M$4=\"B2\",\"65-90\",IF($M$4=\"B3\",\"20-65\",IF($M$4,\" \",\"25-65\"))))","v":"20-65"},30,null,"  ",null,"  ",null,"  ",null,"  ",null,"  ",null,"  "]
[{"$f":"IF($M$4=\"B1\",\"7-40\",IF($M$4=\"B2\",\"30-60\",IF($M$4=\"B3\",\"7-40\",IF($M$4,\" \",\"7-40\"))))","v":"7-40"},50,null,"  ",null,"  ",null,"  ",null,"  ",null,"  ",null,"  "]
[{"$f":"IF($M$4=\"B1\",\"2-20\",IF($M$4=\"B2\",\"5-25\",IF($M$4=\"B3\",\"2-20\",IF($M$4,\" \",\"2-20\"))))","v":"2-20"},100,null,"  ",null,"  ",null,"  ",null,"  ",null,"  ",null,"  "]
[{"$f":"IF($M$4=\"B1\",\"0-10\",IF($M$4=\"B2\",\"0-5\",IF($M$4=\"B3\",\"0-10\",IF($M$4,\" \",\"0-10\"))))","v":"0-10"},200,null,{"$f":"IF(ISBLANK(C$28),\"  \",IF(ISBLANK(C$29),\" \",IF(ISBLANK(C38),\" \",ROUND((C38+C$30)/C$28*100,2))))","v":"  "},null,{"$f":"IF(ISBLANK(E$28),\"  \",IF(ISBLANK(E$29),\" \",IF(ISBLANK(E38),\" \",ROUND((E38+E$30)/E$28*100,2))))","v":"  "},null,{"$f":"IF(ISBLANK(G$28),\"  \",IF(ISBLANK(G$29),\" \",IF(ISBLANK(G38),\" \",ROUND((G38+G$30)/G$28*100,2))))","v":"  "},null,{"$f":"IF(ISBLANK(I$28),\"  \",IF(ISBLANK(I$29),\" \",IF(ISBLANK(I38),\" \",ROUND((I38+I$30)/I$28*100,2))))","v":"  "},null,{"$f":"IF(ISBLANK(K$28),\"  \",IF(ISBLANK(K$29),\" \",IF(ISBLANK(K38),\" \",ROUND((K38+K$30)/K$28*100,2))))","v":"  "},null,{"$f":"IF(ISBLANK(M$28),\"  \",IF(ISBLANK(M$29),\" \",IF(ISBLANK(M38),\" \",ROUND((M38+M$30)/M$28*100,2))))","v":"  "}]
["Tested By"]
["Remarks"]

{"sheet":"S7","index":6,"n_rows":40,"n_cols":14,"rows_kept":40,"cut":false,"hidden":true,"merged":[[11,6,11,7],[11,8,11,9],[11,10,11,11],[11,12,11,13],[29,2,29,3],[29,4,29,5],[29,6,29,7],[29,8,29,9],[29,10,29,11],[29,12,29,13],[20,10,20,11],[20,12,20,13],[21,6,23,7],[21,8,23,9],[21,10,23,11],[21,12,23,13],[10,0,10,1],[9,0,9,1],[7,10,7,11],[0,0,3,1],[1,10,1,11],[0,8,3,9],[1,2,1,7],[2,2,2,7],[3,2,3,7],[4,0,4,1],[5,3,5,8],[7,8,7,9],[7,2,7,3],[7,4,7,5],[7,6,7,7],[6,3,6,8],[27,0,27,1],[25,0,25,1],[25,2,25,3],[25,4,25,5],[11,0,11,1],[11,2,11,3],[11,4,11,5],[21,0,23,1],[21,2,23,3],[21,4,23,5],[20,0,20,1],[20,2,20,3],[20,4,20,5],[29,0,29,1],[1,12,1,13],[2,10,2,11],[2,12,2,13],[3,10,3,11],[3,12,3,13],[7,12,7,13],[8,0,8,1],[8,2,8,3],[8,4,8,5],[8,6,8,7],[8,8,8,9],[8,10,8,11],[7,0,7,1],[8,12,8,13],[28,0,28,1],[20,6,20,7],[20,8,20,9],[25,12,25,13],[26,0,26,1],[26,2,26,3],[26,4,26,5],[26,6,26,7],[26,8,26,9],[26,10,26,11],[26,12,26,13],[25,6,25,7],[25,8,25,9],[25,10,25,11],[38,10,38,11],[38,12,38,13],[39,0,41,1],[39,2,41,3],[39,4,41,5],[39,6,41,7],[39,8,41,9],[39,10,41,11],[39,12,41,13],[38,0,38,1],[38,2,38,3],[38,4,38,5],[38,6,38,7],[38,8,38,9]]}
[]
[null,null,"COMMONWEALTH OF PENNSYLVANIA",null,null,null,null,null,null,null,"DISTRICT",null,{"$f":"IF(ISBLANK('S1'!M2),\" \",'S1'!M2)","v":" "}]
[null,null,"DEPARTMENT OF TRANSPORTATION",null,null,null,null,null,null,null,"PLANT CODE",null,{"$f":"IF(ISBLANK('S1'!M3),\" \",'S1'!M3)","v":" "}]
[null,null,"PENNSYLVANIA TURNPIKE COMMISSION",null,null,null,null,null,null,null,"AGG SIZE",null,{"$f":"IF(ISBLANK('S1'!M4),\" \",'S1'!M4)","v":"B3"}]
[{"$f":"'S1'!A5","v":"Aggregate 2023"}]
[null,null,null,"Material Test Results for Type A Fine Aggregate"]
[null,null,null,"Washed Gradation"]
["Sample No."]
["Date"]
["St Wt Before Wash",null,null,"% Loss",null,"% Loss",null,"% Loss",null,"% Loss",null,"% Loss",null,"% Loss"]
["Dry Wt After Wash",null,null,{"$f":"IF(ISBLANK(C10),\" \",IF(ISBLANK(C13),\" \",(C11-C13)/C11*100))","v":" "},null,{"$f":"IF(ISBLANK(E10),\" \",IF(ISBLANK(E13),\" \",(E11-E13)/E11*100))","v":" "},null,{"$f":"IF(ISBLANK(G10),\" \",IF(ISBLANK(G13),\" \",(G11-G13)/G11*100))","v":" "},null,{"$f":"IF(ISBLANK(I10),\" \",IF(ISBLANK(I13),\" \",(I11-I13)/I11*100))","v":" "},null,{"$f":"IF(ISBLANK(K10),\" \",IF(ISBLANK(K13),\" \",(K11-K13)/K11*100))","v":" "},null,{"$f":"IF(ISBLANK(M10),\" \",IF(ISBLANK(M13),\" \",(M11-M13)/M11*100))","v":" "}]
["Wt. Loss",null,{"$f":"IF(ISBLANK(C10),\" \",IF(ISBLANK(C11),\" \",C10-C11))","v":" "},null,{"$f":"IF(ISBLANK(E10),\" \",IF(ISBLANK(E11),\" \",E10-E11))","v":" "},null,{"$f":"IF(ISBLANK(G10),\" \",IF(ISBLANK(G11),\" \",G10-G11))","v":" "},null,{"$f":"IF(ISBLANK(I10),\" \",IF(ISBLANK(I11),\" \",I10-I11))","v":" "},null,{"$f":"IF(ISBLANK(K10),\" \",IF(ISBLANK(K11),\" \",K10-K11))","v":" "},null,{"$f":"IF(ISBLANK(M10),\" \",IF(ISBLANK(M11),\" \",M10-M11))","v":" "}]
[100,0.375,null,{"$f":"IF(ISBLANK(C$10),\"  \",IF(ISBLANK(C$11),\" \",IF(ISBLANK(C13),\" \",ROUND((C13+C$12)/C$10*100,1))))","v":"  "},null,{"$f":"IF(ISBLANK(E$10),\"  \",IF(ISBLANK(E$11),\" \",IF(ISBLANK(E13),\" \",ROUND((E13+E$12)/E$10*100,1))))","v":"  "},null,{"$f":"IF(ISBLANK(G$10),\"  \",IF(ISBLANK(G$11),\" \",IF(ISBLANK(G13),\" \",ROUND((G13+G$12)/G$10*100,1))))","v":"  "},null,{"$f":"IF(ISBLANK(I$10),\"  \",IF(ISBLANK(I$11),\" \",IF(ISBLANK(I13),\" \",ROUND((I13+I$12)/I$10*100,1))))","v":"  "},null,{"$f":"IF(ISBLANK(K$10),\"  \",IF(ISBLANK(K$11),\" \",IF(ISBLANK(K13),\" \",ROUND((K13+K$12)/K$10*100,1))))","v":"  "},null,{"$f":"IF(ISBLANK(M$10),\"  \",IF(ISBLANK(M$11),\" \",IF(ISBLANK(M13),\" \",ROUND((M13+M$12)/M$10*100,1))))","v":"  "}]
[{"$f":"IF($M$4=\"B1\",\"95-100\",IF($M$4=\"B2\",\"100\",IF($M$4=\"B3\",\"80-100\",IF($M$4,\" \",\"95-100\"))))","v":"80-100"},4,null,{"$f":"IF(ISBLANK(C$10),\"  \",IF(ISBLANK(C$11),\" \",IF(ISBLANK(C14),\" \",ROUND((C14+C$12)/C$10*100,0))))","v":"  "},null,{"$f":"IF(ISBLANK(E$10),\"  \",IF(ISBLANK(E$11),\" \",IF(ISBLANK(E14),\" \",ROUND((E14+E$12)/E$10*100,0))))","v":"  "},null,{"$f":"IF(ISBLANK(G$10),\"  \",IF(ISBLANK(G$11),\" \",IF(ISBLANK(G14),\" \",ROUND((G14+G$12)/G$10*100,0))))","v":"  "},null,{"$f":"IF(ISBLANK(I$10),\"  \",IF(ISBLANK(I$11),\" \",IF(ISBLANK(I14),\" \",ROUND((I14+I$12)/I$10*100,0))))","v":"  "},null,{"$f":"IF(ISBLANK(K$10),\"  \",IF(ISBLANK(K$11),\" \",IF(ISBLANK(K14),\" \",ROUND((K14+K$12)/K$10*100,0))))","v":"  "},null,{"$f":"IF(ISBLANK(M$10),\"  \",IF(ISBLANK(M$11),\" \",IF(ISBLANK(M14),\" \",ROUND((M14+M$12)/M$10*100,0))))","v":"  "}]
[{"$f":"IF($M$4=\"B1\",\"70-100\",IF($M$4=\"B2\",\"95-100\",IF($M$4=\"B3\",\"65-100\",IF($M$4,\" \",\"70-100\"))))","v":"65-100"},8,null,"  ",null,"  ",null,"  ",null,"  ",null,"  ",null,"  "]
[{"$f":"IF($M$4=\"B1\",\"40-80\",IF($M$4=\"B2\",\"85-100\",IF($M$4=\"B3\",\"40-80\",IF($M$4,\" \",\"40-80\"))))","v":"40-80"},16,null,"  ",null,"  ",null,"  ",null,"  ",null,"  ",null,"  "]
[{"$f":"IF($M$4=\"B1\",\"20-65\",IF($M$4=\"B2\",\"65-90\",IF($M$4=\"B3\",\"20-65\",IF($M$4,\" \",\"25-65\"))))","v":"20-65"},30,null,"  ",null,"  ",null,"  ",null,"  ",null,"  ",null,"  "]
[{"$f":"IF($M$4=\"B1\",\"7-40\",IF($M$4=\"B2\",\"30-60\",IF($M$4=\"B3\",\"7-40\",IF($M$4,\" \",\"7-40\"))))","v":"7-40"},50,null,"  ",null,"  ",null,"  ",null,"  ",null,"  ",null,"  "]
[{"$f":"IF($M$4=\"B1\",\"2-20\",IF($M$4=\"B2\",\"5-25\",IF($M$4=\"B3\",\"2-20\",IF($M$4,\" \",\"2-20\"))))","v":"2-20"},100,null,"  ",null,"  ",null,"  ",null,"  ",null,"  ",null,"  "]
[{"$f":"IF($M$4=\"B1\",\"0-10\",IF($M$4=\"B2\",\"0-5\",IF($M$4=\"B3\",\"0-10\",IF($M$4,\" \",\"0-10\"))))","v":"0-10"},200,null,{"$f":"IF(ISBLANK(C$10),\"  \",IF(ISBLANK(C$11),\" \",IF(ISBLANK(C20),\" \",ROUND((C20+C$12)/C$10*100,2))))","v":"  "},null,{"$f":"IF(ISBLANK(E$10),\"  \",IF(ISBLANK(E$11),\" \",IF(ISBLANK(E20),\" \",ROUND((E20+E$12)/E$10*100,2))))","v":"  "},null,{"$f":"IF(ISBLANK(G$10),\"  \",IF(ISBLANK(G$11),\" \",IF(ISBLANK(G20),\" \",ROUND((G20+G$12)/G$10*100,2))))","v":"  "},null,{"$f":"IF(ISBLANK(I$10),\"  \",IF(ISBLANK(I$11),\" \",IF(ISBLANK(I20),\" \",ROUND((I20+I$12)/I$10*100,2))))","v":"  "},null,{"$f":"IF(ISBLANK(K$10),\"  \",IF(ISBLANK(K$11),\" \",IF(ISBLANK(K20),\" \",ROUND((K20+K$12)/K$10*100,2))))","v":"  "},null,{"$f":"IF(ISBLANK(M$10),\"  \",IF(ISBLANK(M$11),\" \",IF(ISBLANK(M20),\" \",ROUND((M20+M$12)/M$10*100,2))))","v":"  "}]
["Tested By"]
["Remarks"]
[]
[]
[]
["Sample No."]
["Date"]
["St Wt Before Wash",null,null,"% Loss",null,"% Loss",null,"% Loss",null,"% Loss",null,"% Loss",null,"% Loss"]
["Dry Wt After Wash",null,null,{"$f":"IF(ISBLANK(C28),\" \",IF(ISBLANK(C31),\" \",(C29-C31)/C29*100))","v":" "},null,{"$f":"IF(ISBLANK(E28),\" \",IF(ISBLANK(E31),\" \",(E29-E31)/E29*100))","v":" "},null,{"$f":"IF(ISBLANK(G28),\" \",IF(ISBLANK(G31),\" \",(G29-G31)/G29*100))","v":" "},null,{"$f":"IF(ISBLANK(I28),\" \",IF(ISBLANK(I31),\" \",(I29-I31)/I29*100))","v":" "},null,{"$f":"IF(ISBLANK(K28),\" \",IF(ISBLANK(K31),\" \",(K29-K31)/K29*100))","v":" "},null,{"$f":"IF(ISBLANK(M28),\" \",IF(ISBLANK(M31),\" \",(M29-M31)/M29*100))","v":" "}]
["Wt. Loss",null,{"$f":"IF(ISBLANK(C28),\" \",IF(ISBLANK(C29),\" \",C28-C29))","v":" "},null,{"$f":"IF(ISBLANK(E28),\" \",IF(ISBLANK(E29),\" \",E28-E29))","v":" "},null,{"$f":"IF(ISBLANK(G28),\" \",IF(ISBLANK(G29),\" \",G28-G29))","v":" "},null,{"$f":"IF(ISBLANK(I28),\" \",IF(ISBLANK(I29),\" \",I28-I29))","v":" "},null,{"$f":"IF(ISBLANK(K28),\" \",IF(ISBLANK(K29),\" \",K28-K29))","v":" "},null,{"$f":"IF(ISBLANK(M28),\" \",IF(ISBLANK(M29),\" \",M28-M29))","v":" "}]
[100,0.375,null,{"$f":"IF(ISBLANK(C$28),\"  \",IF(ISBLANK(C$29),\" \",IF(ISBLANK(C31),\" \",ROUND((C31+C$30)/C$28*100,1))))","v":"  "},null,{"$f":"IF(ISBLANK(E$28),\"  \",IF(ISBLANK(E$29),\" \",IF(ISBLANK(E31),\" \",ROUND((E31+E$30)/E$28*100,1))))","v":"  "},null,{"$f":"IF(ISBLANK(G$28),\"  \",IF(ISBLANK(G$29),\" \",IF(ISBLANK(G31),\" \",ROUND((G31+G$30)/G$28*100,1))))","v":"  "},null,{"$f":"IF(ISBLANK(I$28),\"  \",IF(ISBLANK(I$29),\" \",IF(ISBLANK(I31),\" \",ROUND((I31+I$30)/I$28*100,1))))","v":"  "},null,{"$f":"IF(ISBLANK(K$28),\"  \",IF(ISBLANK(K$29),\" \",IF(ISBLANK(K31),\" \",ROUND((K31+K$30)/K$28*100,1))))","v":"  "},null,{"$f":"IF(ISBLANK(M$28),\"  \",IF(ISBLANK(M$29),\" \",IF(ISBLANK(M31),\" \",ROUND((M31+M$30)/M$28*100,1))))","v":"  "}]
[{"$f":"IF($M$4=\"B1\",\"95-100\",IF($M$4=\"B2\",\"100\",IF($M$4=\"B3\",\"80-100\",IF($M$4,\" \",\"95-100\"))))","v":"80-100"},4,null,{"$f":"IF(ISBLANK(C$28),\"  \",IF(ISBLANK(C$29),\" \",IF(ISBLANK(C32),\" \",ROUND((C32+C$30)/C$28*100,0))))","v":"  "},null,{"$f":"IF(ISBLANK(E$28),\"  \",IF(ISBLANK(E$29),\" \",IF(ISBLANK(E32),\" \",ROUND((E32+E$30)/E$28*100,0))))","v":"  "},null,{"$f":"IF(ISBLANK(G$28),\"  \",IF(ISBLANK(G$29),\" \",IF(ISBLANK(G32),\" \",ROUND((G32+G$30)/G$28*100,0))))","v":"  "},null,{"$f":"IF(ISBLANK(I$28),\"  \",IF(ISBLANK(I$29),\" \",IF(ISBLANK(I32),\" \",ROUND((I32+I$30)/I$28*100,0))))","v":"  "},null,{"$f":"IF(ISBLANK(K$28),\"  \",IF(ISBLANK(K$29),\" \",IF(ISBLANK(K32),\" \",ROUND((K32+K$30)/K$28*100,0))))","v":"  "},null,{"$f":"IF(ISBLANK(M$28),\"  \",IF(ISBLANK(M$29),\" \",IF(ISBLANK(M32),\" \",ROUND((M32+M$30)/M$28*100,0))))","v":"  "}]
[{"$f":"IF($M$4=\"B1\",\"70-100\",IF($M$4=\"B2\",\"95-100\",IF($M$4=\"B3\",\"65-100\",IF($M$4,\" \",\"70-100\"))))","v":"65-100"},8,null,"  ",null,"  ",null,"  ",null,"  ",null,"  ",null,"  "]
[{"$f":"IF($M$4=\"B1\",\"40-80\",IF($M$4=\"B2\",\"85-100\",IF($M$4=\"B3\",\"40-80\",IF($M$4,\" \",\"40-80\"))))","v":"40-80"},16,null,"  ",null,"  ",null,"  ",null,"  ",null,"  ",null,"  "]
[{"$f":"IF($M$4=\"B1\",\"20-65\",IF($M$4=\"B2\",\"65-90\",IF($M$4=\"B3\",\"20-65\",IF($M$4,\" \",\"25-65\"))))","v":"20-65"},30,null,"  ",null,"  ",null,"  ",null,"  ",null,"  ",null,"  "]
[{"$f":"IF($M$4=\"B1\",\"7-40\",IF($M$4=\"B2\",\"30-60\",IF($M$4=\"B3\",\"7-40\",IF($M$4,\" \",\"7-40\"))))","v":"7-40"},50,null,"  ",null,"  ",null,"  ",null,"  ",null,"  ",null,"  "]
[{"$f":"IF($M$4=\"B1\",\"2-20\",IF($M$4=\"B2\",\"5-25\",IF($M$4=\"B3\",\"2-20\",IF($M$4,\" \",\"2-20\"))))","v":"2-20"},100,null,"  ",null,"  ",null,"  ",null,"  ",null,"  ",null,"  "]
[{"$f":"IF($M$4=\"B1\",\"0-10\",IF($M$4=\"B2\",\"0-5\",IF($M$4=\"B3\",\"0-10\",IF($M$4,\" \",\"0-10\"))))","v":"0-10"},200,null,{"$f":"IF(ISBLANK(C$28),\"  \",IF(ISBLANK(C$29),\" \",IF(ISBLANK(C38),\" \",ROUND((C38+C$30)/C$28*100,2))))","v":"  "},null,{"$f":"IF(ISBLANK(E$28),\"  \",IF(ISBLANK(E$29),\" \",IF(ISBLANK(E38),\" \",ROUND((E38+E$30)/E$28*100,2))))","v":"  "},null,{"$f":"IF(ISBLANK(G$28),\"  \",IF(ISBLANK(G$29),\" \",IF(ISBLANK(G38),\" \",ROUND((G38+G$30)/G$28*100,2))))","v":"  "},null,{"$f":"IF(ISBLANK(I$28),\"  \",IF(ISBLANK(I$29),\" \",IF(ISBLANK(I38),\" \",ROUND((I38+I$30)/I$28*100,2))))","v":"  "},null,{"$f":"IF(ISBLANK(K$28),\"  \",IF(ISBLANK(K$29),\" \",IF(ISBLANK(K38),\" \",ROUND((K38+K$30)/K$28*100,2))))","v":"  "},null,{"$f":"IF(ISBLANK(M$28),\"  \",IF(ISBLANK(M$29),\" \",IF(ISBLANK(M38),\" \",ROUND((M38+M$30)/M$28*100,2))))","v":"  "}]
["Tested By"]
["Remarks"]

{"sheet":"S8","index":7,"n_rows":40,"n_cols":14,"rows_kept":40,"cut":false,"hidden":true,"merged":[[11,6,11,7],[11,8,11,9],[11,10,11,11],[11,12,11,13],[29,2,29,3],[29,4,29,5],[29,6,29,7],[29,8,29,9],[29,10,29,11],[29,12,29,13],[20,10,20,11],[20,12,20,13],[21,6,23,7],[21,8,23,9],[21,10,23,11],[21,12,23,13],[10,0,10,1],[9,0,9,1],[7,10,7,11],[0,0,3,1],[1,10,1,11],[0,8,3,9],[1,2,1,7],[2,2,2,7],[3,2,3,7],[4,0,4,1],[5,3,5,8],[7,8,7,9],[7,2,7,3],[7,4,7,5],[7,6,7,7],[6,3,6,8],[27,0,27,1],[25,0,25,1],[25,2,25,3],[25,4,25,5],[11,0,11,1],[11,2,11,3],[11,4,11,5],[21,0,23,1],[21,2,23,3],[21,4,23,5],[20,0,20,1],[20,2,20,3],[20,4,20,5],[29,0,29,1],[1,12,1,13],[2,10,2,11],[2,12,2,13],[3,10,3,11],[3,12,3,13],[7,12,7,13],[8,0,8,1],[8,2,8,3],[8,4,8,5],[8,6,8,7],[8,8,8,9],[8,10,8,11],[7,0,7,1],[8,12,8,13],[28,0,28,1],[20,6,20,7],[20,8,20,9],[25,12,25,13],[26,0,26,1],[26,2,26,3],[26,4,26,5],[26,6,26,7],[26,8,26,9],[26,10,26,11],[26,12,26,13],[25,6,25,7],[25,8,25,9],[25,10,25,11],[38,10,38,11],[38,12,38,13],[39,0,41,1],[39,2,41,3],[39,4,41,5],[39,6,41,7],[39,8,41,9],[39,10,41,11],[39,12,41,13],[38,0,38,1],[38,2,38,3],[38,4,38,5],[38,6,38,7],[38,8,38,9]]}
[]
[null,null,"COMMONWEALTH OF PENNSYLVANIA",null,null,null,null,null,null,null,"DISTRICT",null,{"$f":"IF(ISBLANK('S1'!M2),\" \",'S1'!M2)","v":" "}]
[null,null,"DEPARTMENT OF TRANSPORTATION",null,null,null,null,null,null,null,"PLANT CODE",null,{"$f":"IF(ISBLANK('S1'!M3),\" \",'S1'!M3)","v":" "}]
[null,null,"PENNSYLVANIA TURNPIKE COMMISSION",null,null,null,null,null,null,null,"AGG SIZE",null,{"$f":"IF(ISBLANK('S1'!M4),\" \",'S1'!M4)","v":"B3"}]
[{"$f":"'S1'!A5","v":"Aggregate 2023"}]
[null,null,null,"Material Test Results for Type A Fine Aggregate"]
[null,null,null,"Washed Gradation"]
["Sample No."]
["Date"]
["St Wt Before Wash",null,null,"% Loss",null,"% Loss",null,"% Loss",null,"% Loss",null,"% Loss",null,"% Loss"]
["Dry Wt After Wash",null,null,{"$f":"IF(ISBLANK(C10),\" \",IF(ISBLANK(C13),\" \",(C11-C13)/C11*100))","v":" "},null,{"$f":"IF(ISBLANK(E10),\" \",IF(ISBLANK(E13),\" \",(E11-E13)/E11*100))","v":" "},null,{"$f":"IF(ISBLANK(G10),\" \",IF(ISBLANK(G13),\" \",(G11-G13)/G11*100))","v":" "},null,{"$f":"IF(ISBLANK(I10),\" \",IF(ISBLANK(I13),\" \",(I11-I13)/I11*100))","v":" "},null,{"$f":"IF(ISBLANK(K10),\" \",IF(ISBLANK(K13),\" \",(K11-K13)/K11*100))","v":" "},null,{"$f":"IF(ISBLANK(M10),\" \",IF(ISBLANK(M13),\" \",(M11-M13)/M11*100))","v":" "}]
["Wt. Loss",null,{"$f":"IF(ISBLANK(C10),\" \",IF(ISBLANK(C11),\" \",C10-C11))","v":" "},null,{"$f":"IF(ISBLANK(E10),\" \",IF(ISBLANK(E11),\" \",E10-E11))","v":" "},null,{"$f":"IF(ISBLANK(G10),\" \",IF(ISBLANK(G11),\" \",G10-G11))","v":" "},null,{"$f":"IF(ISBLANK(I10),\" \",IF(ISBLANK(I11),\" \",I10-I11))","v":" "},null,{"$f":"IF(ISBLANK(K10),\" \",IF(ISBLANK(K11),\" \",K10-K11))","v":" "},null,{"$f":"IF(ISBLANK(M10),\" \",IF(ISBLANK(M11),\" \",M10-M11))","v":" "}]
[100,0.375,null,{"$f":"IF(ISBLANK(C$10),\"  \",IF(ISBLANK(C$11),\" \",IF(ISBLANK(C13),\" \",ROUND((C13+C$12)/C$10*100,1))))","v":"  "},null,{"$f":"IF(ISBLANK(E$10),\"  \",IF(ISBLANK(E$11),\" \",IF(ISBLANK(E13),\" \",ROUND((E13+E$12)/E$10*100,1))))","v":"  "},null,{"$f":"IF(ISBLANK(G$10),\"  \",IF(ISBLANK(G$11),\" \",IF(ISBLANK(G13),\" \",ROUND((G13+G$12)/G$10*100,1))))","v":"  "},null,{"$f":"IF(ISBLANK(I$10),\"  \",IF(ISBLANK(I$11),\" \",IF(ISBLANK(I13),\" \",ROUND((I13+I$12)/I$10*100,1))))","v":"  "},null,{"$f":"IF(ISBLANK(K$10),\"  \",IF(ISBLANK(K$11),\" \",IF(ISBLANK(K13),\" \",ROUND((K13+K$12)/K$10*100,1))))","v":"  "},null,{"$f":"IF(ISBLANK(M$10),\"  \",IF(ISBLANK(M$11),\" \",IF(ISBLANK(M13),\" \",ROUND((M13+M$12)/M$10*100,1))))","v":"  "}]
[{"$f":"IF($M$4=\"B1\",\"95-100\",IF($M$4=\"B2\",\"100\",IF($M$4=\"B3\",\"80-100\",IF($M$4,\" \",\"95-100\"))))","v":"80-100"},4,null,{"$f":"IF(ISBLANK(C$10),\"  \",IF(ISBLANK(C$11),\" \",IF(ISBLANK(C14),\" \",ROUND((C14+C$12)/C$10*100,0))))","v":"  "},null,{"$f":"IF(ISBLANK(E$10),\"  \",IF(ISBLANK(E$11),\" \",IF(ISBLANK(E14),\" \",ROUND((E14+E$12)/E$10*100,0))))","v":"  "},null,{"$f":"IF(ISBLANK(G$10),\"  \",IF(ISBLANK(G$11),\" \",IF(ISBLANK(G14),\" \",ROUND((G14+G$12)/G$10*100,0))))","v":"  "},null,{"$f":"IF(ISBLANK(I$10),\"  \",IF(ISBLANK(I$11),\" \",IF(ISBLANK(I14),\" \",ROUND((I14+I$12)/I$10*100,0))))","v":"  "},null,{"$f":"IF(ISBLANK(K$10),\"  \",IF(ISBLANK(K$11),\" \",IF(ISBLANK(K14),\" \",ROUND((K14+K$12)/K$10*100,0))))","v":"  "},null,{"$f":"IF(ISBLANK(M$10),\"  \",IF(ISBLANK(M$11),\" \",IF(ISBLANK(M14),\" \",ROUND((M14+M$12)/M$10*100,0))))","v":"  "}]
[{"$f":"IF($M$4=\"B1\",\"70-100\",IF($M$4=\"B2\",\"95-100\",IF($M$4=\"B3\",\"65-100\",IF($M$4,\" \",\"70-100\"))))","v":"65-100"},8,null,"  ",null,"  ",null,"  ",null,"  ",null,"  ",null,"  "]
[{"$f":"IF($M$4=\"B1\",\"40-80\",IF($M$4=\"B2\",\"85-100\",IF($M$4=\"B3\",\"40-80\",IF($M$4,\" \",\"40-80\"))))","v":"40-80"},16,null,"  ",null,"  ",null,"  ",null,"  ",null,"  ",null,"  "]
[{"$f":"IF($M$4=\"B1\",\"20-65\",IF($M$4=\"B2\",\"65-90\",IF($M$4=\"B3\",\"20-65\",IF($M$4,\" \",\"25-65\"))))","v":"20-65"},30,null,"  ",null,"  ",null,"  ",null,"  ",null,"  ",null,"  "]
[{"$f":"IF($M$4=\"B1\",\"7-40\",IF($M$4=\"B2\",\"30-60\",IF($M$4=\"B3\",\"7-40\",IF($M$4,\" \",\"7-40\"))))","v":"7-40"},50,null,"  ",null,"  ",null,"  ",null,"  ",null,"  ",null,"  "]
[{"$f":"IF($M$4=\"B1\",\"2-20\",IF($M$4=\"B2\",\"5-25\",IF($M$4=\"B3\",\"2-20\",IF($M$4,\" \",\"2-20\"))))","v":"2-20"},100,null,"  ",null,"  ",null,"  ",null,"  ",null,"  ",null,"  "]
[{"$f":"IF($M$4=\"B1\",\"0-10\",IF($M$4=\"B2\",\"0-5\",IF($M$4=\"B3\",\"0-10\",IF($M$4,\" \",\"0-10\"))))","v":"0-10"},200,null,{"$f":"IF(ISBLANK(C$10),\"  \",IF(ISBLANK(C$11),\" \",IF(ISBLANK(C20),\" \",ROUND((C20+C$12)/C$10*100,2))))","v":"  "},null,{"$f":"IF(ISBLANK(E$10),\"  \",IF(ISBLANK(E$11),\" \",IF(ISBLANK(E20),\" \",ROUND((E20+E$12)/E$10*100,2))))","v":"  "},null,{"$f":"IF(ISBLANK(G$10),\"  \",IF(ISBLANK(G$11),\" \",IF(ISBLANK(G20),\" \",ROUND((G20+G$12)/G$10*100,2))))","v":"  "},null,{"$f":"IF(ISBLANK(I$10),\"  \",IF(ISBLANK(I$11),\" \",IF(ISBLANK(I20),\" \",ROUND((I20+I$12)/I$10*100,2))))","v":"  "},null,{"$f":"IF(ISBLANK(K$10),\"  \",IF(ISBLANK(K$11),\" \",IF(ISBLANK(K20),\" \",ROUND((K20+K$12)/K$10*100,2))))","v":"  "},null,{"$f":"IF(ISBLANK(M$10),\"  \",IF(ISBLANK(M$11),\" \",IF(ISBLANK(M20),\" \",ROUND((M20+M$12)/M$10*100,2))))","v":"  "}]
["Tested By"]
["Remarks"]
[]
[]
[]
["Sample No."]
["Date"]
["St Wt Before Wash",null,null,"% Loss",null,"% Loss",null,"% Loss",null,"% Loss",null,"% Loss",null,"% Loss"]
["Dry Wt After Wash",null,null,{"$f":"IF(ISBLANK(C28),\" \",IF(ISBLANK(C31),\" \",(C29-C31)/C29*100))","v":" "},null,{"$f":"IF(ISBLANK(E28),\" \",IF(ISBLANK(E31),\" \",(E29-E31)/E29*100))","v":" "},null,{"$f":"IF(ISBLANK(G28),\" \",IF(ISBLANK(G31),\" \",(G29-G31)/G29*100))","v":" "},null,{"$f":"IF(ISBLANK(I28),\" \",IF(ISBLANK(I31),\" \",(I29-I31)/I29*100))","v":" "},null,{"$f":"IF(ISBLANK(K28),\" \",IF(ISBLANK(K31),\" \",(K29-K31)/K29*100))","v":" "},null,{"$f":"IF(ISBLANK(M28),\" \",IF(ISBLANK(M31),\" \",(M29-M31)/M29*100))","v":" "}]
["Wt. Loss",null,{"$f":"IF(ISBLANK(C28),\" \",IF(ISBLANK(C29),\" \",C28-C29))","v":" "},null,{"$f":"IF(ISBLANK(E28),\" \",IF(ISBLANK(E29),\" \",E28-E29))","v":" "},null,{"$f":"IF(ISBLANK(G28),\" \",IF(ISBLANK(G29),\" \",G28-G29))","v":" "},null,{"$f":"IF(ISBLANK(I28),\" \",IF(ISBLANK(I29),\" \",I28-I29))","v":" "},null,{"$f":"IF(ISBLANK(K28),\" \",IF(ISBLANK(K29),\" \",K28-K29))","v":" "},null,{"$f":"IF(ISBLANK(M28),\" \",IF(ISBLANK(M29),\" \",M28-M29))","v":" "}]
[100,0.375,null,{"$f":"IF(ISBLANK(C$28),\"  \",IF(ISBLANK(C$29),\" \",IF(ISBLANK(C31),\" \",ROUND((C31+C$30)/C$28*100,1))))","v":"  "},null,{"$f":"IF(ISBLANK(E$28),\"  \",IF(ISBLANK(E$29),\" \",IF(ISBLANK(E31),\" \",ROUND((E31+E$30)/E$28*100,1))))","v":"  "},null,{"$f":"IF(ISBLANK(G$28),\"  \",IF(ISBLANK(G$29),\" \",IF(ISBLANK(G31),\" \",ROUND((G31+G$30)/G$28*100,1))))","v":"  "},null,{"$f":"IF(ISBLANK(I$28),\"  \",IF(ISBLANK(I$29),\" \",IF(ISBLANK(I31),\" \",ROUND((I31+I$30)/I$28*100,1))))","v":"  "},null,{"$f":"IF(ISBLANK(K$28),\"  \",IF(ISBLANK(K$29),\" \",IF(ISBLANK(K31),\" \",ROUND((K31+K$30)/K$28*100,1))))","v":"  "},null,{"$f":"IF(ISBLANK(M$28),\"  \",IF(ISBLANK(M$29),\" \",IF(ISBLANK(M31),\" \",ROUND((M31+M$30)/M$28*100,1))))","v":"  "}]
[{"$f":"IF($M$4=\"B1\",\"95-100\",IF($M$4=\"B2\",\"100\",IF($M$4=\"B3\",\"80-100\",IF($M$4,\" \",\"95-100\"))))","v":"80-100"},4,null,{"$f":"IF(ISBLANK(C$28),\"  \",IF(ISBLANK(C$29),\" \",IF(ISBLANK(C32),\" \",ROUND((C32+C$30)/C$28*100,0))))","v":"  "},null,{"$f":"IF(ISBLANK(E$28),\"  \",IF(ISBLANK(E$29),\" \",IF(ISBLANK(E32),\" \",ROUND((E32+E$30)/E$28*100,0))))","v":"  "},null,{"$f":"IF(ISBLANK(G$28),\"  \",IF(ISBLANK(G$29),\" \",IF(ISBLANK(G32),\" \",ROUND((G32+G$30)/G$28*100,0))))","v":"  "},null,{"$f":"IF(ISBLANK(I$28),\"  \",IF(ISBLANK(I$29),\" \",IF(ISBLANK(I32),\" \",ROUND((I32+I$30)/I$28*100,0))))","v":"  "},null,{"$f":"IF(ISBLANK(K$28),\"  \",IF(ISBLANK(K$29),\" \",IF(ISBLANK(K32),\" \",ROUND((K32+K$30)/K$28*100,0))))","v":"  "},null,{"$f":"IF(ISBLANK(M$28),\"  \",IF(ISBLANK(M$29),\" \",IF(ISBLANK(M32),\" \",ROUND((M32+M$30)/M$28*100,0))))","v":"  "}]
[{"$f":"IF($M$4=\"B1\",\"70-100\",IF($M$4=\"B2\",\"95-100\",IF($M$4=\"B3\",\"65-100\",IF($M$4,\" \",\"70-100\"))))","v":"65-100"},8,null,"  ",null,"  ",null,"  ",null,"  ",null,"  ",null,"  "]
[{"$f":"IF($M$4=\"B1\",\"40-80\",IF($M$4=\"B2\",\"85-100\",IF($M$4=\"B3\",\"40-80\",IF($M$4,\" \",\"40-80\"))))","v":"40-80"},16,null,"  ",null,"  ",null,"  ",null,"  ",null,"  ",null,"  "]
[{"$f":"IF($M$4=\"B1\",\"20-65\",IF($M$4=\"B2\",\"65-90\",IF($M$4=\"B3\",\"20-65\",IF($M$4,\" \",\"25-65\"))))","v":"20-65"},30,null,"  ",null,"  ",null,"  ",null,"  ",null,"  ",null,"  "]
[{"$f":"IF($M$4=\"B1\",\"7-40\",IF($M$4=\"B2\",\"30-60\",IF($M$4=\"B3\",\"7-40\",IF($M$4,\" \",\"7-40\"))))","v":"7-40"},50,null,"  ",null,"  ",null,"  ",null,"  ",null,"  ",null,"  "]
[{"$f":"IF($M$4=\"B1\",\"2-20\",IF($M$4=\"B2\",\"5-25\",IF($M$4=\"B3\",\"2-20\",IF($M$4,\" \",\"2-20\"))))","v":"2-20"},100,null,"  ",null,"  ",null,"  ",null,"  ",null,"  ",null,"  "]
[{"$f":"IF($M$4=\"B1\",\"0-10\",IF($M$4=\"B2\",\"0-5\",IF($M$4=\"B3\",\"0-10\",IF($M$4,\" \",\"0-10\"))))","v":"0-10"},200,null,{"$f":"IF(ISBLANK(C$28),\"  \",IF(ISBLANK(C$29),\" \",IF(ISBLANK(C38),\" \",ROUND((C38+C$30)/C$28*100,2))))","v":"  "},null,{"$f":"IF(ISBLANK(E$28),\"  \",IF(ISBLANK(E$29),\" \",IF(ISBLANK(E38),\" \",ROUND((E38+E$30)/E$28*100,2))))","v":"  "},null,{"$f":"IF(ISBLANK(G$28),\"  \",IF(ISBLANK(G$29),\" \",IF(ISBLANK(G38),\" \",ROUND((G38+G$30)/G$28*100,2))))","v":"  "},null,{"$f":"IF(ISBLANK(I$28),\"  \",IF(ISBLANK(I$29),\" \",IF(ISBLANK(I38),\" \",ROUND((I38+I$30)/I$28*100,2))))","v":"  "},null,{"$f":"IF(ISBLANK(K$28),\"  \",IF(ISBLANK(K$29),\" \",IF(ISBLANK(K38),\" \",ROUND((K38+K$30)/K$28*100,2))))","v":"  "},null,{"$f":"IF(ISBLANK(M$28),\"  \",IF(ISBLANK(M$29),\" \",IF(ISBLANK(M38),\" \",ROUND((M38+M$30)/M$28*100,2))))","v":"  "}]
["Tested By"]
["Remarks"]

{"sheet":"S9","index":8,"n_rows":40,"n_cols":14,"rows_kept":40,"cut":false,"hidden":true,"merged":[[11,6,11,7],[11,8,11,9],[11,10,11,11],[11,12,11,13],[29,2,29,3],[29,4,29,5],[29,6,29,7],[29,8,29,9],[29,10,29,11],[29,12,29,13],[20,10,20,11],[20,12,20,13],[21,6,23,7],[21,8,23,9],[21,10,23,11],[21,12,23,13],[10,0,10,1],[9,0,9,1],[7,10,7,11],[0,0,3,1],[1,10,1,11],[0,8,3,9],[1,2,1,7],[2,2,2,7],[3,2,3,7],[4,0,4,1],[5,3,5,8],[7,8,7,9],[7,2,7,3],[7,4,7,5],[7,6,7,7],[6,3,6,8],[27,0,27,1],[25,0,25,1],[25,2,25,3],[25,4,25,5],[11,0,11,1],[11,2,11,3],[11,4,11,5],[21,0,23,1],[21,2,23,3],[21,4,23,5],[20,0,20,1],[20,2,20,3],[20,4,20,5],[29,0,29,1],[1,12,1,13],[2,10,2,11],[2,12,2,13],[3,10,3,11],[3,12,3,13],[7,12,7,13],[8,0,8,1],[8,2,8,3],[8,4,8,5],[8,6,8,7],[8,8,8,9],[8,10,8,11],[7,0,7,1],[8,12,8,13],[28,0,28,1],[20,6,20,7],[20,8,20,9],[25,12,25,13],[26,0,26,1],[26,2,26,3],[26,4,26,5],[26,6,26,7],[26,8,26,9],[26,10,26,11],[26,12,26,13],[25,6,25,7],[25,8,25,9],[25,10,25,11],[38,10,38,11],[38,12,38,13],[39,0,41,1],[39,2,41,3],[39,4,41,5],[39,6,41,7],[39,8,41,9],[39,10,41,11],[39,12,41,13],[38,0,38,1],[38,2,38,3],[38,4,38,5],[38,6,38,7],[38,8,38,9]]}
[]
[null,null,"COMMONWEALTH OF PENNSYLVANIA",null,null,null,null,null,null,null,"DISTRICT",null,{"$f":"IF(ISBLANK('S1'!M2),\" \",'S1'!M2)","v":" "}]
[null,null,"DEPARTMENT OF TRANSPORTATION",null,null,null,null,null,null,null,"PLANT CODE",null,{"$f":"IF(ISBLANK('S1'!M3),\" \",'S1'!M3)","v":" "}]
[null,null,"PENNSYLVANIA TURNPIKE COMMISSION",null,null,null,null,null,null,null,"AGG SIZE",null,{"$f":"IF(ISBLANK('S1'!M4),\" \",'S1'!M4)","v":"B3"}]
[{"$f":"'S1'!A5","v":"Aggregate 2023"}]
[null,null,null,"Material Test Results for Type A Fine Aggregate"]
[null,null,null,"Washed Gradation"]
["Sample No."]
["Date"]
["St Wt Before Wash",null,null,"% Loss",null,"% Loss",null,"% Loss",null,"% Loss",null,"% Loss",null,"% Loss"]
["Dry Wt After Wash",null,null,{"$f":"IF(ISBLANK(C10),\" \",IF(ISBLANK(C13),\" \",(C11-C13)/C11*100))","v":" "},null,{"$f":"IF(ISBLANK(E10),\" \",IF(ISBLANK(E13),\" \",(E11-E13)/E11*100))","v":" "},null,{"$f":"IF(ISBLANK(G10),\" \",IF(ISBLANK(G13),\" \",(G11-G13)/G11*100))","v":" "},null,{"$f":"IF(ISBLANK(I10),\" \",IF(ISBLANK(I13),\" \",(I11-I13)/I11*100))","v":" "},null,{"$f":"IF(ISBLANK(K10),\" \",IF(ISBLANK(K13),\" \",(K11-K13)/K11*100))","v":" "},null,{"$f":"IF(ISBLANK(M10),\" \",IF(ISBLANK(M13),\" \",(M11-M13)/M11*100))","v":" "}]
["Wt. Loss",null,{"$f":"IF(ISBLANK(C10),\" \",IF(ISBLANK(C11),\" \",C10-C11))","v":" "},null,{"$f":"IF(ISBLANK(E10),\" \",IF(ISBLANK(E11),\" \",E10-E11))","v":" "},null,{"$f":"IF(ISBLANK(G10),\" \",IF(ISBLANK(G11),\" \",G10-G11))","v":" "},null,{"$f":"IF(ISBLANK(I10),\" \",IF(ISBLANK(I11),\" \",I10-I11))","v":" "},null,{"$f":"IF(ISBLANK(K10),\" \",IF(ISBLANK(K11),\" \",K10-K11))","v":" "},null,{"$f":"IF(ISBLANK(M10),\" \",IF(ISBLANK(M11),\" \",M10-M11))","v":" "}]
[100,0.375,null,{"$f":"IF(ISBLANK(C$10),\"  \",IF(ISBLANK(C$11),\" \",IF(ISBLANK(C13),\" \",ROUND((C13+C$12)/C$10*100,1))))","v":"  "},null,{"$f":"IF(ISBLANK(E$10),\"  \",IF(ISBLANK(E$11),\" \",IF(ISBLANK(E13),\" \",ROUND((E13+E$12)/E$10*100,1))))","v":"  "},null,{"$f":"IF(ISBLANK(G$10),\"  \",IF(ISBLANK(G$11),\" \",IF(ISBLANK(G13),\" \",ROUND((G13+G$12)/G$10*100,1))))","v":"  "},null,{"$f":"IF(ISBLANK(I$10),\"  \",IF(ISBLANK(I$11),\" \",IF(ISBLANK(I13),\" \",ROUND((I13+I$12)/I$10*100,1))))","v":"  "},null,{"$f":"IF(ISBLANK(K$10),\"  \",IF(ISBLANK(K$11),\" \",IF(ISBLANK(K13),\" \",ROUND((K13+K$12)/K$10*100,1))))","v":"  "},null,{"$f":"IF(ISBLANK(M$10),\"  \",IF(ISBLANK(M$11),\" \",IF(ISBLANK(M13),\" \",ROUND((M13+M$12)/M$10*100,1))))","v":"  "}]
[{"$f":"IF($M$4=\"B1\",\"95-100\",IF($M$4=\"B2\",\"100\",IF($M$4=\"B3\",\"80-100\",IF($M$4,\" \",\"95-100\"))))","v":"80-100"},4,null,{"$f":"IF(ISBLANK(C$10),\"  \",IF(ISBLANK(C$11),\" \",IF(ISBLANK(C14),\" \",ROUND((C14+C$12)/C$10*100,0))))","v":"  "},null,{"$f":"IF(ISBLANK(E$10),\"  \",IF(ISBLANK(E$11),\" \",IF(ISBLANK(E14),\" \",ROUND((E14+E$12)/E$10*100,0))))","v":"  "},null,{"$f":"IF(ISBLANK(G$10),\"  \",IF(ISBLANK(G$11),\" \",IF(ISBLANK(G14),\" \",ROUND((G14+G$12)/G$10*100,0))))","v":"  "},null,{"$f":"IF(ISBLANK(I$10),\"  \",IF(ISBLANK(I$11),\" \",IF(ISBLANK(I14),\" \",ROUND((I14+I$12)/I$10*100,0))))","v":"  "},null,{"$f":"IF(ISBLANK(K$10),\"  \",IF(ISBLANK(K$11),\" \",IF(ISBLANK(K14),\" \",ROUND((K14+K$12)/K$10*100,0))))","v":"  "},null,{"$f":"IF(ISBLANK(M$10),\"  \",IF(ISBLANK(M$11),\" \",IF(ISBLANK(M14),\" \",ROUND((M14+M$12)/M$10*100,0))))","v":"  "}]
[{"$f":"IF($M$4=\"B1\",\"70-100\",IF($M$4=\"B2\",\"95-100\",IF($M$4=\"B3\",\"65-100\",IF($M$4,\" \",\"70-100\"))))","v":"65-100"},8,null,"  ",null,"  ",null,"  ",null,"  ",null,"  ",null,"  "]
[{"$f":"IF($M$4=\"B1\",\"40-80\",IF($M$4=\"B2\",\"85-100\",IF($M$4=\"B3\",\"40-80\",IF($M$4,\" \",\"40-80\"))))","v":"40-80"},16,null,"  ",null,"  ",null,"  ",null,"  ",null,"  ",null,"  "]
[{"$f":"IF($M$4=\"B1\",\"20-65\",IF($M$4=\"B2\",\"65-90\",IF($M$4=\"B3\",\"20-65\",IF($M$4,\" \",\"25-65\"))))","v":"20-65"},30,null,"  ",null,"  ",null,"  ",null,"  ",null,"  ",null,"  "]
[{"$f":"IF($M$4=\"B1\",\"7-40\",IF($M$4=\"B2\",\"30-60\",IF($M$4=\"B3\",\"7-40\",IF($M$4,\" \",\"7-40\"))))","v":"7-40"},50,null,"  ",null,"  ",null,"  ",null,"  ",null,"  ",null,"  "]
[{"$f":"IF($M$4=\"B1\",\"2-20\",IF($M$4=\"B2\",\"5-25\",IF($M$4=\"B3\",\"2-20\",IF($M$4,\" \",\"2-20\"))))","v":"2-20"},100,null,"  ",null,"  ",null,"  ",null,"  ",null,"  ",null,"  "]
[{"$f":"IF($M$4=\"B1\",\"0-10\",IF($M$4=\"B2\",\"0-5\",IF($M$4=\"B3\",\"0-10\",IF($M$4,\" \",\"0-10\"))))","v":"0-10"},200,null,{"$f":"IF(ISBLANK(C$10),\"  \",IF(ISBLANK(C$11),\" \",IF(ISBLANK(C20),\" \",ROUND((C20+C$12)/C$10*100,2))))","v":"  "},null,{"$f":"IF(ISBLANK(E$10),\"  \",IF(ISBLANK(E$11),\" \",IF(ISBLANK(E20),\" \",ROUND((E20+E$12)/E$10*100,2))))","v":"  "},null,{"$f":"IF(ISBLANK(G$10),\"  \",IF(ISBLANK(G$11),\" \",IF(ISBLANK(G20),\" \",ROUND((G20+G$12)/G$10*100,2))))","v":"  "},null,{"$f":"IF(ISBLANK(I$10),\"  \",IF(ISBLANK(I$11),\" \",IF(ISBLANK(I20),\" \",ROUND((I20+I$12)/I$10*100,2))))","v":"  "},null,{"$f":"IF(ISBLANK(K$10),\"  \",IF(ISBLANK(K$11),\" \",IF(ISBLANK(K20),\" \",ROUND((K20+K$12)/K$10*100,2))))","v":"  "},null,{"$f":"IF(ISBLANK(M$10),\"  \",IF(ISBLANK(M$11),\" \",IF(ISBLANK(M20),\" \",ROUND((M20+M$12)/M$10*100,2))))","v":"  "}]
["Tested By"]
["Remarks"]
[]
[]
[]
["Sample No."]
["Date"]
["St Wt Before Wash",null,null,"% Loss",null,"% Loss",null,"% Loss",null,"% Loss",null,"% Loss",null,"% Loss"]
["Dry Wt After Wash",null,null,{"$f":"IF(ISBLANK(C28),\" \",IF(ISBLANK(C31),\" \",(C29-C31)/C29*100))","v":" "},null,{"$f":"IF(ISBLANK(E28),\" \",IF(ISBLANK(E31),\" \",(E29-E31)/E29*100))","v":" "},null,{"$f":"IF(ISBLANK(G28),\" \",IF(ISBLANK(G31),\" \",(G29-G31)/G29*100))","v":" "},null,{"$f":"IF(ISBLANK(I28),\" \",IF(ISBLANK(I31),\" \",(I29-I31)/I29*100))","v":" "},null,{"$f":"IF(ISBLANK(K28),\" \",IF(ISBLANK(K31),\" \",(K29-K31)/K29*100))","v":" "},null,{"$f":"IF(ISBLANK(M28),\" \",IF(ISBLANK(M31),\" \",(M29-M31)/M29*100))","v":" "}]
["Wt. Loss",null,{"$f":"IF(ISBLANK(C28),\" \",IF(ISBLANK(C29),\" \",C28-C29))","v":" "},null,{"$f":"IF(ISBLANK(E28),\" \",IF(ISBLANK(E29),\" \",E28-E29))","v":" "},null,{"$f":"IF(ISBLANK(G28),\" \",IF(ISBLANK(G29),\" \",G28-G29))","v":" "},null,{"$f":"IF(ISBLANK(I28),\" \",IF(ISBLANK(I29),\" \",I28-I29))","v":" "},null,{"$f":"IF(ISBLANK(K28),\" \",IF(ISBLANK(K29),\" \",K28-K29))","v":" "},null,{"$f":"IF(ISBLANK(M28),\" \",IF(ISBLANK(M29),\" \",M28-M29))","v":" "}]
[100,0.375,null,{"$f":"IF(ISBLANK(C$28),\"  \",IF(ISBLANK(C$29),\" \",IF(ISBLANK(C31),\" \",ROUND((C31+C$30)/C$28*100,1))))","v":"  "},null,{"$f":"IF(ISBLANK(E$28),\"  \",IF(ISBLANK(E$29),\" \",IF(ISBLANK(E31),\" \",ROUND((E31+E$30)/E$28*100,1))))","v":"  "},null,{"$f":"IF(ISBLANK(G$28),\"  \",IF(ISBLANK(G$29),\" \",IF(ISBLANK(G31),\" \",ROUND((G31+G$30)/G$28*100,1))))","v":"  "},null,{"$f":"IF(ISBLANK(I$28),\"  \",IF(ISBLANK(I$29),\" \",IF(ISBLANK(I31),\" \",ROUND((I31+I$30)/I$28*100,1))))","v":"  "},null,{"$f":"IF(ISBLANK(K$28),\"  \",IF(ISBLANK(K$29),\" \",IF(ISBLANK(K31),\" \",ROUND((K31+K$30)/K$28*100,1))))","v":"  "},null,{"$f":"IF(ISBLANK(M$28),\"  \",IF(ISBLANK(M$29),\" \",IF(ISBLANK(M31),\" \",ROUND((M31+M$30)/M$28*100,1))))","v":"  "}]
[{"$f":"IF($M$4=\"B1\",\"95-100\",IF($M$4=\"B2\",\"100\",IF($M$4=\"B3\",\"80-100\",IF($M$4,\" \",\"95-100\"))))","v":"80-100"},4,null,{"$f":"IF(ISBLANK(C$28),\"  \",IF(ISBLANK(C$29),\" \",IF(ISBLANK(C32),\" \",ROUND((C32+C$30)/C$28*100,0))))","v":"  "},null,{"$f":"IF(ISBLANK(E$28),\"  \",IF(ISBLANK(E$29),\" \",IF(ISBLANK(E32),\" \",ROUND((E32+E$30)/E$28*100,0))))","v":"  "},null,{"$f":"IF(ISBLANK(G$28),\"  \",IF(ISBLANK(G$29),\" \",IF(ISBLANK(G32),\" \",ROUND((G32+G$30)/G$28*100,0))))","v":"  "},null,{"$f":"IF(ISBLANK(I$28),\"  \",IF(ISBLANK(I$29),\" \",IF(ISBLANK(I32),\" \",ROUND((I32+I$30)/I$28*100,0))))","v":"  "},null,{"$f":"IF(ISBLANK(K$28),\"  \",IF(ISBLANK(K$29),\" \",IF(ISBLANK(K32),\" \",ROUND((K32+K$30)/K$28*100,0))))","v":"  "},null,{"$f":"IF(ISBLANK(M$28),\"  \",IF(ISBLANK(M$29),\" \",IF(ISBLANK(M32),\" \",ROUND((M32+M$30)/M$28*100,0))))","v":"  "}]
[{"$f":"IF($M$4=\"B1\",\"70-100\",IF($M$4=\"B2\",\"95-100\",IF($M$4=\"B3\",\"65-100\",IF($M$4,\" \",\"70-100\"))))","v":"65-100"},8,null,"  ",null,"  ",null,"  ",null,"  ",null,"  ",null,"  "]
[{"$f":"IF($M$4=\"B1\",\"40-80\",IF($M$4=\"B2\",\"85-100\",IF($M$4=\"B3\",\"40-80\",IF($M$4,\" \",\"40-80\"))))","v":"40-80"},16,null,"  ",null,"  ",null,"  ",null,"  ",null,"  ",null,"  "]
[{"$f":"IF($M$4=\"B1\",\"20-65\",IF($M$4=\"B2\",\"65-90\",IF($M$4=\"B3\",\"20-65\",IF($M$4,\" \",\"25-65\"))))","v":"20-65"},30,null,"  ",null,"  ",null,"  ",null,"  ",null,"  ",null,"  "]
[{"$f":"IF($M$4=\"B1\",\"7-40\",IF($M$4=\"B2\",\"30-60\",IF($M$4=\"B3\",\"7-40\",IF($M$4,\" \",\"7-40\"))))","v":"7-40"},50,null,"  ",null,"  ",null,"  ",null,"  ",null,"  ",null,"  "]
[{"$f":"IF($M$4=\"B1\",\"2-20\",IF($M$4=\"B2\",\"5-25\",IF($M$4=\"B3\",\"2-20\",IF($M$4,\" \",\"2-20\"))))","v":"2-20"},100,null,"  ",null,"  ",null,"  ",null,"  ",null,"  ",null,"  "]
[{"$f":"IF($M$4=\"B1\",\"0-10\",IF($M$4=\"B2\",\"0-5\",IF($M$4=\"B3\",\"0-10\",IF($M$4,\" \",\"0-10\"))))","v":"0-10"},200,null,{"$f":"IF(ISBLANK(C$28),\"  \",IF(ISBLANK(C$29),\" \",IF(ISBLANK(C38),\" \",ROUND((C38+C$30)/C$28*100,2))))","v":"  "},null,{"$f":"IF(ISBLANK(E$28),\"  \",IF(ISBLANK(E$29),\" \",IF(ISBLANK(E38),\" \",ROUND((E38+E$30)/E$28*100,2))))","v":"  "},null,{"$f":"IF(ISBLANK(G$28),\"  \",IF(ISBLANK(G$29),\" \",IF(ISBLANK(G38),\" \",ROUND((G38+G$30)/G$28*100,2))))","v":"  "},null,{"$f":"IF(ISBLANK(I$28),\"  \",IF(ISBLANK(I$29),\" \",IF(ISBLANK(I38),\" \",ROUND((I38+I$30)/I$28*100,2))))","v":"  "},null,{"$f":"IF(ISBLANK(K$28),\"  \",IF(ISBLANK(K$29),\" \",IF(ISBLANK(K38),\" \",ROUND((K38+K$30)/K$28*100,2))))","v":"  "},null,{"$f":"IF(ISBLANK(M$28),\"  \",IF(ISBLANK(M$29),\" \",IF(ISBLANK(M38),\" \",ROUND((M38+M$30)/M$28*100,2))))","v":"  "}]
["Tested By"]
["Remarks"]

{"sheet":"S10","index":9,"n_rows":40,"n_cols":14,"rows_kept":40,"cut":false,"hidden":true,"merged":[[11,6,11,7],[11,8,11,9],[11,10,11,11],[11,12,11,13],[29,2,29,3],[29,4,29,5],[29,6,29,7],[29,8,29,9],[29,10,29,11],[29,12,29,13],[20,10,20,11],[20,12,20,13],[21,6,23,7],[21,8,23,9],[21,10,23,11],[21,12,23,13],[10,0,10,1],[9,0,9,1],[7,10,7,11],[0,0,3,1],[1,10,1,11],[0,8,3,9],[1,2,1,7],[2,2,2,7],[3,2,3,7],[4,0,4,1],[5,3,5,8],[7,8,7,9],[7,2,7,3],[7,4,7,5],[7,6,7,7],[6,3,6,8],[27,0,27,1],[25,0,25,1],[25,2,25,3],[25,4,25,5],[11,0,11,1],[11,2,11,3],[11,4,11,5],[21,0,23,1],[21,2,23,3],[21,4,23,5],[20,0,20,1],[20,2,20,3],[20,4,20,5],[29,0,29,1],[1,12,1,13],[2,10,2,11],[2,12,2,13],[3,10,3,11],[3,12,3,13],[7,12,7,13],[8,0,8,1],[8,2,8,3],[8,4,8,5],[8,6,8,7],[8,8,8,9],[8,10,8,11],[7,0,7,1],[8,12,8,13],[28,0,28,1],[20,6,20,7],[20,8,20,9],[25,12,25,13],[26,0,26,1],[26,2,26,3],[26,4,26,5],[26,6,26,7],[26,8,26,9],[26,10,26,11],[26,12,26,13],[25,6,25,7],[25,8,25,9],[25,10,25,11],[38,10,38,11],[38,12,38,13],[39,0,41,1],[39,2,41,3],[39,4,41,5],[39,6,41,7],[39,8,41,9],[39,10,41,11],[39,12,41,13],[38,0,38,1],[38,2,38,3],[38,4,38,5],[38,6,38,7],[38,8,38,9]]}
[]
[null,null,"COMMONWEALTH OF PENNSYLVANIA",null,null,null,null,null,null,null,"DISTRICT",null,{"$f":"IF(ISBLANK('S1'!M2),\" \",'S1'!M2)","v":" "}]
[null,null,"DEPARTMENT OF TRANSPORTATION",null,null,null,null,null,null,null,"PLANT CODE",null,{"$f":"IF(ISBLANK('S1'!M3),\" \",'S1'!M3)","v":" "}]
[null,null,"PENNSYLVANIA TURNPIKE COMMISSION",null,null,null,null,null,null,null,"AGG SIZE",null,{"$f":"IF(ISBLANK('S1'!M4),\" \",'S1'!M4)","v":"B3"}]
[{"$f":"'S1'!A5","v":"Aggregate 2023"}]
[null,null,null,"Material Test Results for Type A Fine Aggregate"]
[null,null,null,"Washed Gradation"]
["Sample No."]
["Date"]
["St Wt Before Wash",null,null,"% Loss",null,"% Loss",null,"% Loss",null,"% Loss",null,"% Loss",null,"% Loss"]
["Dry Wt After Wash",null,null,{"$f":"IF(ISBLANK(C10),\" \",IF(ISBLANK(C13),\" \",(C11-C13)/C11*100))","v":" "},null,{"$f":"IF(ISBLANK(E10),\" \",IF(ISBLANK(E13),\" \",(E11-E13)/E11*100))","v":" "},null,{"$f":"IF(ISBLANK(G10),\" \",IF(ISBLANK(G13),\" \",(G11-G13)/G11*100))","v":" "},null,{"$f":"IF(ISBLANK(I10),\" \",IF(ISBLANK(I13),\" \",(I11-I13)/I11*100))","v":" "},null,{"$f":"IF(ISBLANK(K10),\" \",IF(ISBLANK(K13),\" \",(K11-K13)/K11*100))","v":" "},null,{"$f":"IF(ISBLANK(M10),\" \",IF(ISBLANK(M13),\" \",(M11-M13)/M11*100))","v":" "}]
["Wt. Loss",null,{"$f":"IF(ISBLANK(C10),\" \",IF(ISBLANK(C11),\" \",C10-C11))","v":" "},null,{"$f":"IF(ISBLANK(E10),\" \",IF(ISBLANK(E11),\" \",E10-E11))","v":" "},null,{"$f":"IF(ISBLANK(G10),\" \",IF(ISBLANK(G11),\" \",G10-G11))","v":" "},null,{"$f":"IF(ISBLANK(I10),\" \",IF(ISBLANK(I11),\" \",I10-I11))","v":" "},null,{"$f":"IF(ISBLANK(K10),\" \",IF(ISBLANK(K11),\" \",K10-K11))","v":" "},null,{"$f":"IF(ISBLANK(M10),\" \",IF(ISBLANK(M11),\" \",M10-M11))","v":" "}]
[100,0.375,null,{"$f":"IF(ISBLANK(C$10),\"  \",IF(ISBLANK(C$11),\" \",IF(ISBLANK(C13),\" \",ROUND((C13+C$12)/C$10*100,1))))","v":"  "},null,{"$f":"IF(ISBLANK(E$10),\"  \",IF(ISBLANK(E$11),\" \",IF(ISBLANK(E13),\" \",ROUND((E13+E$12)/E$10*100,1))))","v":"  "},null,{"$f":"IF(ISBLANK(G$10),\"  \",IF(ISBLANK(G$11),\" \",IF(ISBLANK(G13),\" \",ROUND((G13+G$12)/G$10*100,1))))","v":"  "},null,{"$f":"IF(ISBLANK(I$10),\"  \",IF(ISBLANK(I$11),\" \",IF(ISBLANK(I13),\" \",ROUND((I13+I$12)/I$10*100,1))))","v":"  "},null,{"$f":"IF(ISBLANK(K$10),\"  \",IF(ISBLANK(K$11),\" \",IF(ISBLANK(K13),\" \",ROUND((K13+K$12)/K$10*100,1))))","v":"  "},null,{"$f":"IF(ISBLANK(M$10),\"  \",IF(ISBLANK(M$11),\" \",IF(ISBLANK(M13),\" \",ROUND((M13+M$12)/M$10*100,1))))","v":"  "}]
[{"$f":"IF($M$4=\"B1\",\"95-100\",IF($M$4=\"B2\",\"100\",IF($M$4=\"B3\",\"80-100\",IF($M$4,\" \",\"95-100\"))))","v":"80-100"},4,null,{"$f":"IF(ISBLANK(C$10),\"  \",IF(ISBLANK(C$11),\" \",IF(ISBLANK(C14),\" \",ROUND((C14+C$12)/C$10*100,0))))","v":"  "},null,{"$f":"IF(ISBLANK(E$10),\"  \",IF(ISBLANK(E$11),\" \",IF(ISBLANK(E14),\" \",ROUND((E14+E$12)/E$10*100,0))))","v":"  "},null,{"$f":"IF(ISBLANK(G$10),\"  \",IF(ISBLANK(G$11),\" \",IF(ISBLANK(G14),\" \",ROUND((G14+G$12)/G$10*100,0))))","v":"  "},null,{"$f":"IF(ISBLANK(I$10),\"  \",IF(ISBLANK(I$11),\" \",IF(ISBLANK(I14),\" \",ROUND((I14+I$12)/I$10*100,0))))","v":"  "},null,{"$f":"IF(ISBLANK(K$10),\"  \",IF(ISBLANK(K$11),\" \",IF(ISBLANK(K14),\" \",ROUND((K14+K$12)/K$10*100,0))))","v":"  "},null,{"$f":"IF(ISBLANK(M$10),\"  \",IF(ISBLANK(M$11),\" \",IF(ISBLANK(M14),\" \",ROUND((M14+M$12)/M$10*100,0))))","v":"  "}]
[{"$f":"IF($M$4=\"B1\",\"70-100\",IF($M$4=\"B2\",\"95-100\",IF($M$4=\"B3\",\"65-100\",IF($M$4,\" \",\"70-100\"))))","v":"65-100"},8,null,"  ",null,"  ",null,"  ",null,"  ",null,"  ",null,"  "]
[{"$f":"IF($M$4=\"B1\",\"40-80\",IF($M$4=\"B2\",\"85-100\",IF($M$4=\"B3\",\"40-80\",IF($M$4,\" \",\"40-80\"))))","v":"40-80"},16,null,"  ",null,"  ",null,"  ",null,"  ",null,"  ",null,"  "]
[{"$f":"IF($M$4=\"B1\",\"20-65\",IF($M$4=\"B2\",\"65-90\",IF($M$4=\"B3\",\"20-65\",IF($M$4,\" \",\"25-65\"))))","v":"20-65"},30,null,"  ",null,"  ",null,"  ",null,"  ",null,"  ",null,"  "]
[{"$f":"IF($M$4=\"B1\",\"7-40\",IF($M$4=\"B2\",\"30-60\",IF($M$4=\"B3\",\"7-40\",IF($M$4,\" \",\"7-40\"))))","v":"7-40"},50,null,"  ",null,"  ",null,"  ",null,"  ",null,"  ",null,"  "]
[{"$f":"IF($M$4=\"B1\",\"2-20\",IF($M$4=\"B2\",\"5-25\",IF($M$4=\"B3\",\"2-20\",IF($M$4,\" \",\"2-20\"))))","v":"2-20"},100,null,"  ",null,"  ",null,"  ",null,"  ",null,"  ",null,"  "]
[{"$f":"IF($M$4=\"B1\",\"0-10\",IF($M$4=\"B2\",\"0-5\",IF($M$4=\"B3\",\"0-10\",IF($M$4,\" \",\"0-10\"))))","v":"0-10"},200,null,{"$f":"IF(ISBLANK(C$10),\"  \",IF(ISBLANK(C$11),\" \",IF(ISBLANK(C20),\" \",ROUND((C20+C$12)/C$10*100,2))))","v":"  "},null,{"$f":"IF(ISBLANK(E$10),\"  \",IF(ISBLANK(E$11),\" \",IF(ISBLANK(E20),\" \",ROUND((E20+E$12)/E$10*100,2))))","v":"  "},null,{"$f":"IF(ISBLANK(G$10),\"  \",IF(ISBLANK(G$11),\" \",IF(ISBLANK(G20),\" \",ROUND((G20+G$12)/G$10*100,2))))","v":"  "},null,{"$f":"IF(ISBLANK(I$10),\"  \",IF(ISBLANK(I$11),\" \",IF(ISBLANK(I20),\" \",ROUND((I20+I$12)/I$10*100,2))))","v":"  "},null,{"$f":"IF(ISBLANK(K$10),\"  \",IF(ISBLANK(K$11),\" \",IF(ISBLANK(K20),\" \",ROUND((K20+K$12)/K$10*100,2))))","v":"  "},null,{"$f":"IF(ISBLANK(M$10),\"  \",IF(ISBLANK(M$11),\" \",IF(ISBLANK(M20),\" \",ROUND((M20+M$12)/M$10*100,2))))","v":"  "}]
["Tested By"]
["Remarks"]
[]
[]
[]
["Sample No."]
["Date"]
["St Wt Before Wash",null,null,"% Loss",null,"% Loss",null,"% Loss",null,"% Loss",null,"% Loss",null,"% Loss"]
["Dry Wt After Wash",null,null,{"$f":"IF(ISBLANK(C28),\" \",IF(ISBLANK(C31),\" \",(C29-C31)/C29*100))","v":" "},null,{"$f":"IF(ISBLANK(E28),\" \",IF(ISBLANK(E31),\" \",(E29-E31)/E29*100))","v":" "},null,{"$f":"IF(ISBLANK(G28),\" \",IF(ISBLANK(G31),\" \",(G29-G31)/G29*100))","v":" "},null,{"$f":"IF(ISBLANK(I28),\" \",IF(ISBLANK(I31),\" \",(I29-I31)/I29*100))","v":" "},null,{"$f":"IF(ISBLANK(K28),\" \",IF(ISBLANK(K31),\" \",(K29-K31)/K29*100))","v":" "},null,{"$f":"IF(ISBLANK(M28),\" \",IF(ISBLANK(M31),\" \",(M29-M31)/M29*100))","v":" "}]
["Wt. Loss",null,{"$f":"IF(ISBLANK(C28),\" \",IF(ISBLANK(C29),\" \",C28-C29))","v":" "},null,{"$f":"IF(ISBLANK(E28),\" \",IF(ISBLANK(E29),\" \",E28-E29))","v":" "},null,{"$f":"IF(ISBLANK(G28),\" \",IF(ISBLANK(G29),\" \",G28-G29))","v":" "},null,{"$f":"IF(ISBLANK(I28),\" \",IF(ISBLANK(I29),\" \",I28-I29))","v":" "},null,{"$f":"IF(ISBLANK(K28),\" \",IF(ISBLANK(K29),\" \",K28-K29))","v":" "},null,{"$f":"IF(ISBLANK(M28),\" \",IF(ISBLANK(M29),\" \",M28-M29))","v":" "}]
[100,0.375,null,{"$f":"IF(ISBLANK(C$28),\"  \",IF(ISBLANK(C$29),\" \",IF(ISBLANK(C31),\" \",ROUND((C31+C$30)/C$28*100,1))))","v":"  "},null,{"$f":"IF(ISBLANK(E$28),\"  \",IF(ISBLANK(E$29),\" \",IF(ISBLANK(E31),\" \",ROUND((E31+E$30)/E$28*100,1))))","v":"  "},null,{"$f":"IF(ISBLANK(G$28),\"  \",IF(ISBLANK(G$29),\" \",IF(ISBLANK(G31),\" \",ROUND((G31+G$30)/G$28*100,1))))","v":"  "},null,{"$f":"IF(ISBLANK(I$28),\"  \",IF(ISBLANK(I$29),\" \",IF(ISBLANK(I31),\" \",ROUND((I31+I$30)/I$28*100,1))))","v":"  "},null,{"$f":"IF(ISBLANK(K$28),\"  \",IF(ISBLANK(K$29),\" \",IF(ISBLANK(K31),\" \",ROUND((K31+K$30)/K$28*100,1))))","v":"  "},null,{"$f":"IF(ISBLANK(M$28),\"  \",IF(ISBLANK(M$29),\" \",IF(ISBLANK(M31),\" \",ROUND((M31+M$30)/M$28*100,1))))","v":"  "}]
[{"$f":"IF($M$4=\"B1\",\"95-100\",IF($M$4=\"B2\",\"100\",IF($M$4=\"B3\",\"80-100\",IF($M$4,\" \",\"95-100\"))))","v":"80-100"},4,null,{"$f":"IF(ISBLANK(C$28),\"  \",IF(ISBLANK(C$29),\" \",IF(ISBLANK(C32),\" \",ROUND((C32+C$30)/C$28*100,0))))","v":"  "},null,{"$f":"IF(ISBLANK(E$28),\"  \",IF(ISBLANK(E$29),\" \",IF(ISBLANK(E32),\" \",ROUND((E32+E$30)/E$28*100,0))))","v":"  "},null,{"$f":"IF(ISBLANK(G$28),\"  \",IF(ISBLANK(G$29),\" \",IF(ISBLANK(G32),\" \",ROUND((G32+G$30)/G$28*100,0))))","v":"  "},null,{"$f":"IF(ISBLANK(I$28),\"  \",IF(ISBLANK(I$29),\" \",IF(ISBLANK(I32),\" \",ROUND((I32+I$30)/I$28*100,0))))","v":"  "},null,{"$f":"IF(ISBLANK(K$28),\"  \",IF(ISBLANK(K$29),\" \",IF(ISBLANK(K32),\" \",ROUND((K32+K$30)/K$28*100,0))))","v":"  "},null,{"$f":"IF(ISBLANK(M$28),\"  \",IF(ISBLANK(M$29),\" \",IF(ISBLANK(M32),\" \",ROUND((M32+M$30)/M$28*100,0))))","v":"  "}]
[{"$f":"IF($M$4=\"B1\",\"70-100\",IF($M$4=\"B2\",\"95-100\",IF($M$4=\"B3\",\"65-100\",IF($M$4,\" \",\"70-100\"))))","v":"65-100"},8,null,"  ",null,"  ",null,"  ",null,"  ",null,"  ",null,"  "]
[{"$f":"IF($M$4=\"B1\",\"40-80\",IF($M$4=\"B2\",\"85-100\",IF($M$4=\"B3\",\"40-80\",IF($M$4,\" \",\"40-80\"))))","v":"40-80"},16,null,"  ",null,"  ",null,"  ",null,"  ",null,"  ",null,"  "]
[{"$f":"IF($M$4=\"B1\",\"20-65\",IF($M$4=\"B2\",\"65-90\",IF($M$4=\"B3\",\"20-65\",IF($M$4,\" \",\"25-65\"))))","v":"20-65"},30,null,"  ",null,"  ",null,"  ",null,"  ",null,"  ",null,"  "]
[{"$f":"IF($M$4=\"B1\",\"7-40\",IF($M$4=\"B2\",\"30-60\",IF($M$4=\"B3\",\"7-40\",IF($M$4,\" \",\"7-40\"))))","v":"7-40"},50,null,"  ",null,"  ",null,"  ",null,"  ",null,"  ",null,"  "]
[{"$f":"IF($M$4=\"B1\",\"2-20\",IF($M$4=\"B2\",\"5-25\",IF($M$4=\"B3\",\"2-20\",IF($M$4,\" \",\"2-20\"))))","v":"2-20"},100,null,"  ",null,"  ",null,"  ",null,"  ",null,"  ",null,"  "]
[{"$f":"IF($M$4=\"B1\",\"0-10\",IF($M$4=\"B2\",\"0-5\",IF($M$4=\"B3\",\"0-10\",IF($M$4,\" \",\"0-10\"))))","v":"0-10"},200,null,{"$f":"IF(ISBLANK(C$28),\"  \",IF(ISBLANK(C$29),\" \",IF(ISBLANK(C38),\" \",ROUND((C38+C$30)/C$28*100,2))))","v":"  "},null,{"$f":"IF(ISBLANK(E$28),\"  \",IF(ISBLANK(E$29),\" \",IF(ISBLANK(E38),\" \",ROUND((E38+E$30)/E$28*100,2))))","v":"  "},null,{"$f":"IF(ISBLANK(G$28),\"  \",IF(ISBLANK(G$29),\" \",IF(ISBLANK(G38),\" \",ROUND((G38+G$30)/G$28*100,2))))","v":"  "},null,{"$f":"IF(ISBLANK(I$28),\"  \",IF(ISBLANK(I$29),\" \",IF(ISBLANK(I38),\" \",ROUND((I38+I$30)/I$28*100,2))))","v":"  "},null,{"$f":"IF(ISBLANK(K$28),\"  \",IF(ISBLANK(K$29),\" \",IF(ISBLANK(K38),\" \",ROUND((K38+K$30)/K$28*100,2))))","v":"  "},null,{"$f":"IF(ISBLANK(M$28),\"  \",IF(ISBLANK(M$29),\" \",IF(ISBLANK(M38),\" \",ROUND((M38+M$30)/M$28*100,2))))","v":"  "}]
["Tested By"]
["Remarks"]

{"sheet":"S11","index":10,"n_rows":40,"n_cols":14,"rows_kept":40,"cut":false,"hidden":true,"merged":[[11,6,11,7],[11,8,11,9],[11,10,11,11],[11,12,11,13],[29,2,29,3],[29,4,29,5],[29,6,29,7],[29,8,29,9],[29,10,29,11],[29,12,29,13],[20,10,20,11],[20,12,20,13],[21,6,23,7],[21,8,23,9],[21,10,23,11],[21,12,23,13],[10,0,10,1],[9,0,9,1],[7,10,7,11],[0,0,3,1],[1,10,1,11],[0,8,3,9],[1,2,1,7],[2,2,2,7],[3,2,3,7],[4,0,4,1],[5,3,5,8],[7,8,7,9],[7,2,7,3],[7,4,7,5],[7,6,7,7],[6,3,6,8],[27,0,27,1],[25,0,25,1],[25,2,25,3],[25,4,25,5],[11,0,11,1],[11,2,11,3],[11,4,11,5],[21,0,23,1],[21,2,23,3],[21,4,23,5],[20,0,20,1],[20,2,20,3],[20,4,20,5],[29,0,29,1],[1,12,1,13],[2,10,2,11],[2,12,2,13],[3,10,3,11],[3,12,3,13],[7,12,7,13],[8,0,8,1],[8,2,8,3],[8,4,8,5],[8,6,8,7],[8,8,8,9],[8,10,8,11],[7,0,7,1],[8,12,8,13],[28,0,28,1],[20,6,20,7],[20,8,20,9],[25,12,25,13],[26,0,26,1],[26,2,26,3],[26,4,26,5],[26,6,26,7],[26,8,26,9],[26,10,26,11],[26,12,26,13],[25,6,25,7],[25,8,25,9],[25,10,25,11],[38,10,38,11],[38,12,38,13],[39,0,41,1],[39,2,41,3],[39,4,41,5],[39,6,41,7],[39,8,41,9],[39,10,41,11],[39,12,41,13],[38,0,38,1],[38,2,38,3],[38,4,38,5],[38,6,38,7],[38,8,38,9]]}
[]
[null,null,"COMMONWEALTH OF PENNSYLVANIA",null,null,null,null,null,null,null,"DISTRICT",null,{"$f":"IF(ISBLANK('S1'!M2),\" \",'S1'!M2)","v":" "}]
[null,null,"DEPARTMENT OF TRANSPORTATION",null,null,null,null,null,null,null,"PLANT CODE",null,{"$f":"IF(ISBLANK('S1'!M3),\" \",'S1'!M3)","v":" "}]
[null,null,"PENNSYLVANIA TURNPIKE COMMISSION",null,null,null,null,null,null,null,"AGG SIZE",null,{"$f":"IF(ISBLANK('S1'!M4),\" \",'S1'!M4)","v":"B3"}]
[{"$f":"'S1'!A5","v":"Aggregate 2023"}]
[null,null,null,"Material Test Results for Type A Fine Aggregate"]
[null,null,null,"Washed Gradation"]
["Sample No."]
["Date"]
["St Wt Before Wash",null,null,"% Loss",null,"% Loss",null,"% Loss",null,"% Loss",null,"% Loss",null,"% Loss"]
["Dry Wt After Wash",null,null,{"$f":"IF(ISBLANK(C10),\" \",IF(ISBLANK(C13),\" \",(C11-C13)/C11*100))","v":" "},null,{"$f":"IF(ISBLANK(E10),\" \",IF(ISBLANK(E13),\" \",(E11-E13)/E11*100))","v":" "},null,{"$f":"IF(ISBLANK(G10),\" \",IF(ISBLANK(G13),\" \",(G11-G13)/G11*100))","v":" "},null,{"$f":"IF(ISBLANK(I10),\" \",IF(ISBLANK(I13),\" \",(I11-I13)/I11*100))","v":" "},null,{"$f":"IF(ISBLANK(K10),\" \",IF(ISBLANK(K13),\" \",(K11-K13)/K11*100))","v":" "},null,{"$f":"IF(ISBLANK(M10),\" \",IF(ISBLANK(M13),\" \",(M11-M13)/M11*100))","v":" "}]
["Wt. Loss",null,{"$f":"IF(ISBLANK(C10),\" \",IF(ISBLANK(C11),\" \",C10-C11))","v":" "},null,{"$f":"IF(ISBLANK(E10),\" \",IF(ISBLANK(E11),\" \",E10-E11))","v":" "},null,{"$f":"IF(ISBLANK(G10),\" \",IF(ISBLANK(G11),\" \",G10-G11))","v":" "},null,{"$f":"IF(ISBLANK(I10),\" \",IF(ISBLANK(I11),\" \",I10-I11))","v":" "},null,{"$f":"IF(ISBLANK(K10),\" \",IF(ISBLANK(K11),\" \",K10-K11))","v":" "},null,{"$f":"IF(ISBLANK(M10),\" \",IF(ISBLANK(M11),\" \",M10-M11))","v":" "}]
[100,0.375,null,{"$f":"IF(ISBLANK(C$10),\"  \",IF(ISBLANK(C$11),\" \",IF(ISBLANK(C13),\" \",ROUND((C13+C$12)/C$10*100,1))))","v":"  "},null,{"$f":"IF(ISBLANK(E$10),\"  \",IF(ISBLANK(E$11),\" \",IF(ISBLANK(E13),\" \",ROUND((E13+E$12)/E$10*100,1))))","v":"  "},null,{"$f":"IF(ISBLANK(G$10),\"  \",IF(ISBLANK(G$11),\" \",IF(ISBLANK(G13),\" \",ROUND((G13+G$12)/G$10*100,1))))","v":"  "},null,{"$f":"IF(ISBLANK(I$10),\"  \",IF(ISBLANK(I$11),\" \",IF(ISBLANK(I13),\" \",ROUND((I13+I$12)/I$10*100,1))))","v":"  "},null,{"$f":"IF(ISBLANK(K$10),\"  \",IF(ISBLANK(K$11),\" \",IF(ISBLANK(K13),\" \",ROUND((K13+K$12)/K$10*100,1))))","v":"  "},null,{"$f":"IF(ISBLANK(M$10),\"  \",IF(ISBLANK(M$11),\" \",IF(ISBLANK(M13),\" \",ROUND((M13+M$12)/M$10*100,1))))","v":"  "}]
[{"$f":"IF($M$4=\"B1\",\"95-100\",IF($M$4=\"B2\",\"100\",IF($M$4=\"B3\",\"80-100\",IF($M$4,\" \",\"95-100\"))))","v":"80-100"},4,null,{"$f":"IF(ISBLANK(C$10),\"  \",IF(ISBLANK(C$11),\" \",IF(ISBLANK(C14),\" \",ROUND((C14+C$12)/C$10*100,0))))","v":"  "},null,{"$f":"IF(ISBLANK(E$10),\"  \",IF(ISBLANK(E$11),\" \",IF(ISBLANK(E14),\" \",ROUND((E14+E$12)/E$10*100,0))))","v":"  "},null,{"$f":"IF(ISBLANK(G$10),\"  \",IF(ISBLANK(G$11),\" \",IF(ISBLANK(G14),\" \",ROUND((G14+G$12)/G$10*100,0))))","v":"  "},null,{"$f":"IF(ISBLANK(I$10),\"  \",IF(ISBLANK(I$11),\" \",IF(ISBLANK(I14),\" \",ROUND((I14+I$12)/I$10*100,0))))","v":"  "},null,{"$f":"IF(ISBLANK(K$10),\"  \",IF(ISBLANK(K$11),\" \",IF(ISBLANK(K14),\" \",ROUND((K14+K$12)/K$10*100,0))))","v":"  "},null,{"$f":"IF(ISBLANK(M$10),\"  \",IF(ISBLANK(M$11),\" \",IF(ISBLANK(M14),\" \",ROUND((M14+M$12)/M$10*100,0))))","v":"  "}]
[{"$f":"IF($M$4=\"B1\",\"70-100\",IF($M$4=\"B2\",\"95-100\",IF($M$4=\"B3\",\"65-100\",IF($M$4,\" \",\"70-100\"))))","v":"65-100"},8,null,"  ",null,"  ",null,"  ",null,"  ",null,"  ",null,"  "]
[{"$f":"IF($M$4=\"B1\",\"40-80\",IF($M$4=\"B2\",\"85-100\",IF($M$4=\"B3\",\"40-80\",IF($M$4,\" \",\"40-80\"))))","v":"40-80"},16,null,"  ",null,"  ",null,"  ",null,"  ",null,"  ",null,"  "]
[{"$f":"IF($M$4=\"B1\",\"20-65\",IF($M$4=\"B2\",\"65-90\",IF($M$4=\"B3\",\"20-65\",IF($M$4,\" \",\"25-65\"))))","v":"20-65"},30,null,"  ",null,"  ",null,"  ",null,"  ",null,"  ",null,"  "]
[{"$f":"IF($M$4=\"B1\",\"7-40\",IF($M$4=\"B2\",\"30-60\",IF($M$4=\"B3\",\"7-40\",IF($M$4,\" \",\"7-40\"))))","v":"7-40"},50,null,"  ",null,"  ",null,"  ",null,"  ",null,"  ",null,"  "]
[{"$f":"IF($M$4=\"B1\",\"2-20\",IF($M$4=\"B2\",\"5-25\",IF($M$4=\"B3\",\"2-20\",IF($M$4,\" \",\"2-20\"))))","v":"2-20"},100,null,"  ",null,"  ",null,"  ",null,"  ",null,"  ",null,"  "]
[{"$f":"IF($M$4=\"B1\",\"0-10\",IF($M$4=\"B2\",\"0-5\",IF($M$4=\"B3\",\"0-10\",IF($M$4,\" \",\"0-10\"))))","v":"0-10"},200,null,{"$f":"IF(ISBLANK(C$10),\"  \",IF(ISBLANK(C$11),\" \",IF(ISBLANK(C20),\" \",ROUND((C20+C$12)/C$10*100,2))))","v":"  "},null,{"$f":"IF(ISBLANK(E$10),\"  \",IF(ISBLANK(E$11),\" \",IF(ISBLANK(E20),\" \",ROUND((E20+E$12)/E$10*100,2))))","v":"  "},null,{"$f":"IF(ISBLANK(G$10),\"  \",IF(ISBLANK(G$11),\" \",IF(ISBLANK(G20),\" \",ROUND((G20+G$12)/G$10*100,2))))","v":"  "},null,{"$f":"IF(ISBLANK(I$10),\"  \",IF(ISBLANK(I$11),\" \",IF(ISBLANK(I20),\" \",ROUND((I20+I$12)/I$10*100,2))))","v":"  "},null,{"$f":"IF(ISBLANK(K$10),\"  \",IF(ISBLANK(K$11),\" \",IF(ISBLANK(K20),\" \",ROUND((K20+K$12)/K$10*100,2))))","v":"  "},null,{"$f":"IF(ISBLANK(M$10),\"  \",IF(ISBLANK(M$11),\" \",IF(ISBLANK(M20),\" \",ROUND((M20+M$12)/M$10*100,2))))","v":"  "}]
["Tested By"]
["Remarks"]
[]
[]
[]
["Sample No."]
["Date"]
["St Wt Before Wash",null,null,"% Loss",null,"% Loss",null,"% Loss",null,"% Loss",null,"% Loss",null,"% Loss"]
["Dry Wt After Wash",null,null,{"$f":"IF(ISBLANK(C28),\" \",IF(ISBLANK(C31),\" \",(C29-C31)/C29*100))","v":" "},null,{"$f":"IF(ISBLANK(E28),\" \",IF(ISBLANK(E31),\" \",(E29-E31)/E29*100))","v":" "},null,{"$f":"IF(ISBLANK(G28),\" \",IF(ISBLANK(G31),\" \",(G29-G31)/G29*100))","v":" "},null,{"$f":"IF(ISBLANK(I28),\" \",IF(ISBLANK(I31),\" \",(I29-I31)/I29*100))","v":" "},null,{"$f":"IF(ISBLANK(K28),\" \",IF(ISBLANK(K31),\" \",(K29-K31)/K29*100))","v":" "},null,{"$f":"IF(ISBLANK(M28),\" \",IF(ISBLANK(M31),\" \",(M29-M31)/M29*100))","v":" "}]
["Wt. Loss",null,{"$f":"IF(ISBLANK(C28),\" \",IF(ISBLANK(C29),\" \",C28-C29))","v":" "},null,{"$f":"IF(ISBLANK(E28),\" \",IF(ISBLANK(E29),\" \",E28-E29))","v":" "},null,{"$f":"IF(ISBLANK(G28),\" \",IF(ISBLANK(G29),\" \",G28-G29))","v":" "},null,{"$f":"IF(ISBLANK(I28),\" \",IF(ISBLANK(I29),\" \",I28-I29))","v":" "},null,{"$f":"IF(ISBLANK(K28),\" \",IF(ISBLANK(K29),\" \",K28-K29))","v":" "},null,{"$f":"IF(ISBLANK(M28),\" \",IF(ISBLANK(M29),\" \",M28-M29))","v":" "}]
[100,0.375,null,{"$f":"IF(ISBLANK(C$28),\"  \",IF(ISBLANK(C$29),\" \",IF(ISBLANK(C31),\" \",ROUND((C31+C$30)/C$28*100,1))))","v":"  "},null,{"$f":"IF(ISBLANK(E$28),\"  \",IF(ISBLANK(E$29),\" \",IF(ISBLANK(E31),\" \",ROUND((E31+E$30)/E$28*100,1))))","v":"  "},null,{"$f":"IF(ISBLANK(G$28),\"  \",IF(ISBLANK(G$29),\" \",IF(ISBLANK(G31),\" \",ROUND((G31+G$30)/G$28*100,1))))","v":"  "},null,{"$f":"IF(ISBLANK(I$28),\"  \",IF(ISBLANK(I$29),\" \",IF(ISBLANK(I31),\" \",ROUND((I31+I$30)/I$28*100,1))))","v":"  "},null,{"$f":"IF(ISBLANK(K$28),\"  \",IF(ISBLANK(K$29),\" \",IF(ISBLANK(K31),\" \",ROUND((K31+K$30)/K$28*100,1))))","v":"  "},null,{"$f":"IF(ISBLANK(M$28),\"  \",IF(ISBLANK(M$29),\" \",IF(ISBLANK(M31),\" \",ROUND((M31+M$30)/M$28*100,1))))","v":"  "}]
[{"$f":"IF($M$4=\"B1\",\"95-100\",IF($M$4=\"B2\",\"100\",IF($M$4=\"B3\",\"80-100\",IF($M$4,\" \",\"95-100\"))))","v":"80-100"},4,null,{"$f":"IF(ISBLANK(C$28),\"  \",IF(ISBLANK(C$29),\" \",IF(ISBLANK(C32),\" \",ROUND((C32+C$30)/C$28*100,0))))","v":"  "},null,{"$f":"IF(ISBLANK(E$28),\"  \",IF(ISBLANK(E$29),\" \",IF(ISBLANK(E32),\" \",ROUND((E32+E$30)/E$28*100,0))))","v":"  "},null,{"$f":"IF(ISBLANK(G$28),\"  \",IF(ISBLANK(G$29),\" \",IF(ISBLANK(G32),\" \",ROUND((G32+G$30)/G$28*100,0))))","v":"  "},null,{"$f":"IF(ISBLANK(I$28),\"  \",IF(ISBLANK(I$29),\" \",IF(ISBLANK(I32),\" \",ROUND((I32+I$30)/I$28*100,0))))","v":"  "},null,{"$f":"IF(ISBLANK(K$28),\"  \",IF(ISBLANK(K$29),\" \",IF(ISBLANK(K32),\" \",ROUND((K32+K$30)/K$28*100,0))))","v":"  "},null,{"$f":"IF(ISBLANK(M$28),\"  \",IF(ISBLANK(M$29),\" \",IF(ISBLANK(M32),\" \",ROUND((M32+M$30)/M$28*100,0))))","v":"  "}]
[{"$f":"IF($M$4=\"B1\",\"70-100\",IF($M$4=\"B2\",\"95-100\",IF($M$4=\"B3\",\"65-100\",IF($M$4,\" \",\"70-100\"))))","v":"65-100"},8,null,"  ",null,"  ",null,"  ",null,"  ",null,"  ",null,"  "]
[{"$f":"IF($M$4=\"B1\",\"40-80\",IF($M$4=\"B2\",\"85-100\",IF($M$4=\"B3\",\"40-80\",IF($M$4,\" \",\"40-80\"))))","v":"40-80"},16,null,"  ",null,"  ",null,"  ",null,"  ",null,"  ",null,"  "]
[{"$f":"IF($M$4=\"B1\",\"20-65\",IF($M$4=\"B2\",\"65-90\",IF($M$4=\"B3\",\"20-65\",IF($M$4,\" \",\"25-65\"))))","v":"20-65"},30,null,"  ",null,"  ",null,"  ",null,"  ",null,"  ",null,"  "]
[{"$f":"IF($M$4=\"B1\",\"7-40\",IF($M$4=\"B2\",\"30-60\",IF($M$4=\"B3\",\"7-40\",IF($M$4,\" \",\"7-40\"))))","v":"7-40"},50,null,"  ",null,"  ",null,"  ",null,"  ",null,"  ",null,"  "]
[{"$f":"IF($M$4=\"B1\",\"2-20\",IF($M$4=\"B2\",\"5-25\",IF($M$4=\"B3\",\"2-20\",IF($M$4,\" \",\"2-20\"))))","v":"2-20"},100,null,"  ",null,"  ",null,"  ",null,"  ",null,"  ",null,"  "]
[{"$f":"IF($M$4=\"B1\",\"0-10\",IF($M$4=\"B2\",\"0-5\",IF($M$4=\"B3\",\"0-10\",IF($M$4,\" \",\"0-10\"))))","v":"0-10"},200,null,{"$f":"IF(ISBLANK(C$28),\"  \",IF(ISBLANK(C$29),\" \",IF(ISBLANK(C38),\" \",ROUND((C38+C$30)/C$28*100,2))))","v":"  "},null,{"$f":"IF(ISBLANK(E$28),\"  \",IF(ISBLANK(E$29),\" \",IF(ISBLANK(E38),\" \",ROUND((E38+E$30)/E$28*100,2))))","v":"  "},null,{"$f":"IF(ISBLANK(G$28),\"  \",IF(ISBLANK(G$29),\" \",IF(ISBLANK(G38),\" \",ROUND((G38+G$30)/G$28*100,2))))","v":"  "},null,{"$f":"IF(ISBLANK(I$28),\"  \",IF(ISBLANK(I$29),\" \",IF(ISBLANK(I38),\" \",ROUND((I38+I$30)/I$28*100,2))))","v":"  "},null,{"$f":"IF(ISBLANK(K$28),\"  \",IF(ISBLANK(K$29),\" \",IF(ISBLANK(K38),\" \",ROUND((K38+K$30)/K$28*100,2))))","v":"  "},null,{"$f":"IF(ISBLANK(M$28),\"  \",IF(ISBLANK(M$29),\" \",IF(ISBLANK(M38),\" \",ROUND((M38+M$30)/M$28*100,2))))","v":"  "}]
["Tested By"]
["Remarks"]

{"sheet":"S12","index":11,"n_rows":40,"n_cols":14,"rows_kept":40,"cut":false,"hidden":true,"merged":[[29,12,29,13],[6,3,6,8],[29,2,29,3],[29,4,29,5],[29,6,29,7],[29,8,29,9],[29,10,29,11],[21,10,23,11],[21,12,23,13],[20,6,20,7],[20,8,20,9],[11,10,11,11],[11,12,11,13],[8,8,8,9],[7,12,7,13],[8,12,8,13],[21,6,23,7],[21,8,23,9],[11,2,11,3],[11,4,11,5],[11,6,11,7],[11,8,11,9],[26,0,26,1],[26,2,26,3],[26,4,26,5],[20,0,20,1],[20,2,20,3],[20,4,20,5],[21,2,23,3],[21,4,23,5],[11,0,11,1],[8,0,8,1],[21,0,23,1],[8,4,8,5],[8,2,8,3],[10,0,10,1],[1,10,1,11],[1,12,1,13],[2,10,2,11],[2,12,2,13],[3,10,3,11],[3,12,3,13],[20,10,20,11],[20,12,20,13],[8,10,8,11],[7,10,7,11],[28,0,28,1],[26,8,26,9],[26,10,26,11],[26,12,26,13],[25,0,25,1],[25,2,25,3],[25,4,25,5],[25,6,25,7],[25,8,25,9],[25,10,25,11],[25,12,25,13],[27,0,27,1],[29,0,29,1],[0,0,3,1],[7,8,7,9],[0,8,3,9],[1,2,1,7],[2,2,2,7],[3,2,3,7],[4,0,4,1],[5,3,5,8],[7,0,7,1],[7,2,7,3],[7,4,7,5],[7,6,7,7],[9,0,9,1],[8,6,8,7],[26,6,26,7],[38,10,38,11],[38,12,38,13],[39,0,41,1],[39,2,41,3],[39,4,41,5],[39,6,41,7],[39,8,41,9],[39,10,41,11],[39,12,41,13],[38,0,38,1],[38,2,38,3],[38,4,38,5],[38,6,38,7],[38,8,38,9]]}
[]
[null,null,"COMMONWEALTH OF PENNSYLVANIA",null,null,null,null,null,null,null,"DISTRICT",null,{"$f":"IF(ISBLANK('S1'!M2),\" \",'S1'!M2)","v":" "}]
[null,null,"DEPARTMENT OF TRANSPORTATION",null,null,null,null,null,null,null,"PLANT CODE",null,{"$f":"IF(ISBLANK('S1'!M3),\" \",'S1'!M3)","v":" "}]
[null,null,"PENNSYLVANIA TURNPIKE COMMISSION",null,null,null,null,null,null,null,"AGG SIZE",null,{"$f":"IF(ISBLANK('S1'!M4),\" \",'S1'!M4)","v":"B3"}]
[{"$f":"'S1'!A5","v":"Aggregate 2023"}]
[null,null,null,"Material Test Results for Type A Fine Aggregate"]
[null,null,null,"Washed Gradation"]
["Sample No."]
["Date"]
["St Wt Before Wash",null,null,"% Loss",null,"% Loss",null,"% Loss",null,"% Loss",null,"% Loss",null,"% Loss"]
["Dry Wt After Wash",null,null,{"$f":"IF(ISBLANK(C10),\" \",IF(ISBLANK(C13),\" \",(C11-C13)/C11*100))","v":" "},null,{"$f":"IF(ISBLANK(E10),\" \",IF(ISBLANK(E13),\" \",(E11-E13)/E11*100))","v":" "},null,{"$f":"IF(ISBLANK(G10),\" \",IF(ISBLANK(G13),\" \",(G11-G13)/G11*100))","v":" "},null,{"$f":"IF(ISBLANK(I10),\" \",IF(ISBLANK(I13),\" \",(I11-I13)/I11*100))","v":" "},null,{"$f":"IF(ISBLANK(K10),\" \",IF(ISBLANK(K13),\" \",(K11-K13)/K11*100))","v":" "},null,{"$f":"IF(ISBLANK(M10),\" \",IF(ISBLANK(M13),\" \",(M11-M13)/M11*100))","v":" "}]
["Wt. Loss",null,{"$f":"IF(ISBLANK(C10),\" \",IF(ISBLANK(C11),\" \",C10-C11))","v":" "},null,{"$f":"IF(ISBLANK(E10),\" \",IF(ISBLANK(E11),\" \",E10-E11))","v":" "},null,{"$f":"IF(ISBLANK(G10),\" \",IF(ISBLANK(G11),\" \",G10-G11))","v":" "},null,{"$f":"IF(ISBLANK(I10),\" \",IF(ISBLANK(I11),\" \",I10-I11))","v":" "},null,{"$f":"IF(ISBLANK(K10),\" \",IF(ISBLANK(K11),\" \",K10-K11))","v":" "},null,{"$f":"IF(ISBLANK(M10),\" \",IF(ISBLANK(M11),\" \",M10-M11))","v":" "}]
[100,0.375,null,{"$f":"IF(ISBLANK(C$10),\"  \",IF(ISBLANK(C$11),\" \",IF(ISBLANK(C13),\" \",ROUND((C13+C$12)/C$10*100,1))))","v":"  "},null,{"$f":"IF(ISBLANK(E$10),\"  \",IF(ISBLANK(E$11),\" \",IF(ISBLANK(E13),\" \",ROUND((E13+E$12)/E$10*100,1))))","v":"  "},null,{"$f":"IF(ISBLANK(G$10),\"  \",IF(ISBLANK(G$11),\" \",IF(ISBLANK(G13),\" \",ROUND((G13+G$12)/G$10*100,1))))","v":"  "},null,{"$f":"IF(ISBLANK(I$10),\"  \",IF(ISBLANK(I$11),\" \",IF(ISBLANK(I13),\" \",ROUND((I13+I$12)/I$10*100,1))))","v":"  "},null,{"$f":"IF(ISBLANK(K$10),\"  \",IF(ISBLANK(K$11),\" \",IF(ISBLANK(K13),\" \",ROUND((K13+K$12)/K$10*100,1))))","v":"  "},null,{"$f":"IF(ISBLANK(M$10),\"  \",IF(ISBLANK(M$11),\" \",IF(ISBLANK(M13),\" \",ROUND((M13+M$12)/M$10*100,1))))","v":"  "}]
[{"$f":"IF($M$4=\"B1\",\"95-100\",IF($M$4=\"B2\",\"100\",IF($M$4=\"B3\",\"80-100\",IF($M$4,\" \",\"95-100\"))))","v":"80-100"},4,null,{"$f":"IF(ISBLANK(C$10),\"  \",IF(ISBLANK(C$11),\" \",IF(ISBLANK(C14),\" \",ROUND((C14+C$12)/C$10*100,0))))","v":"  "},null,{"$f":"IF(ISBLANK(E$10),\"  \",IF(ISBLANK(E$11),\" \",IF(ISBLANK(E14),\" \",ROUND((E14+E$12)/E$10*100,0))))","v":"  "},null,{"$f":"IF(ISBLANK(G$10),\"  \",IF(ISBLANK(G$11),\" \",IF(ISBLANK(G14),\" \",ROUND((G14+G$12)/G$10*100,0))))","v":"  "},null,{"$f":"IF(ISBLANK(I$10),\"  \",IF(ISBLANK(I$11),\" \",IF(ISBLANK(I14),\" \",ROUND((I14+I$12)/I$10*100,0))))","v":"  "},null,{"$f":"IF(ISBLANK(K$10),\"  \",IF(ISBLANK(K$11),\" \",IF(ISBLANK(K14),\" \",ROUND((K14+K$12)/K$10*100,0))))","v":"  "},null,{"$f":"IF(ISBLANK(M$10),\"  \",IF(ISBLANK(M$11),\" \",IF(ISBLANK(M14),\" \",ROUND((M14+M$12)/M$10*100,0))))","v":"  "}]
[{"$f":"IF($M$4=\"B1\",\"70-100\",IF($M$4=\"B2\",\"95-100\",IF($M$4=\"B3\",\"65-100\",IF($M$4,\" \",\"70-100\"))))","v":"65-100"},8,null,"  ",null,"  ",null,"  ",null,"  ",null,"  ",null,"  "]
[{"$f":"IF($M$4=\"B1\",\"40-80\",IF($M$4=\"B2\",\"85-100\",IF($M$4=\"B3\",\"40-80\",IF($M$4,\" \",\"40-80\"))))","v":"40-80"},16,null,"  ",null,"  ",null,"  ",null,"  ",null,"  ",null,"  "]
[{"$f":"IF($M$4=\"B1\",\"20-65\",IF($M$4=\"B2\",\"65-90\",IF($M$4=\"B3\",\"20-65\",IF($M$4,\" \",\"25-65\"))))","v":"20-65"},30,null,"  ",null,"  ",null,"  ",null,"  ",null,"  ",null,"  "]
[{"$f":"IF($M$4=\"B1\",\"7-40\",IF($M$4=\"B2\",\"30-60\",IF($M$4=\"B3\",\"7-40\",IF($M$4,\" \",\"7-40\"))))","v":"7-40"},50,null,"  ",null,"  ",null,"  ",null,"  ",null,"  ",null,"  "]
[{"$f":"IF($M$4=\"B1\",\"2-20\",IF($M$4=\"B2\",\"5-25\",IF($M$4=\"B3\",\"2-20\",IF($M$4,\" \",\"2-20\"))))","v":"2-20"},100,null,"  ",null,"  ",null,"  ",null,"  ",null,"  ",null,"  "]
[{"$f":"IF($M$4=\"B1\",\"0-10\",IF($M$4=\"B2\",\"0-5\",IF($M$4=\"B3\",\"0-10\",IF($M$4,\" \",\"0-10\"))))","v":"0-10"},200,null,{"$f":"IF(ISBLANK(C$10),\"  \",IF(ISBLANK(C$11),\" \",IF(ISBLANK(C20),\" \",ROUND((C20+C$12)/C$10*100,2))))","v":"  "},null,{"$f":"IF(ISBLANK(E$10),\"  \",IF(ISBLANK(E$11),\" \",IF(ISBLANK(E20),\" \",ROUND((E20+E$12)/E$10*100,2))))","v":"  "},null,{"$f":"IF(ISBLANK(G$10),\"  \",IF(ISBLANK(G$11),\" \",IF(ISBLANK(G20),\" \",ROUND((G20+G$12)/G$10*100,2))))","v":"  "},null,{"$f":"IF(ISBLANK(I$10),\"  \",IF(ISBLANK(I$11),\" \",IF(ISBLANK(I20),\" \",ROUND((I20+I$12)/I$10*100,2))))","v":"  "},null,{"$f":"IF(ISBLANK(K$10),\"  \",IF(ISBLANK(K$11),\" \",IF(ISBLANK(K20),\" \",ROUND((K20+K$12)/K$10*100,2))))","v":"  "},null,{"$f":"IF(ISBLANK(M$10),\"  \",IF(ISBLANK(M$11),\" \",IF(ISBLANK(M20),\" \",ROUND((M20+M$12)/M$10*100,2))))","v":"  "}]
["Tested By"]
["Remarks"]
[]
[]
[]
["Sample No.",null,"19",null,"20",null,"21",null,"22",null,"23",null,"24"]
["Date"]
["St Wt Before Wash",null,null,"% Loss",null,"% Loss",null,"% Loss",null,"% Loss",null,"% Loss",null,"% Loss"]
["Dry Wt After Wash",null,null,{"$f":"IF(ISBLANK(C28),\" \",IF(ISBLANK(C31),\" \",(C29-C31)/C29*100))","v":" "},null,{"$f":"IF(ISBLANK(E28),\" \",IF(ISBLANK(E31),\" \",(E29-E31)/E29*100))","v":" "},null,{"$f":"IF(ISBLANK(G28),\" \",IF(ISBLANK(G31),\" \",(G29-G31)/G29*100))","v":" "},null,{"$f":"IF(ISBLANK(I28),\" \",IF(ISBLANK(I31),\" \",(I29-I31)/I29*100))","v":" "},null,{"$f":"IF(ISBLANK(K28),\" \",IF(ISBLANK(K31),\" \",(K29-K31)/K29*100))","v":" "},null,{"$f":"IF(ISBLANK(M28),\" \",IF(ISBLANK(M31),\" \",(M29-M31)/M29*100))","v":" "}]
["Wt. Loss",null,{"$f":"IF(ISBLANK(C28),\" \",IF(ISBLANK(C29),\" \",C28-C29))","v":" "},null,{"$f":"IF(ISBLANK(E28),\" \",IF(ISBLANK(E29),\" \",E28-E29))","v":" "},null,{"$f":"IF(ISBLANK(G28),\" \",IF(ISBLANK(G29),\" \",G28-G29))","v":" "},null,{"$f":"IF(ISBLANK(I28),\" \",IF(ISBLANK(I29),\" \",I28-I29))","v":" "},null,{"$f":"IF(ISBLANK(K28),\" \",IF(ISBLANK(K29),\" \",K28-K29))","v":" "},null,{"$f":"IF(ISBLANK(M28),\" \",IF(ISBLANK(M29),\" \",M28-M29))","v":" "}]
[100,0.375,null,{"$f":"IF(ISBLANK(C$28),\"  \",IF(ISBLANK(C$29),\" \",IF(ISBLANK(C31),\" \",ROUND((C31+C$30)/C$28*100,1))))","v":"  "},null,{"$f":"IF(ISBLANK(E$28),\"  \",IF(ISBLANK(E$29),\" \",IF(ISBLANK(E31),\" \",ROUND((E31+E$30)/E$28*100,1))))","v":"  "},null,{"$f":"IF(ISBLANK(G$28),\"  \",IF(ISBLANK(G$29),\" \",IF(ISBLANK(G31),\" \",ROUND((G31+G$30)/G$28*100,1))))","v":"  "},null,{"$f":"IF(ISBLANK(I$28),\"  \",IF(ISBLANK(I$29),\" \",IF(ISBLANK(I31),\" \",ROUND((I31+I$30)/I$28*100,1))))","v":"  "},null,{"$f":"IF(ISBLANK(K$28),\"  \",IF(ISBLANK(K$29),\" \",IF(ISBLANK(K31),\" \",ROUND((K31+K$30)/K$28*100,1))))","v":"  "},null,{"$f":"IF(ISBLANK(M$28),\"  \",IF(ISBLANK(M$29),\" \",IF(ISBLANK(M31),\" \",ROUND((M31+M$30)/M$28*100,1))))","v":"  "}]
[{"$f":"IF($M$4=\"B1\",\"95-100\",IF($M$4=\"B2\",\"100\",IF($M$4=\"B3\",\"80-100\",IF($M$4,\" \",\"95-100\"))))","v":"80-100"},4,null,{"$f":"IF(ISBLANK(C$28),\"  \",IF(ISBLANK(C$29),\" \",IF(ISBLANK(C32),\" \",ROUND((C32+C$30)/C$28*100,0))))","v":"  "},null,{"$f":"IF(ISBLANK(E$28),\"  \",IF(ISBLANK(E$29),\" \",IF(ISBLANK(E32),\" \",ROUND((E32+E$30)/E$28*100,0))))","v":"  "},null,{"$f":"IF(ISBLANK(G$28),\"  \",IF(ISBLANK(G$29),\" \",IF(ISBLANK(G32),\" \",ROUND((G32+G$30)/G$28*100,0))))","v":"  "},null,{"$f":"IF(ISBLANK(I$28),\"  \",IF(ISBLANK(I$29),\" \",IF(ISBLANK(I32),\" \",ROUND((I32+I$30)/I$28*100,0))))","v":"  "},null,{"$f":"IF(ISBLANK(K$28),\"  \",IF(ISBLANK(K$29),\" \",IF(ISBLANK(K32),\" \",ROUND((K32+K$30)/K$28*100,0))))","v":"  "},null,{"$f":"IF(ISBLANK(M$28),\"  \",IF(ISBLANK(M$29),\" \",IF(ISBLANK(M32),\" \",ROUND((M32+M$30)/M$28*100,0))))","v":"  "}]
[{"$f":"IF($M$4=\"B1\",\"70-100\",IF($M$4=\"B2\",\"95-100\",IF($M$4=\"B3\",\"65-100\",IF($M$4,\" \",\"70-100\"))))","v":"65-100"},8,null,"  ",null,"  ",null,"  ",null,"  ",null,"  ",null,"  "]
[{"$f":"IF($M$4=\"B1\",\"40-80\",IF($M$4=\"B2\",\"85-100\",IF($M$4=\"B3\",\"40-80\",IF($M$4,\" \",\"40-80\"))))","v":"40-80"},16,null,"  ",null,"  ",null,"  ",null,"  ",null,"  ",null,"  "]
[{"$f":"IF($M$4=\"B1\",\"20-65\",IF($M$4=\"B2\",\"65-90\",IF($M$4=\"B3\",\"20-65\",IF($M$4,\" \",\"25-65\"))))","v":"20-65"},30,null,"  ",null,"  ",null,"  ",null,"  ",null,"  ",null,"  "]
[{"$f":"IF($M$4=\"B1\",\"7-40\",IF($M$4=\"B2\",\"30-60\",IF($M$4=\"B3\",\"7-40\",IF($M$4,\" \",\"7-40\"))))","v":"7-40"},50,null,"  ",null,"  ",null,"  ",null,"  ",null,"  ",null,"  "]
[{"$f":"IF($M$4=\"B1\",\"2-20\",IF($M$4=\"B2\",\"5-25\",IF($M$4=\"B3\",\"2-20\",IF($M$4,\" \",\"2-20\"))))","v":"2-20"},100,null,"  ",null,"  ",null,"  ",null,"  ",null,"  ",null,"  "]
[{"$f":"IF($M$4=\"B1\",\"0-10\",IF($M$4=\"B2\",\"0-5\",IF($M$4=\"B3\",\"0-10\",IF($M$4,\" \",\"0-10\"))))","v":"0-10"},200,null,{"$f":"IF(ISBLANK(C$28),\"  \",IF(ISBLANK(C$29),\" \",IF(ISBLANK(C38),\" \",ROUND((C38+C$30)/C$28*100,2))))","v":"  "},null,{"$f":"IF(ISBLANK(E$28),\"  \",IF(ISBLANK(E$29),\" \",IF(ISBLANK(E38),\" \",ROUND((E38+E$30)/E$28*100,2))))","v":"  "},null,{"$f":"IF(ISBLANK(G$28),\"  \",IF(ISBLANK(G$29),\" \",IF(ISBLANK(G38),\" \",ROUND((G38+G$30)/G$28*100,2))))","v":"  "},null,{"$f":"IF(ISBLANK(I$28),\"  \",IF(ISBLANK(I$29),\" \",IF(ISBLANK(I38),\" \",ROUND((I38+I$30)/I$28*100,2))))","v":"  "},null,{"$f":"IF(ISBLANK(K$28),\"  \",IF(ISBLANK(K$29),\" \",IF(ISBLANK(K38),\" \",ROUND((K38+K$30)/K$28*100,2))))","v":"  "},null,{"$f":"IF(ISBLANK(M$28),\"  \",IF(ISBLANK(M$29),\" \",IF(ISBLANK(M38),\" \",ROUND((M38+M$30)/M$28*100,2))))","v":"  "}]
["Tested By"]
["Remarks"]

{"sheet":"Chart 1-24","index":12,"n_rows":6,"n_cols":10,"rows_kept":6,"cut":false,"hidden":false,"merged":[[3,9,3,10],[1,7,1,8],[1,9,1,10],[2,7,2,8],[2,9,2,10],[0,0,2,0],[1,1,1,5],[2,1,2,5],[3,1,3,5],[3,7,3,8],[5,7,5,8],[5,9,5,10],[4,0,4,1],[4,7,4,8],[4,9,4,10]]}
[]
[null,"COMMONWEALTH OF PENNSYLVANIA",null,null,null,null,null,"DISTRICT",null,{"$f":"'S1'!M2","v":0}]
[null,"DEPARTMENT OF TRANSPORTATION",null,null,null,null,null,"PLANT CODE",null,{"$f":"'S1'!M3","v":0}]
[null,"PENNSYLVANIA TURNPIKE COMMISSION",null,null,null,null,null,"AGG SIZE",null,{"$f":"'S1'!M4","v":"B3"}]
[{"$f":"'S1'!$A$5:$B$5","v":"Aggregate 2023"},null,null,null,null,null,null,"#50 Target Value",null,{"$f":"'S1'!M5","v":0}]
[null,null,null,null,null,null,null,"#FM Target Value",null,{"$f":"'S1'!M6","v":0}]

{"sheet":"Chart 25-48","index":13,"n_rows":5,"n_cols":10,"rows_kept":5,"cut":false,"hidden":true,"merged":[[3,1,3,5],[3,7,3,8],[3,9,3,10],[4,0,4,1],[0,0,2,0],[1,1,1,5],[1,7,1,8],[1,9,1,10],[2,1,2,5],[2,7,2,8],[2,9,2,10]]}
[]
[null,"COMMONWEALTH OF PENNSYLVANIA",null,null,null,null,null,"DISTRICT",null,{"$f":"'S1'!M2","v":0}]
[null,"DEPARTMENT OF TRANSPORTATION",null,null,null,null,null,"PLANT CODE",null,{"$f":"'S1'!M3","v":0}]
[null,"PENNSYLVANIA TURNPIKE COMMISSION",null,null,null,null,null,"AGG SIZE",null,{"$f":"'S1'!M4","v":"B3"}]
[{"$f":"'S1'!$A$5:$B$5","v":"Aggregate 2023"}]

{"sheet":"Chart 49-72","index":14,"n_rows":5,"n_cols":10,"rows_kept":5,"cut":false,"hidden":true,"merged":[[3,1,3,5],[3,7,3,8],[3,9,3,10],[4,0,4,1],[0,0,2,0],[1,1,1,5],[1,7,1,8],[1,9,1,10],[2,1,2,5],[2,7,2,8],[2,9,2,10]]}
[]
[null,"COMMONWEALTH OF PENNSYLVANIA",null,null,null,null,null,"DISTRICT",null,{"$f":"'S1'!M2","v":0}]
[null,"DEPARTMENT OF TRANSPORTATION",null,null,null,null,null,"PLANT CODE",null,{"$f":"'S1'!M3","v":0}]
[null,"PENNSYLVANIA TURNPIKE COMMISSION",null,null,null,null,null,"AGG SIZE",null,{"$f":"'S1'!M4","v":"B3"}]
[{"$f":"'S1'!$A$5:$B$5","v":"Aggregate 2023"}]

{"sheet":"Chart 73-96","index":15,"n_rows":5,"n_cols":10,"rows_kept":5,"cut":false,"hidden":true,"merged":[[3,1,3,5],[3,7,3,8],[3,9,3,10],[4,0,4,1],[0,0,2,0],[1,1,1,5],[1,7,1,8],[1,9,1,10],[2,1,2,5],[2,7,2,8],[2,9,2,10]]}
[]
[null,"COMMONWEALTH OF PENNSYLVANIA",null,null,null,null,null,"DISTRICT",null,{"$f":"'S1'!M2","v":0}]
[null,"DEPARTMENT OF TRANSPORTATION",null,null,null,null,null,"PLANT CODE",null,{"$f":"'S1'!M3","v":0}]
[null,"PENNSYLVANIA TURNPIKE COMMISSION",null,null,null,null,null,"AGG SIZE",null,{"$f":"'S1'!M4","v":"B3"}]
[{"$f":"'S1'!$A$5:$B$5","v":"Aggregate 2023"}]

{"sheet":"Chart 97-120","index":16,"n_rows":5,"n_cols":10,"rows_kept":5,"cut":false,"hidden":true,"merged":[[5,7,5,8],[5,9,5,10],[3,1,3,5],[3,7,3,8],[3,9,3,10],[4,0,4,1],[4,7,4,8],[4,9,4,10],[0,0,2,0],[1,1,1,5],[1,7,1,8],[1,9,1,10],[2,1,2,5],[2,7,2,8],[2,9,2,10]]}
[]
[null,"COMMONWEALTH OF PENNSYLVANIA",null,null,null,null,null,"DISTRICT",null,{"$f":"'S1'!M2","v":0}]
[null,"DEPARTMENT OF TRANSPORTATION",null,null,null,null,null,"PLANT CODE",null,{"$f":"'S1'!M3","v":0}]
[null,"PENNSYLVANIA TURNPIKE COMMISSION",null,null,null,null,null,"AGG SIZE",null,{"$f":"'S1'!M4","v":"B3"}]
[{"$f":"'S1'!$A$5:$B$5","v":"Aggregate 2023"}]

{"sheet":"Chart 121-144","index":17,"n_rows":5,"n_cols":10,"rows_kept":5,"cut":false,"hidden":true,"merged":[[3,1,3,5],[3,7,3,8],[3,9,3,10],[4,0,4,1],[0,0,2,0],[1,1,1,5],[1,7,1,8],[1,9,1,10],[2,1,2,5],[2,7,2,8],[2,9,2,10]]}
[]
[null,"COMMONWEALTH OF PENNSYLVANIA",null,null,null,null,null,"DISTRICT",null,{"$f":"'S1'!M2","v":0}]
[null,"DEPARTMENT OF TRANSPORTATION",null,null,null,null,null,"PLANT CODE",null,{"$f":"'S1'!M3","v":0}]
[null,"PENNSYLVANIA TURNPIKE COMMISSION",null,null,null,null,null,"AGG SIZE",null,{"$f":"'S1'!M4","v":"B3"}]
[{"$f":"'S1'!$A$5:$B$5","v":"Aggregate 2023"}]

{"sheet":"S13","index":18,"n_rows":150,"n_cols":11,"rows_kept":150,"cut":false,"hidden":true,"merged":[[0,6,0,7],[0,8,0,9],[0,12,0,13],[0,10,0,11]]}
["Sam. No.",0.375,4,8,16,30,"#50",null,"#100",null,200]
[{"$f":"IF(ISBLANK('S1'!C$8),\" \",'S1'!C$8)","v":" "},{"$f":"IF(ISTEXT('S1'!$D$13),NA(),'S1'!$D$13)","v":{"$error":"#N/A"}},{"$f":"IF(ISTEXT('S1'!$D$14),NA(),'S1'!$D$14)","v":{"$error":"#N/A"}},{"$f":"IF(ISTEXT('S1'!$D$15),NA(),'S1'!$D$15)","v":{"$error":"#N/A"}},{"$f":"IF(ISTEXT('S1'!$D$16),NA(),'S1'!$D$16)","v":{"$error":"#N/A"}},{"$f":"IF(ISTEXT('S1'!$D$17),NA(),'S1'!$D$17)","v":{"$error":"#N/A"}},{"$f":"IF(ISTEXT('S1'!$D$18),NA(),'S1'!$D$18)","v":{"$error":"#N/A"}},null,{"$f":"IF(ISTEXT('S1'!$D$19),NA(),'S1'!$D$19)","v":{"$error":"#N/A"}},null,{"$f":"IF(ISTEXT('S1'!$D$20),NA(),'S1'!$D$20)","v":{"$error":"#N/A"}}]
[{"$f":"IF(ISBLANK('S1'!E$8),\" \",'S1'!E$8)","v":" "},{"$f":"IF(ISTEXT('S1'!$F$13),NA(),'S1'!$F$13)","v":{"$error":"#N/A"}},{"$f":"IF(ISTEXT('S1'!$F$14),NA(),'S1'!$F$14)","v":{"$error":"#N/A"}},{"$f":"IF(ISTEXT('S1'!$F$15),NA(),'S1'!$F$15)","v":{"$error":"#N/A"}},{"$f":"IF(ISTEXT('S1'!$F$16),NA(),'S1'!$F$16)","v":{"$error":"#N/A"}},{"$f":"IF(ISTEXT('S1'!$F$17),NA(),'S1'!$F$17)","v":{"$error":"#N/A"}},{"$f":"IF(ISTEXT('S1'!$F$18),NA(),'S1'!$F$18)","v":{"$error":"#N/A"}},null,{"$f":"IF(ISTEXT('S1'!$F$19),NA(),'S1'!$F$19)","v":{"$error":"#N/A"}},null,{"$f":"IF(ISTEXT('S1'!$F$20),NA(),'S1'!$F$20)","v":{"$error":"#N/A"}}]
[{"$f":"IF(ISBLANK('S1'!G$8),\" \",'S1'!G$8)","v":" "},{"$f":"IF(ISTEXT('S1'!$H$13),NA(),'S1'!$H$13)","v":{"$error":"#N/A"}},{"$f":"IF(ISTEXT('S1'!$H$14),NA(),'S1'!$H$14)","v":{"$error":"#N/A"}},{"$f":"IF(ISTEXT('S1'!$H$15),NA(),'S1'!$H$15)","v":{"$error":"#N/A"}},{"$f":"IF(ISTEXT('S1'!$H$16),NA(),'S1'!$H$16)","v":{"$error":"#N/A"}},{"$f":"IF(ISTEXT('S1'!$H$17),NA(),'S1'!$H$17)","v":{"$error":"#N/A"}},{"$f":"IF(ISTEXT('S1'!$H$18),NA(),'S1'!$H$18)","v":{"$error":"#N/A"}},null,{"$f":"IF(ISTEXT('S1'!$H$19),NA(),'S1'!$H$19)","v":{"$error":"#N/A"}},null,{"$f":"IF(ISTEXT('S1'!$H$20),NA(),'S1'!$H$20)","v":{"$error":"#N/A"}}]
[{"$f":"IF(ISBLANK('S1'!I$8),\" \",'S1'!I$8)","v":" "},{"$f":"IF(ISTEXT('S1'!$J$13),NA(),'S1'!$J$13)","v":{"$error":"#N/A"}},{"$f":"IF(ISTEXT('S1'!$J$14),NA(),'S1'!$J$14)","v":{"$error":"#N/A"}},{"$f":"IF(ISTEXT('S1'!$J$15),NA(),'S1'!$J$15)","v":{"$error":"#N/A"}},{"$f":"IF(ISTEXT('S1'!$J$16),NA(),'S1'!$J$16)","v":{"$error":"#N/A"}},{"$f":"IF(ISTEXT('S1'!$J$17),NA(),'S1'!$J$17)","v":{"$error":"#N/A"}},{"$f":"IF(ISTEXT('S1'!$J$18),NA(),'S1'!$J$18)","v":{"$error":"#N/A"}},null,{"$f":"IF(ISTEXT('S1'!$J$19),NA(),'S1'!$J$19)","v":{"$error":"#N/A"}},null,{"$f":"IF(ISTEXT('S1'!$J$20),NA(),'S1'!$J$20)","v":{"$error":"#N/A"}}]
[{"$f":"IF(ISBLANK('S1'!K$8),\" \",'S1'!K$8)","v":" "},{"$f":"IF(ISTEXT('S1'!$L$13),NA(),'S1'!$L$13)","v":{"$error":"#N/A"}},{"$f":"IF(ISTEXT('S1'!$L$14),NA(),'S1'!$L$14)","v":{"$error":"#N/A"}},{"$f":"IF(ISTEXT('S1'!$L$15),NA(),'S1'!$L$15)","v":{"$error":"#N/A"}},{"$f":"IF(ISTEXT('S1'!$L$16),NA(),'S1'!$L$16)","v":{"$error":"#N/A"}},{"$f":"IF(ISTEXT('S1'!$L$17),NA(),'S1'!$L$17)","v":{"$error":"#N/A"}},{"$f":"IF(ISTEXT('S1'!$L$18),NA(),'S1'!$L$18)","v":{"$error":"#N/A"}},null,{"$f":"IF(ISTEXT('S1'!$L$19),NA(),'S1'!$L$19)","v":{"$error":"#N/A"}},null,{"$f":"IF(ISTEXT('S1'!$L$20),NA(),'S1'!$L$20)","v":{"$error":"#N/A"}}]
[{"$f":"IF(ISBLANK('S1'!M$8),\" \",'S1'!M$8)","v":" "},{"$f":"IF(ISTEXT('S1'!$N$13),NA(),'S1'!$N$13)","v":{"$error":"#N/A"}},{"$f":"IF(ISTEXT('S1'!$N$14),NA(),'S1'!$N$14)","v":{"$error":"#N/A"}},{"$f":"IF(ISTEXT('S1'!$N$15),NA(),'S1'!$N$15)","v":{"$error":"#N/A"}},{"$f":"IF(ISTEXT('S1'!$N$16),NA(),'S1'!$N$16)","v":{"$error":"#N/A"}},{"$f":"IF(ISTEXT('S1'!$N$17),NA(),'S1'!$N$17)","v":{"$error":"#N/A"}},{"$f":"IF(ISTEXT('S1'!$N$18),NA(),'S1'!$N$18)","v":{"$error":"#N/A"}},null,{"$f":"IF(ISTEXT('S1'!$N$19),NA(),'S1'!$N$19)","v":{"$error":"#N/A"}},null,{"$f":"IF(ISTEXT('S1'!$N$20),NA(),'S1'!$N$20)","v":{"$error":"#N/A"}}]
[{"$f":"IF(ISBLANK('S1'!C$26),\" \",'S1'!C$26)","v":" "},{"$f":"IF(ISTEXT('S1'!$D$31),NA(),'S1'!$D$31)","v":{"$error":"#N/A"}},{"$f":"IF(ISTEXT('S1'!$D$32),NA(),'S1'!$D$32)","v":{"$error":"#N/A"}},{"$f":"IF(ISTEXT('S1'!$D$33),NA(),'S1'!$D$33)","v":{"$error":"#N/A"}},{"$f":"IF(ISTEXT('S1'!$D$34),NA(),'S1'!$D$34)","v":{"$error":"#N/A"}},{"$f":"IF(ISTEXT('S1'!$D$35),NA(),'S1'!$D$35)","v":{"$error":"#N/A"}},{"$f":"IF(ISTEXT('S1'!$D$36),NA(),'S1'!$D$36)","v":{"$error":"#N/A"}},null,{"$f":"IF(ISTEXT('S1'!$D$37),NA(),'S1'!$D$37)","v":{"$error":"#N/A"}},null,{"$f":"IF(ISTEXT('S1'!$D$38),NA(),'S1'!$D$38)","v":{"$error":"#N/A"}}]
[{"$f":"IF(ISBLANK('S1'!E$26),\" \",'S1'!E$26)","v":" "},{"$f":"IF(ISTEXT('S1'!$F$31),NA(),'S1'!$F$31)","v":{"$error":"#N/A"}},{"$f":"IF(ISTEXT('S1'!$F$32),NA(),'S1'!$F$32)","v":{"$error":"#N/A"}},{"$f":"IF(ISTEXT('S1'!$F$33),NA(),'S1'!$F$33)","v":{"$error":"#N/A"}},{"$f":"IF(ISTEXT('S1'!$F$34),NA(),'S1'!$F$34)","v":{"$error":"#N/A"}},{"$f":"IF(ISTEXT('S1'!$F$35),NA(),'S1'!$F$35)","v":{"$error":"#N/A"}},{"$f":"IF(ISTEXT('S1'!$F$36),NA(),'S1'!$F$36)","v":{"$error":"#N/A"}},null,{"$f":"IF(ISTEXT('S1'!$F$37),NA(),'S1'!$F$37)","v":{"$error":"#N/A"}},null,{"$f":"IF(ISTEXT('S1'!$F$38),NA(),'S1'!$F$38)","v":{"$error":"#N/A"}}]
[{"$f":"IF(ISBLANK('S1'!G$26),\" \",'S1'!G$26)","v":" "},{"$f":"IF(ISTEXT('S1'!$H$31),NA(),'S1'!$H$31)","v":{"$error":"#N/A"}},{"$f":"IF(ISTEXT('S1'!$H$32),NA(),'S1'!$H$32)","v":{"$error":"#N/A"}},{"$f":"IF(ISTEXT('S1'!$H$33),NA(),'S1'!$H$33)","v":{"$error":"#N/A"}},{"$f":"IF(ISTEXT('S1'!$H$34),NA(),'S1'!$H$34)","v":{"$error":"#N/A"}},{"$f":"IF(ISTEXT('S1'!$H$35),NA(),'S1'!$H$35)","v":{"$error":"#N/A"}},{"$f":"IF(ISTEXT('S1'!$H$36),NA(),'S1'!$H$36)","v":{"$error":"#N/A"}},null,{"$f":"IF(ISTEXT('S1'!$H$37),NA(),'S1'!$H$37)","v":{"$error":"#N/A"}},null,{"$f":"IF(ISTEXT('S1'!$H$38),NA(),'S1'!$H$38)","v":{"$error":"#N/A"}}]
[{"$f":"IF(ISBLANK('S1'!I$26),\" \",'S1'!I$26)","v":" "},{"$f":"IF(ISTEXT('S1'!$J$31),NA(),'S1'!$J$31)","v":{"$error":"#N/A"}},{"$f":"IF(ISTEXT('S1'!$J$32),NA(),'S1'!$J$32)","v":{"$error":"#N/A"}},{"$f":"IF(ISTEXT('S1'!$J$33),NA(),'S1'!$J$33)","v":{"$error":"#N/A"}},{"$f":"IF(ISTEXT('S1'!$J$34),NA(),'S1'!$J$34)","v":{"$error":"#N/A"}},{"$f":"IF(ISTEXT('S1'!$J$35),NA(),'S1'!$J$35)","v":{"$error":"#N/A"}},{"$f":"IF(ISTEXT('S1'!$J$36),NA(),'S1'!$J$36)","v":{"$error":"#N/A"}},null,{"$f":"IF(ISTEXT('S1'!$J$37),NA(),'S1'!$J$37)","v":{"$error":"#N/A"}},null,{"$f":"IF(ISTEXT('S1'!$J$38),NA(),'S1'!$J$38)","v":{"$error":"#N/A"}}]
[{"$f":"IF(ISBLANK('S1'!K$26),\" \",'S1'!K$26)","v":" "},{"$f":"IF(ISTEXT('S1'!$L$31),NA(),'S1'!$L$31)","v":{"$error":"#N/A"}},{"$f":"IF(ISTEXT('S1'!$L$32),NA(),'S1'!$L$32)","v":{"$error":"#N/A"}},{"$f":"IF(ISTEXT('S1'!$L$33),NA(),'S1'!$L$33)","v":{"$error":"#N/A"}},{"$f":"IF(ISTEXT('S1'!$L$34),NA(),'S1'!$L$34)","v":{"$error":"#N/A"}},{"$f":"IF(ISTEXT('S1'!$L$35),NA(),'S1'!$L$35)","v":{"$error":"#N/A"}},{"$f":"IF(ISTEXT('S1'!$L$36),NA(),'S1'!$L$36)","v":{"$error":"#N/A"}},null,{"$f":"IF(ISTEXT('S1'!$L$37),NA(),'S1'!$L$37)","v":{"$error":"#N/A"}},null,{"$f":"IF(ISTEXT('S1'!$L$38),NA(),'S1'!$L$38)","v":{"$error":"#N/A"}}]
[{"$f":"IF(ISBLANK('S1'!M$26),\" \",'S1'!M$26)","v":" "},{"$f":"IF(ISTEXT('S1'!$N$31),NA(),'S1'!$N$31)","v":{"$error":"#N/A"}},{"$f":"IF(ISTEXT('S1'!$N$32),NA(),'S1'!$N$32)","v":{"$error":"#N/A"}},{"$f":"IF(ISTEXT('S1'!$N$33),NA(),'S1'!$N$33)","v":{"$error":"#N/A"}},{"$f":"IF(ISTEXT('S1'!$N$34),NA(),'S1'!$N$34)","v":{"$error":"#N/A"}},{"$f":"IF(ISTEXT('S1'!$N$35),NA(),'S1'!$N$35)","v":{"$error":"#N/A"}},{"$f":"IF(ISTEXT('S1'!$N$36),NA(),'S1'!$N$36)","v":{"$error":"#N/A"}},null,{"$f":"IF(ISTEXT('S1'!$N$37),NA(),'S1'!$N$37)","v":{"$error":"#N/A"}},null,{"$f":"IF(ISTEXT('S1'!$N$38),NA(),'S1'!$N$38)","v":{"$error":"#N/A"}}]
[{"$f":"IF(ISBLANK('S2'!C$8),\" \",'S2'!C$8)","v":" "},{"$f":"IF(ISTEXT('S2'!$D$13),NA(),'S2'!$D$13)","v":{"$error":"#N/A"}},{"$f":"IF(ISTEXT('S2'!$D$14),NA(),'S2'!$D$14)","v":{"$error":"#N/A"}},{"$f":"IF(ISTEXT('S2'!$D$15),NA(),'S2'!$D$15)","v":{"$error":"#N/A"}},{"$f":"IF(ISTEXT('S2'!$D$16),NA(),'S2'!$D$16)","v":{"$error":"#N/A"}},{"$f":"IF(ISTEXT('S2'!$D$17),NA(),'S2'!$D$17)","v":{"$error":"#N/A"}},{"$f":"IF(ISTEXT('S2'!$D$18),NA(),'S2'!$D$18)","v":{"$error":"#N/A"}},null,{"$f":"IF(ISTEXT('S2'!$D$19),NA(),'S2'!$D$19)","v":{"$error":"#N/A"}},null,{"$f":"IF(ISTEXT('S2'!$D$20),NA(),'S2'!$D$20)","v":{"$error":"#N/A"}}]
[{"$f":"IF(ISBLANK('S2'!E$8),\" \",'S2'!E$8)","v":" "},{"$f":"IF(ISTEXT('S2'!$F$13),NA(),'S2'!$F$13)","v":{"$error":"#N/A"}},{"$f":"IF(ISTEXT('S2'!$F$14),NA(),'S2'!$F$14)","v":{"$error":"#N/A"}},{"$f":"IF(ISTEXT('S2'!$F$15),NA(),'S2'!$F$15)","v":{"$error":"#N/A"}},{"$f":"IF(ISTEXT('S2'!$F$16),NA(),'S2'!$F$16)","v":{"$error":"#N/A"}},{"$f":"IF(ISTEXT('S2'!$F$17),NA(),'S2'!$F$17)","v":{"$error":"#N/A"}},{"$f":"IF(ISTEXT('S2'!$F$18),NA(),'S2'!$F$18)","v":{"$error":"#N/A"}},null,{"$f":"IF(ISTEXT('S2'!$F$19),NA(),'S2'!$F$19)","v":{"$error":"#N/A"}},null,{"$f":"IF(ISTEXT('S2'!$F$20),NA(),'S2'!$F$20)","v":{"$error":"#N/A"}}]
[{"$f":"IF(ISBLANK('S2'!G$8),\" \",'S2'!G$8)","v":" "},{"$f":"IF(ISTEXT('S2'!$H$13),NA(),'S2'!$H$13)","v":{"$error":"#N/A"}},{"$f":"IF(ISTEXT('S2'!$H$14),NA(),'S2'!$H$14)","v":{"$error":"#N/A"}},{"$f":"IF(ISTEXT('S2'!$H$15),NA(),'S2'!$H$15)","v":{"$error":"#N/A"}},{"$f":"IF(ISTEXT('S2'!$H$16),NA(),'S2'!$H$16)","v":{"$error":"#N/A"}},{"$f":"IF(ISTEXT('S2'!$H$17),NA(),'S2'!$H$17)","v":{"$error":"#N/A"}},{"$f":"IF(ISTEXT('S2'!$H$18),NA(),'S2'!$H$18)","v":{"$error":"#N/A"}},null,{"$f":"IF(ISTEXT('S2'!$H$19),NA(),'S2'!$H$19)","v":{"$error":"#N/A"}},null,{"$f":"IF(ISTEXT('S2'!$H$20),NA(),'S2'!$H$20)","v":{"$error":"#N/A"}}]
[{"$f":"IF(ISBLANK('S2'!I$8),\" \",'S2'!I$8)","v":" "},{"$f":"IF(ISTEXT('S2'!$J$13),NA(),'S2'!$J$13)","v":{"$error":"#N/A"}},{"$f":"IF(ISTEXT('S2'!$J$14),NA(),'S2'!$J$14)","v":{"$error":"#N/A"}},{"$f":"IF(ISTEXT('S2'!$J$15),NA(),'S2'!$J$15)","v":{"$error":"#N/A"}},{"$f":"IF(ISTEXT('S2'!$J$16),NA(),'S2'!$J$16)","v":{"$error":"#N/A"}},{"$f":"IF(ISTEXT('S2'!$J$17),NA(),'S2'!$J$17)","v":{"$error":"#N/A"}},{"$f":"IF(ISTEXT('S2'!$J$18),NA(),'S2'!$J$18)","v":{"$error":"#N/A"}},null,{"$f":"IF(ISTEXT('S2'!$J$19),NA(),'S2'!$J$19)","v":{"$error":"#N/A"}},null,{"$f":"IF(ISTEXT('S2'!$J$20),NA(),'S2'!$J$20)","v":{"$error":"#N/A"}}]
[{"$f":"IF(ISBLANK('S2'!K$8),\" \",'S2'!K$8)","v":" "},{"$f":"IF(ISTEXT('S2'!$L$13),NA(),'S2'!$L$13)","v":{"$error":"#N/A"}},{"$f":"IF(ISTEXT('S2'!$L$14),NA(),'S2'!$L$14)","v":{"$error":"#N/A"}},{"$f":"IF(ISTEXT('S2'!$L$15),NA(),'S2'!$L$15)","v":{"$error":"#N/A"}},{"$f":"IF(ISTEXT('S2'!$L$16),NA(),'S2'!$L$16)","v":{"$error":"#N/A"}},{"$f":"IF(ISTEXT('S2'!$L$17),NA(),'S2'!$L$17)","v":{"$error":"#N/A"}},{"$f":"IF(ISTEXT('S2'!$L$18),NA(),'S2'!$L$18)","v":{"$error":"#N/A"}},null,{"$f":"IF(ISTEXT('S2'!$L$19),NA(),'S2'!$L$19)","v":{"$error":"#N/A"}},null,{"$f":"IF(ISTEXT('S2'!$L$20),NA(),'S2'!$L$20)","v":{"$error":"#N/A"}}]
[{"$f":"IF(ISBLANK('S2'!M$8),\" \",'S2'!M$8)","v":" "},{"$f":"IF(ISTEXT('S2'!$N$13),NA(),'S2'!$N$13)","v":{"$error":"#N/A"}},{"$f":"IF(ISTEXT('S2'!$N$14),NA(),'S2'!$N$14)","v":{"$error":"#N/A"}},{"$f":"IF(ISTEXT('S2'!$N$15),NA(),'S2'!$N$15)","v":{"$error":"#N/A"}},{"$f":"IF(ISTEXT('S2'!$N$16),NA(),'S2'!$N$16)","v":{"$error":"#N/A"}},{"$f":"IF(ISTEXT('S2'!$N$17),NA(),'S2'!$N$17)","v":{"$error":"#N/A"}},{"$f":"IF(ISTEXT('S2'!$N$18),NA(),'S2'!$N$18)","v":{"$error":"#N/A"}},null,{"$f":"IF(ISTEXT('S2'!$N$19),NA(),'S2'!$N$19)","v":{"$error":"#N/A"}},null,{"$f":"IF(ISTEXT('S2'!$N$20),NA(),'S2'!$N$20)","v":{"$error":"#N/A"}}]
[{"$f":"IF(ISBLANK('S2'!C$26),\" \",'S2'!C$26)","v":" "},{"$f":"IF(ISTEXT('S2'!$D$31),NA(),'S2'!$D$31)","v":{"$error":"#N/A"}},{"$f":"IF(ISTEXT('S2'!$D$32),NA(),'S2'!$D$32)","v":{"$error":"#N/A"}},{"$f":"IF(ISTEXT('S2'!$D$33),NA(),'S2'!$D$33)","v":{"$error":"#N/A"}},{"$f":"IF(ISTEXT('S2'!$D$34),NA(),'S2'!$D$34)","v":{"$error":"#N/A"}},{"$f":"IF(ISTEXT('S2'!$D$35),NA(),'S2'!$D$35)","v":{"$error":"#N/A"}},{"$f":"IF(ISTEXT('S2'!$D$36),NA(),'S2'!$D$36)","v":{"$error":"#N/A"}},null,{"$f":"IF(ISTEXT('S2'!$D$37),NA(),'S2'!$D$37)","v":{"$error":"#N/A"}},null,{"$f":"IF(ISTEXT('S2'!$D$38),NA(),'S2'!$D$38)","v":{"$error":"#N/A"}}]
[{"$f":"IF(ISBLANK('S2'!E$26),\" \",'S2'!E$26)","v":" "},{"$f":"IF(ISTEXT('S2'!$F$31),NA(),'S2'!$F$31)","v":{"$error":"#N/A"}},{"$f":"IF(ISTEXT('S2'!$F$32),NA(),'S2'!$F$32)","v":{"$error":"#N/A"}},{"$f":"IF(ISTEXT('S2'!$F$33),NA(),'S2'!$F$33)","v":{"$error":"#N/A"}},{"$f":"IF(ISTEXT('S2'!$F$34),NA(),'S2'!$F$34)","v":{"$error":"#N/A"}},{"$f":"IF(ISTEXT('S2'!$F$35),NA(),'S2'!$F$35)","v":{"$error":"#N/A"}},{"$f":"IF(ISTEXT('S2'!$F$36),NA(),'S2'!$F$36)","v":{"$error":"#N/A"}},null,{"$f":"IF(ISTEXT('S2'!$F$37),NA(),'S2'!$F$37)","v":{"$error":"#N/A"}},null,{"$f":"IF(ISTEXT('S2'!$F$38),NA(),'S2'!$F$38)","v":{"$error":"#N/A"}}]
[{"$f":"IF(ISBLANK('S2'!G$26),\" \",'S2'!G$26)","v":" "},{"$f":"IF(ISTEXT('S2'!$H$31),NA(),'S2'!$H$31)","v":{"$error":"#N/A"}},{"$f":"IF(ISTEXT('S2'!$H$32),NA(),'S2'!$H$32)","v":{"$error":"#N/A"}},{"$f":"IF(ISTEXT('S2'!$H$33),NA(),'S2'!$H$33)","v":{"$error":"#N/A"}},{"$f":"IF(ISTEXT('S2'!$H$34),NA(),'S2'!$H$34)","v":{"$error":"#N/A"}},{"$f":"IF(ISTEXT('S2'!$H$35),NA(),'S2'!$H$35)","v":{"$error":"#N/A"}},{"$f":"IF(ISTEXT('S2'!$H$36),NA(),'S2'!$H$36)","v":{"$error":"#N/A"}},null,{"$f":"IF(ISTEXT('S2'!$H$37),NA(),'S2'!$H$37)","v":{"$error":"#N/A"}},null,{"$f":"IF(ISTEXT('S2'!$H$38),NA(),'S2'!$H$38)","v":{"$error":"#N/A"}}]
[{"$f":"IF(ISBLANK('S2'!I$26),\" \",'S2'!I$26)","v":" "},{"$f":"IF(ISTEXT('S2'!$J$31),NA(),'S2'!$J$31)","v":{"$error":"#N/A"}},{"$f":"IF(ISTEXT('S2'!$J$32),NA(),'S2'!$J$32)","v":{"$error":"#N/A"}},{"$f":"IF(ISTEXT('S2'!$J$33),NA(),'S2'!$J$33)","v":{"$error":"#N/A"}},{"$f":"IF(ISTEXT('S2'!$J$34),NA(),'S2'!$J$34)","v":{"$error":"#N/A"}},{"$f":"IF(ISTEXT('S2'!$J$35),NA(),'S2'!$J$35)","v":{"$error":"#N/A"}},{"$f":"IF(ISTEXT('S2'!$J$36),NA(),'S2'!$J$36)","v":{"$error":"#N/A"}},null,{"$f":"IF(ISTEXT('S2'!$J$37),NA(),'S2'!$J$37)","v":{"$error":"#N/A"}},null,{"$f":"IF(ISTEXT('S2'!$J$38),NA(),'S2'!$J$38)","v":{"$error":"#N/A"}}]
[{"$f":"IF(ISBLANK('S2'!K$26),\" \",'S2'!K$26)","v":" "},{"$f":"IF(ISTEXT('S2'!$L$31),NA(),'S2'!$L$31)","v":{"$error":"#N/A"}},{"$f":"IF(ISTEXT('S2'!$L$32),NA(),'S2'!$L$32)","v":{"$error":"#N/A"}},{"$f":"IF(ISTEXT('S2'!$L$33),NA(),'S2'!$L$33)","v":{"$error":"#N/A"}},{"$f":"IF(ISTEXT('S2'!$L$34),NA(),'S2'!$L$34)","v":{"$error":"#N/A"}},{"$f":"IF(ISTEXT('S2'!$L$35),NA(),'S2'!$L$35)","v":{"$error":"#N/A"}},{"$f":"IF(ISTEXT('S2'!$L$36),NA(),'S2'!$L$36)","v":{"$error":"#N/A"}},null,{"$f":"IF(ISTEXT('S2'!$L$37),NA(),'S2'!$L$37)","v":{"$error":"#N/A"}},null,{"$f":"IF(ISTEXT('S2'!$L$38),NA(),'S2'!$L$38)","v":{"$error":"#N/A"}}]
[{"$f":"IF(ISBLANK('S2'!M$26),\" \",'S2'!M$26)","v":" "},{"$f":"IF(ISTEXT('S2'!$N$31),NA(),'S2'!$N$31)","v":{"$error":"#N/A"}},{"$f":"IF(ISTEXT('S2'!$N$32),NA(),'S2'!$N$32)","v":{"$error":"#N/A"}},{"$f":"IF(ISTEXT('S2'!$N$33),NA(),'S2'!$N$33)","v":{"$error":"#N/A"}},{"$f":"IF(ISTEXT('S2'!$N$34),NA(),'S2'!$N$34)","v":{"$error":"#N/A"}},{"$f":"IF(ISTEXT('S2'!$N$35),NA(),'S2'!$N$35)","v":{"$error":"#N/A"}},{"$f":"IF(ISTEXT('S2'!$N$36),NA(),'S2'!$N$36)","v":{"$error":"#N/A"}},null,{"$f":"IF(ISTEXT('S2'!$N$37),NA(),'S2'!$N$37)","v":{"$error":"#N/A"}},null,{"$f":"IF(ISTEXT('S2'!$N$38),NA(),'S2'!$N$38)","v":{"$error":"#N/A"}}]
[]
[{"$f":"IF(ISBLANK('S3'!C$8),\" \",'S3'!C$8)","v":" "},{"$f":"IF(ISTEXT('S3'!$D$13),NA(),'S3'!$D$13)","v":{"$error":"#N/A"}},{"$f":"IF(ISTEXT('S3'!$D$14),NA(),'S3'!$D$14)","v":{"$error":"#N/A"}},{"$f":"IF(ISTEXT('S3'!$D$15),NA(),'S3'!$D$15)","v":{"$error":"#N/A"}},{"$f":"IF(ISTEXT('S3'!$D$16),NA(),'S3'!$D$16)","v":{"$error":"#N/A"}},{"$f":"IF(ISTEXT('S3'!$D$17),NA(),'S3'!$D$17)","v":{"$error":"#N/A"}},{"$f":"IF(ISTEXT('S3'!$D$18),NA(),'S3'!$D$18)","v":{"$error":"#N/A"}},null,{"$f":"IF(ISTEXT('S3'!$D$19),NA(),'S3'!$D$19)","v":{"$error":"#N/A"}},null,{"$f":"IF(ISTEXT('S3'!$D$20),NA(),'S3'!$D$20)","v":{"$error":"#N/A"}}]
[{"$f":"IF(ISBLANK('S3'!E$8),\" \",'S3'!E$8)","v":" "},{"$f":"IF(ISTEXT('S3'!$F$13),NA(),'S3'!$F$13)","v":{"$error":"#N/A"}},{"$f":"IF(ISTEXT('S3'!$F$14),NA(),'S3'!$F$14)","v":{"$error":"#N/A"}},{"$f":"IF(ISTEXT('S3'!$F$15),NA(),'S3'!$F$15)","v":{"$error":"#N/A"}},{"$f":"IF(ISTEXT('S3'!$F$16),NA(),'S3'!$F$16)","v":{"$error":"#N/A"}},{"$f":"IF(ISTEXT('S3'!$F$17),NA(),'S3'!$F$17)","v":{"$error":"#N/A"}},{"$f":"IF(ISTEXT('S3'!$F$18),NA(),'S3'!$F$18)","v":{"$error":"#N/A"}},null,{"$f":"IF(ISTEXT('S3'!$F$19),NA(),'S3'!$F$19)","v":{"$error":"#N/A"}},null,{"$f":"IF(ISTEXT('S3'!$F$20),NA(),'S3'!$F$20)","v":{"$error":"#N/A"}}]
[{"$f":"IF(ISBLANK('S3'!G$8),\" \",'S3'!G$8)","v":" "},{"$f":"IF(ISTEXT('S3'!$H$13),NA(),'S3'!$H$13)","v":{"$error":"#N/A"}},{"$f":"IF(ISTEXT('S3'!$H$14),NA(),'S3'!$H$14)","v":{"$error":"#N/A"}},{"$f":"IF(ISTEXT('S3'!$H$15),NA(),'S3'!$H$15)","v":{"$error":"#N/A"}},{"$f":"IF(ISTEXT('S3'!$H$16),NA(),'S3'!$H$16)","v":{"$error":"#N/A"}},{"$f":"IF(ISTEXT('S3'!$H$17),NA(),'S3'!$H$17)","v":{"$error":"#N/A"}},{"$f":"IF(ISTEXT('S3'!$H$18),NA(),'S3'!$H$18)","v":{"$error":"#N/A"}},null,{"$f":"IF(ISTEXT('S3'!$H$19),NA(),'S3'!$H$19)","v":{"$error":"#N/A"}},null,{"$f":"IF(ISTEXT('S3'!$H$20),NA(),'S3'!$H$20)","v":{"$error":"#N/A"}}]
[{"$f":"IF(ISBLANK('S3'!I$8),\" \",'S3'!I$8)","v":" "},{"$f":"IF(ISTEXT('S3'!$J$13),NA(),'S3'!$J$13)","v":{"$error":"#N/A"}},{"$f":"IF(ISTEXT('S3'!$J$14),NA(),'S3'!$J$14)","v":{"$error":"#N/A"}},{"$f":"IF(ISTEXT('S3'!$J$15),NA(),'S3'!$J$15)","v":{"$error":"#N/A"}},{"$f":"IF(ISTEXT('S3'!$J$16),NA(),'S3'!$J$16)","v":{"$error":"#N/A"}},{"$f":"IF(ISTEXT('S3'!$J$17),NA(),'S3'!$J$17)","v":{"$error":"#N/A"}},{"$f":"IF(ISTEXT('S3'!$J$18),NA(),'S3'!$J$18)","v":{"$error":"#N/A"}},null,{"$f":"IF(ISTEXT('S3'!$J$19),NA(),'S3'!$J$19)","v":{"$error":"#N/A"}},null,{"$f":"IF(ISTEXT('S3'!$J$20),NA(),'S3'!$J$20)","v":{"$error":"#N/A"}}]
[{"$f":"IF(ISBLANK('S3'!K$8),\" \",'S3'!K$8)","v":" "},{"$f":"IF(ISTEXT('S3'!$L$13),NA(),'S3'!$L$13)","v":{"$error":"#N/A"}},{"$f":"IF(ISTEXT('S3'!$L$14),NA(),'S3'!$L$14)","v":{"$error":"#N/A"}},{"$f":"IF(ISTEXT('S3'!$L$15),NA(),'S3'!$L$15)","v":{"$error":"#N/A"}},{"$f":"IF(ISTEXT('S3'!$L$16),NA(),'S3'!$L$16)","v":{"$error":"#N/A"}},{"$f":"IF(ISTEXT('S3'!$L$17),NA(),'S3'!$L$17)","v":{"$error":"#N/A"}},{"$f":"IF(ISTEXT('S3'!$L$18),NA(),'S3'!$L$18)","v":{"$error":"#N/A"}},null,{"$f":"IF(ISTEXT('S3'!$L$19),NA(),'S3'!$L$19)","v":{"$error":"#N/A"}},null,{"$f":"IF(ISTEXT('S3'!$L$20),NA(),'S3'!$L$20)","v":{"$error":"#N/A"}}]
[{"$f":"IF(ISBLANK('S3'!M$8),\" \",'S3'!M$8)","v":" "},{"$f":"IF(ISTEXT('S3'!$N$13),NA(),'S3'!$N$13)","v":{"$error":"#N/A"}},{"$f":"IF(ISTEXT('S3'!$N$14),NA(),'S3'!$N$14)","v":{"$error":"#N/A"}},{"$f":"IF(ISTEXT('S3'!$N$15),NA(),'S3'!$N$15)","v":{"$error":"#N/A"}},{"$f":"IF(ISTEXT('S3'!$N$16),NA(),'S3'!$N$16)","v":{"$error":"#N/A"}},{"$f":"IF(ISTEXT('S3'!$N$17),NA(),'S3'!$N$17)","v":{"$error":"#N/A"}},{"$f":"IF(ISTEXT('S3'!$N$18),NA(),'S3'!$N$18)","v":{"$error":"#N/A"}},null,{"$f":"IF(ISTEXT('S3'!$N$19),NA(),'S3'!$N$19)","v":{"$error":"#N/A"}},null,{"$f":"IF(ISTEXT('S3'!$N$20),NA(),'S3'!$N$20)","v":{"$error":"#N/A"}}]
[{"$f":"IF(ISBLANK('S3'!C$26),\" \",'S3'!C$26)","v":" "},{"$f":"IF(ISTEXT('S3'!$D$31),NA(),'S3'!$D$31)","v":{"$error":"#N/A"}},{"$f":"IF(ISTEXT('S3'!$D$32),NA(),'S3'!$D$32)","v":{"$error":"#N/A"}},{"$f":"IF(ISTEXT('S3'!$D$33),NA(),'S3'!$D$33)","v":{"$error":"#N/A"}},{"$f":"IF(ISTEXT('S3'!$D$34),NA(),'S3'!$D$34)","v":{"$error":"#N/A"}},{"$f":"IF(ISTEXT('S3'!$D$35),NA(),'S3'!$D$35)","v":{"$error":"#N/A"}},{"$f":"IF(ISTEXT('S3'!$D$36),NA(),'S3'!$D$36)","v":{"$error":"#N/A"}},null,{"$f":"IF(ISTEXT('S3'!$D$37),NA(),'S3'!$D$37)","v":{"$error":"#N/A"}},null,{"$f":"IF(ISTEXT('S3'!$D$38),NA(),'S3'!$D$38)","v":{"$error":"#N/A"}}]
[{"$f":"IF(ISBLANK('S3'!E$26),\" \",'S3'!E$26)","v":" "},{"$f":"IF(ISTEXT('S3'!$F$31),NA(),'S3'!$F$31)","v":{"$error":"#N/A"}},{"$f":"IF(ISTEXT('S3'!$F$32),NA(),'S3'!$F$32)","v":{"$error":"#N/A"}},{"$f":"IF(ISTEXT('S3'!$F$33),NA(),'S3'!$F$33)","v":{"$error":"#N/A"}},{"$f":"IF(ISTEXT('S3'!$F$34),NA(),'S3'!$F$34)","v":{"$error":"#N/A"}},{"$f":"IF(ISTEXT('S3'!$F$35),NA(),'S3'!$F$35)","v":{"$error":"#N/A"}},{"$f":"IF(ISTEXT('S3'!$F$36),NA(),'S3'!$F$36)","v":{"$error":"#N/A"}},null,{"$f":"IF(ISTEXT('S3'!$F$37),NA(),'S3'!$F$37)","v":{"$error":"#N/A"}},null,{"$f":"IF(ISTEXT('S3'!$F$38),NA(),'S3'!$F$38)","v":{"$error":"#N/A"}}]
[{"$f":"IF(ISBLANK('S3'!G$26),\" \",'S3'!G$26)","v":" "},{"$f":"IF(ISTEXT('S3'!$H$31),NA(),'S3'!$H$31)","v":{"$error":"#N/A"}},{"$f":"IF(ISTEXT('S3'!$H$32),NA(),'S3'!$H$32)","v":{"$error":"#N/A"}},{"$f":"IF(ISTEXT('S3'!$H$33),NA(),'S3'!$H$33)","v":{"$error":"#N/A"}},{"$f":"IF(ISTEXT('S3'!$H$34),NA(),'S3'!$H$34)","v":{"$error":"#N/A"}},{"$f":"IF(ISTEXT('S3'!$H$35),NA(),'S3'!$H$35)","v":{"$error":"#N/A"}},{"$f":"IF(ISTEXT('S3'!$H$36),NA(),'S3'!$H$36)","v":{"$error":"#N/A"}},null,{"$f":"IF(ISTEXT('S3'!$H$37),NA(),'S3'!$H$37)","v":{"$error":"#N/A"}},null,{"$f":"IF(ISTEXT('S3'!$H$38),NA(),'S3'!$H$38)","v":{"$error":"#N/A"}}]
[{"$f":"IF(ISBLANK('S3'!I$26),\" \",'S3'!I$26)","v":" "},{"$f":"IF(ISTEXT('S3'!$J$31),NA(),'S3'!$J$31)","v":{"$error":"#N/A"}},{"$f":"IF(ISTEXT('S3'!$J$32),NA(),'S3'!$J$32)","v":{"$error":"#N/A"}},{"$f":"IF(ISTEXT('S3'!$J$33),NA(),'S3'!$J$33)","v":{"$error":"#N/A"}},{"$f":"IF(ISTEXT('S3'!$J$34),NA(),'S3'!$J$34)","v":{"$error":"#N/A"}},{"$f":"IF(ISTEXT('S3'!$J$35),NA(),'S3'!$J$35)","v":{"$error":"#N/A"}},{"$f":"IF(ISTEXT('S3'!$J$36),NA(),'S3'!$J$36)","v":{"$error":"#N/A"}},null,{"$f":"IF(ISTEXT('S3'!$J$37),NA(),'S3'!$J$37)","v":{"$error":"#N/A"}},null,{"$f":"IF(ISTEXT('S3'!$J$38),NA(),'S3'!$J$38)","v":{"$error":"#N/A"}}]
[{"$f":"IF(ISBLANK('S3'!K$26),\" \",'S3'!K$26)","v":" "},{"$f":"IF(ISTEXT('S3'!$L$31),NA(),'S3'!$L$31)","v":{"$error":"#N/A"}},{"$f":"IF(ISTEXT('S3'!$L$32),NA(),'S3'!$L$32)","v":{"$error":"#N/A"}},{"$f":"IF(ISTEXT('S3'!$L$33),NA(),'S3'!$L$33)","v":{"$error":"#N/A"}},{"$f":"IF(ISTEXT('S3'!$L$34),NA(),'S3'!$L$34)","v":{"$error":"#N/A"}},{"$f":"IF(ISTEXT('S3'!$L$35),NA(),'S3'!$L$35)","v":{"$error":"#N/A"}},{"$f":"IF(ISTEXT('S3'!$L$36),NA(),'S3'!$L$36)","v":{"$error":"#N/A"}},null,{"$f":"IF(ISTEXT('S3'!$L$37),NA(),'S3'!$L$37)","v":{"$error":"#N/A"}},null,{"$f":"IF(ISTEXT('S3'!$L$38),NA(),'S3'!$L$38)","v":{"$error":"#N/A"}}]
[{"$f":"IF(ISBLANK('S3'!M$26),\" \",'S3'!M$26)","v":" "},{"$f":"IF(ISTEXT('S3'!$N$31),NA(),'S3'!$N$31)","v":{"$error":"#N/A"}},{"$f":"IF(ISTEXT('S3'!$N$32),NA(),'S3'!$N$32)","v":{"$error":"#N/A"}},{"$f":"IF(ISTEXT('S3'!$N$33),NA(),'S3'!$N$33)","v":{"$error":"#N/A"}},{"$f":"IF(ISTEXT('S3'!$N$34),NA(),'S3'!$N$34)","v":{"$error":"#N/A"}},{"$f":"IF(ISTEXT('S3'!$N$35),NA(),'S3'!$N$35)","v":{"$error":"#N/A"}},{"$f":"IF(ISTEXT('S3'!$N$36),NA(),'S3'!$N$36)","v":{"$error":"#N/A"}},null,{"$f":"IF(ISTEXT('S3'!$N$37),NA(),'S3'!$N$37)","v":{"$error":"#N/A"}},null,{"$f":"IF(ISTEXT('S3'!$N$38),NA(),'S3'!$N$38)","v":{"$error":"#N/A"}}]
[{"$f":"IF(ISBLANK('S4'!C$8),\" \",'S4'!C$8)","v":" "},{"$f":"IF(ISTEXT('S4'!$D$13),NA(),'S4'!$D$13)","v":{"$error":"#N/A"}},{"$f":"IF(ISTEXT('S4'!$D$14),NA(),'S4'!$D$14)","v":{"$error":"#N/A"}},{"$f":"IF(ISTEXT('S4'!$D$15),NA(),'S4'!$D$15)","v":{"$error":"#N/A"}},{"$f":"IF(ISTEXT('S4'!$D$16),NA(),'S4'!$D$16)","v":{"$error":"#N/A"}},{"$f":"IF(ISTEXT('S4'!$D$17),NA(),'S4'!$D$17)","v":{"$error":"#N/A"}},{"$f":"IF(ISTEXT('S4'!$D$18),NA(),'S4'!$D$18)","v":{"$error":"#N/A"}},null,{"$f":"IF(ISTEXT('S4'!$D$19),NA(),'S4'!$D$19)","v":{"$error":"#N/A"}},null,{"$f":"IF(ISTEXT('S4'!$D$20),NA(),'S4'!$D$20)","v":{"$error":"#N/A"}}]
[{"$f":"IF(ISBLANK('S4'!E$8),\" \",'S4'!E$8)","v":" "},{"$f":"IF(ISTEXT('S4'!$F$13),NA(),'S4'!$F$13)","v":{"$error":"#N/A"}},{"$f":"IF(ISTEXT('S4'!$F$14),NA(),'S4'!$F$14)","v":{"$error":"#N/A"}},{"$f":"IF(ISTEXT('S4'!$F$15),NA(),'S4'!$F$15)","v":{"$error":"#N/A"}},{"$f":"IF(ISTEXT('S4'!$F$16),NA(),'S4'!$F$16)","v":{"$error":"#N/A"}},{"$f":"IF(ISTEXT('S4'!$F$17),NA(),'S4'!$F$17)","v":{"$error":"#N/A"}},{"$f":"IF(ISTEXT('S4'!$F$18),NA(),'S4'!$F$18)","v":{"$error":"#N/A"}},null,{"$f":"IF(ISTEXT('S4'!$F$19),NA(),'S4'!$F$19)","v":{"$error":"#N/A"}},null,{"$f":"IF(ISTEXT('S4'!$F$20),NA(),'S4'!$F$20)","v":{"$error":"#N/A"}}]
[{"$f":"IF(ISBLANK('S4'!G$8),\" \",'S4'!G$8)","v":" "},{"$f":"IF(ISTEXT('S4'!$H$13),NA(),'S4'!$H$13)","v":{"$error":"#N/A"}},{"$f":"IF(ISTEXT('S4'!$H$14),NA(),'S4'!$H$14)","v":{"$error":"#N/A"}},{"$f":"IF(ISTEXT('S4'!$H$15),NA(),'S4'!$H$15)","v":{"$error":"#N/A"}},{"$f":"IF(ISTEXT('S4'!$H$16),NA(),'S4'!$H$16)","v":{"$error":"#N/A"}},{"$f":"IF(ISTEXT('S4'!$H$17),NA(),'S4'!$H$17)","v":{"$error":"#N/A"}},{"$f":"IF(ISTEXT('S4'!$H$18),NA(),'S4'!$H$18)","v":{"$error":"#N/A"}},null,{"$f":"IF(ISTEXT('S4'!$H$19),NA(),'S4'!$H$19)","v":{"$error":"#N/A"}},null,{"$f":"IF(ISTEXT('S4'!$H$20),NA(),'S4'!$H$20)","v":{"$error":"#N/A"}}]
[{"$f":"IF(ISBLANK('S4'!I$8),\" \",'S4'!I$8)","v":" "},{"$f":"IF(ISTEXT('S4'!$J$13),NA(),'S4'!$J$13)","v":{"$error":"#N/A"}},{"$f":"IF(ISTEXT('S4'!$J$14),NA(),'S4'!$J$14)","v":{"$error":"#N/A"}},{"$f":"IF(ISTEXT('S4'!$J$15),NA(),'S4'!$J$15)","v":{"$error":"#N/A"}},{"$f":"IF(ISTEXT('S4'!$J$16),NA(),'S4'!$J$16)","v":{"$error":"#N/A"}},{"$f":"IF(ISTEXT('S4'!$J$17),NA(),'S4'!$J$17)","v":{"$error":"#N/A"}},{"$f":"IF(ISTEXT('S4'!$J$18),NA(),'S4'!$J$18)","v":{"$error":"#N/A"}},null,{"$f":"IF(ISTEXT('S4'!$J$19),NA(),'S4'!$J$19)","v":{"$error":"#N/A"}},null,{"$f":"IF(ISTEXT('S4'!$J$20),NA(),'S4'!$J$20)","v":{"$error":"#N/A"}}]
[{"$f":"IF(ISBLANK('S4'!K$8),\" \",'S4'!K$8)","v":" "},{"$f":"IF(ISTEXT('S4'!$L$13),NA(),'S4'!$L$13)","v":{"$error":"#N/A"}},{"$f":"IF(ISTEXT('S4'!$L$14),NA(),'S4'!$L$14)","v":{"$error":"#N/A"}},{"$f":"IF(ISTEXT('S4'!$L$15),NA(),'S4'!$L$15)","v":{"$error":"#N/A"}},{"$f":"IF(ISTEXT('S4'!$L$16),NA(),'S4'!$L$16)","v":{"$error":"#N/A"}},{"$f":"IF(ISTEXT('S4'!$L$17),NA(),'S4'!$L$17)","v":{"$error":"#N/A"}},{"$f":"IF(ISTEXT('S4'!$L$18),NA(),'S4'!$L$18)","v":{"$error":"#N/A"}},null,{"$f":"IF(ISTEXT('S4'!$L$19),NA(),'S4'!$L$19)","v":{"$error":"#N/A"}},null,{"$f":"IF(ISTEXT('S4'!$L$20),NA(),'S4'!$L$20)","v":{"$error":"#N/A"}}]
[{"$f":"IF(ISBLANK('S4'!M$8),\" \",'S4'!M$8)","v":" "},{"$f":"IF(ISTEXT('S4'!$N$13),NA(),'S4'!$N$13)","v":{"$error":"#N/A"}},{"$f":"IF(ISTEXT('S4'!$N$14),NA(),'S4'!$N$14)","v":{"$error":"#N/A"}},{"$f":"IF(ISTEXT('S4'!$N$15),NA(),'S4'!$N$15)","v":{"$error":"#N/A"}},{"$f":"IF(ISTEXT('S4'!$N$16),NA(),'S4'!$N$16)","v":{"$error":"#N/A"}},{"$f":"IF(ISTEXT('S4'!$N$17),NA(),'S4'!$N$17)","v":{"$error":"#N/A"}},{"$f":"IF(ISTEXT('S4'!$N$18),NA(),'S4'!$N$18)","v":{"$error":"#N/A"}},null,{"$f":"IF(ISTEXT('S4'!$N$19),NA(),'S4'!$N$19)","v":{"$error":"#N/A"}},null,{"$f":"IF(ISTEXT('S4'!$N$20),NA(),'S4'!$N$20)","v":{"$error":"#N/A"}}]
[{"$f":"IF(ISBLANK('S4'!C$26),\" \",'S4'!C$26)","v":" "},{"$f":"IF(ISTEXT('S4'!$D$31),NA(),'S4'!$D$31)","v":{"$error":"#N/A"}},{"$f":"IF(ISTEXT('S4'!$D$32),NA(),'S4'!$D$32)","v":{"$error":"#N/A"}},{"$f":"IF(ISTEXT('S4'!$D$33),NA(),'S4'!$D$33)","v":{"$error":"#N/A"}},{"$f":"IF(ISTEXT('S4'!$D$34),NA(),'S4'!$D$34)","v":{"$error":"#N/A"}},{"$f":"IF(ISTEXT('S4'!$D$35),NA(),'S4'!$D$35)","v":{"$error":"#N/A"}},{"$f":"IF(ISTEXT('S4'!$D$36),NA(),'S4'!$D$36)","v":{"$error":"#N/A"}},null,{"$f":"IF(ISTEXT('S4'!$D$37),NA(),'S4'!$D$37)","v":{"$error":"#N/A"}},null,{"$f":"IF(ISTEXT('S4'!$D$38),NA(),'S4'!$D$38)","v":{"$error":"#N/A"}}]
[{"$f":"IF(ISBLANK('S4'!E$26),\" \",'S4'!E$26)","v":" "},{"$f":"IF(ISTEXT('S4'!$F$31),NA(),'S4'!$F$31)","v":{"$error":"#N/A"}},{"$f":"IF(ISTEXT('S4'!$F$32),NA(),'S4'!$F$32)","v":{"$error":"#N/A"}},{"$f":"IF(ISTEXT('S4'!$F$33),NA(),'S4'!$F$33)","v":{"$error":"#N/A"}},{"$f":"IF(ISTEXT('S4'!$F$34),NA(),'S4'!$F$34)","v":{"$error":"#N/A"}},{"$f":"IF(ISTEXT('S4'!$F$35),NA(),'S4'!$F$35)","v":{"$error":"#N/A"}},{"$f":"IF(ISTEXT('S4'!$F$36),NA(),'S4'!$F$36)","v":{"$error":"#N/A"}},null,{"$f":"IF(ISTEXT('S4'!$F$37),NA(),'S4'!$F$37)","v":{"$error":"#N/A"}},null,{"$f":"IF(ISTEXT('S4'!$F$38),NA(),'S4'!$F$38)","v":{"$error":"#N/A"}}]
[{"$f":"IF(ISBLANK('S4'!G$26),\" \",'S4'!G$26)","v":" "},{"$f":"IF(ISTEXT('S4'!$H$31),NA(),'S4'!$H$31)","v":{"$error":"#N/A"}},{"$f":"IF(ISTEXT('S4'!$H$32),NA(),'S4'!$H$32)","v":{"$error":"#N/A"}},{"$f":"IF(ISTEXT('S4'!$H$33),NA(),'S4'!$H$33)","v":{"$error":"#N/A"}},{"$f":"IF(ISTEXT('S4'!$H$34),NA(),'S4'!$H$34)","v":{"$error":"#N/A"}},{"$f":"IF(ISTEXT('S4'!$H$35),NA(),'S4'!$H$35)","v":{"$error":"#N/A"}},{"$f":"IF(ISTEXT('S4'!$H$36),NA(),'S4'!$H$36)","v":{"$error":"#N/A"}},null,{"$f":"IF(ISTEXT('S4'!$H$37),NA(),'S4'!$H$37)","v":{"$error":"#N/A"}},null,{"$f":"IF(ISTEXT('S4'!$H$38),NA(),'S4'!$H$38)","v":{"$error":"#N/A"}}]
[{"$f":"IF(ISBLANK('S4'!I$26),\" \",'S4'!I$26)","v":" "},{"$f":"IF(ISTEXT('S4'!$J$31),NA(),'S4'!$J$31)","v":{"$error":"#N/A"}},{"$f":"IF(ISTEXT('S4'!$J$32),NA(),'S4'!$J$32)","v":{"$error":"#N/A"}},{"$f":"IF(ISTEXT('S4'!$J$33),NA(),'S4'!$J$33)","v":{"$error":"#N/A"}},{"$f":"IF(ISTEXT('S4'!$J$34),NA(),'S4'!$J$34)","v":{"$error":"#N/A"}},{"$f":"IF(ISTEXT('S4'!$J$35),NA(),'S4'!$J$35)","v":{"$error":"#N/A"}},{"$f":"IF(ISTEXT('S4'!$J$36),NA(),'S4'!$J$36)","v":{"$error":"#N/A"}},null,{"$f":"IF(ISTEXT('S4'!$J$37),NA(),'S4'!$J$37)","v":{"$error":"#N/A"}},null,{"$f":"IF(ISTEXT('S4'!$J$38),NA(),'S4'!$J$38)","v":{"$error":"#N/A"}}]
[{"$f":"IF(ISBLANK('S4'!K$26),\" \",'S4'!K$26)","v":" "},{"$f":"IF(ISTEXT('S4'!$L$31),NA(),'S4'!$L$31)","v":{"$error":"#N/A"}},{"$f":"IF(ISTEXT('S4'!$L$32),NA(),'S4'!$L$32)","v":{"$error":"#N/A"}},{"$f":"IF(ISTEXT('S4'!$L$33),NA(),'S4'!$L$33)","v":{"$error":"#N/A"}},{"$f":"IF(ISTEXT('S4'!$L$34),NA(),'S4'!$L$34)","v":{"$error":"#N/A"}},{"$f":"IF(ISTEXT('S4'!$L$35),NA(),'S4'!$L$35)","v":{"$error":"#N/A"}},{"$f":"IF(ISTEXT('S4'!$L$36),NA(),'S4'!$L$36)","v":{"$error":"#N/A"}},null,{"$f":"IF(ISTEXT('S4'!$L$37),NA(),'S4'!$L$37)","v":{"$error":"#N/A"}},null,{"$f":"IF(ISTEXT('S4'!$L$38),NA(),'S4'!$L$38)","v":{"$error":"#N/A"}}]
[{"$f":"IF(ISBLANK('S4'!M$26),\" \",'S4'!M$26)","v":" "},{"$f":"IF(ISTEXT('S4'!$N$31),NA(),'S4'!$N$31)","v":{"$error":"#N/A"}},{"$f":"IF(ISTEXT('S4'!$N$32),NA(),'S4'!$N$32)","v":{"$error":"#N/A"}},{"$f":"IF(ISTEXT('S4'!$N$33),NA(),'S4'!$N$33)","v":{"$error":"#N/A"}},{"$f":"IF(ISTEXT('S4'!$N$34),NA(),'S4'!$N$34)","v":{"$error":"#N/A"}},{"$f":"IF(ISTEXT('S4'!$N$35),NA(),'S4'!$N$35)","v":{"$error":"#N/A"}},{"$f":"IF(ISTEXT('S4'!$N$36),NA(),'S4'!$N$36)","v":{"$error":"#N/A"}},null,{"$f":"IF(ISTEXT('S4'!$N$37),NA(),'S4'!$N$37)","v":{"$error":"#N/A"}},null,{"$f":"IF(ISTEXT('S4'!$N$38),NA(),'S4'!$N$38)","v":{"$error":"#N/A"}}]
[]
[{"$f":"IF(ISBLANK('S5'!C$8),\" \",'S5'!C$8)","v":" "},{"$f":"IF(ISTEXT('S5'!$D$13),NA(),'S5'!$D$13)","v":{"$error":"#N/A"}},{"$f":"IF(ISTEXT('S5'!$D$14),NA(),'S5'!$D$14)","v":{"$error":"#N/A"}},{"$f":"IF(ISTEXT('S5'!$D$15),NA(),'S5'!$D$15)","v":{"$error":"#N/A"}},{"$f":"IF(ISTEXT('S5'!$D$16),NA(),'S5'!$D$16)","v":{"$error":"#N/A"}},{"$f":"IF(ISTEXT('S5'!$D$17),NA(),'S5'!$D$17)","v":{"$error":"#N/A"}},{"$f":"IF(ISTEXT('S5'!$D$18),NA(),'S5'!$D$18)","v":{"$error":"#N/A"}},null,{"$f":"IF(ISTEXT('S5'!$D$19),NA(),'S5'!$D$19)","v":{"$error":"#N/A"}},null,{"$f":"IF(ISTEXT('S5'!$D$20),NA(),'S5'!$D$20)","v":{"$error":"#N/A"}}]
[{"$f":"IF(ISBLANK('S5'!E$8),\" \",'S5'!E$8)","v":" "},{"$f":"IF(ISTEXT('S5'!$F$13),NA(),'S5'!$F$13)","v":{"$error":"#N/A"}},{"$f":"IF(ISTEXT('S5'!$F$14),NA(),'S5'!$F$14)","v":{"$error":"#N/A"}},{"$f":"IF(ISTEXT('S5'!$F$15),NA(),'S5'!$F$15)","v":{"$error":"#N/A"}},{"$f":"IF(ISTEXT('S5'!$F$16),NA(),'S5'!$F$16)","v":{"$error":"#N/A"}},{"$f":"IF(ISTEXT('S5'!$F$17),NA(),'S5'!$F$17)","v":{"$error":"#N/A"}},{"$f":"IF(ISTEXT('S5'!$F$18),NA(),'S5'!$F$18)","v":{"$error":"#N/A"}},null,{"$f":"IF(ISTEXT('S5'!$F$19),NA(),'S5'!$F$19)","v":{"$error":"#N/A"}},null,{"$f":"IF(ISTEXT('S5'!$F$20),NA(),'S5'!$F$20)","v":{"$error":"#N/A"}}]
[{"$f":"IF(ISBLANK('S5'!G$8),\" \",'S5'!G$8)","v":" "},{"$f":"IF(ISTEXT('S5'!$H$13),NA(),'S5'!$H$13)","v":{"$error":"#N/A"}},{"$f":"IF(ISTEXT('S5'!$H$14),NA(),'S5'!$H$14)","v":{"$error":"#N/A"}},{"$f":"IF(ISTEXT('S5'!$H$15),NA(),'S5'!$H$15)","v":{"$error":"#N/A"}},{"$f":"IF(ISTEXT('S5'!$H$16),NA(),'S5'!$H$16)","v":{"$error":"#N/A"}},{"$f":"IF(ISTEXT('S5'!$H$17),NA(),'S5'!$H$17)","v":{"$error":"#N/A"}},{"$f":"IF(ISTEXT('S5'!$H$18),NA(),'S5'!$H$18)","v":{"$error":"#N/A"}},null,{"$f":"IF(ISTEXT('S5'!$H$19),NA(),'S5'!$H$19)","v":{"$error":"#N/A"}},null,{"$f":"IF(ISTEXT('S5'!$H$20),NA(),'S5'!$H$20)","v":{"$error":"#N/A"}}]
[{"$f":"IF(ISBLANK('S5'!I$8),\" \",'S5'!I$8)","v":" "},{"$f":"IF(ISTEXT('S5'!$J$13),NA(),'S5'!$J$13)","v":{"$error":"#N/A"}},{"$f":"IF(ISTEXT('S5'!$J$14),NA(),'S5'!$J$14)","v":{"$error":"#N/A"}},{"$f":"IF(ISTEXT('S5'!$J$15),NA(),'S5'!$J$15)","v":{"$error":"#N/A"}},{"$f":"IF(ISTEXT('S5'!$J$16),NA(),'S5'!$J$16)","v":{"$error":"#N/A"}},{"$f":"IF(ISTEXT('S5'!$J$17),NA(),'S5'!$J$17)","v":{"$error":"#N/A"}},{"$f":"IF(ISTEXT('S5'!$J$18),NA(),'S5'!$J$18)","v":{"$error":"#N/A"}},null,{"$f":"IF(ISTEXT('S5'!$J$19),NA(),'S5'!$J$19)","v":{"$error":"#N/A"}},null,{"$f":"IF(ISTEXT('S5'!$J$20),NA(),'S5'!$J$20)","v":{"$error":"#N/A"}}]
[{"$f":"IF(ISBLANK('S5'!K$8),\" \",'S5'!K$8)","v":" "},{"$f":"IF(ISTEXT('S5'!$L$13),NA(),'S5'!$L$13)","v":{"$error":"#N/A"}},{"$f":"IF(ISTEXT('S5'!$L$14),NA(),'S5'!$L$14)","v":{"$error":"#N/A"}},{"$f":"IF(ISTEXT('S5'!$L$15),NA(),'S5'!$L$15)","v":{"$error":"#N/A"}},{"$f":"IF(ISTEXT('S5'!$L$16),NA(),'S5'!$L$16)","v":{"$error":"#N/A"}},{"$f":"IF(ISTEXT('S5'!$L$17),NA(),'S5'!$L$17)","v":{"$error":"#N/A"}},{"$f":"IF(ISTEXT('S5'!$L$18),NA(),'S5'!$L$18)","v":{"$error":"#N/A"}},null,{"$f":"IF(ISTEXT('S5'!$L$19),NA(),'S5'!$L$19)","v":{"$error":"#N/A"}},null,{"$f":"IF(ISTEXT('S5'!$L$20),NA(),'S5'!$L$20)","v":{"$error":"#N/A"}}]
[{"$f":"IF(ISBLANK('S5'!M$8),\" \",'S5'!M$8)","v":" "},{"$f":"IF(ISTEXT('S5'!$N$13),NA(),'S5'!$N$13)","v":{"$error":"#N/A"}},{"$f":"IF(ISTEXT('S5'!$N$14),NA(),'S5'!$N$14)","v":{"$error":"#N/A"}},{"$f":"IF(ISTEXT('S5'!$N$15),NA(),'S5'!$N$15)","v":{"$error":"#N/A"}},{"$f":"IF(ISTEXT('S5'!$N$16),NA(),'S5'!$N$16)","v":{"$error":"#N/A"}},{"$f":"IF(ISTEXT('S5'!$N$17),NA(),'S5'!$N$17)","v":{"$error":"#N/A"}},{"$f":"IF(ISTEXT('S5'!$N$18),NA(),'S5'!$N$18)","v":{"$error":"#N/A"}},null,{"$f":"IF(ISTEXT('S5'!$N$19),NA(),'S5'!$N$19)","v":{"$error":"#N/A"}},null,{"$f":"IF(ISTEXT('S5'!$N$20),NA(),'S5'!$N$20)","v":{"$error":"#N/A"}}]
[{"$f":"IF(ISBLANK('S5'!C$26),\" \",'S5'!C$26)","v":" "},{"$f":"IF(ISTEXT('S5'!$D$31),NA(),'S5'!$D$31)","v":{"$error":"#N/A"}},{"$f":"IF(ISTEXT('S5'!$D$32),NA(),'S5'!$D$32)","v":{"$error":"#N/A"}},{"$f":"IF(ISTEXT('S5'!$D$33),NA(),'S5'!$D$33)","v":{"$error":"#N/A"}},{"$f":"IF(ISTEXT('S5'!$D$34),NA(),'S5'!$D$34)","v":{"$error":"#N/A"}},{"$f":"IF(ISTEXT('S5'!$D$35),NA(),'S5'!$D$35)","v":{"$error":"#N/A"}},{"$f":"IF(ISTEXT('S5'!$D$36),NA(),'S5'!$D$36)","v":{"$error":"#N/A"}},null,{"$f":"IF(ISTEXT('S5'!$D$37),NA(),'S5'!$D$37)","v":{"$error":"#N/A"}},null,{"$f":"IF(ISTEXT('S5'!$D$38),NA(),'S5'!$D$38)","v":{"$error":"#N/A"}}]
[{"$f":"IF(ISBLANK('S5'!E$26),\" \",'S5'!E$26)","v":" "},{"$f":"IF(ISTEXT('S5'!$F$31),NA(),'S5'!$F$31)","v":{"$error":"#N/A"}},{"$f":"IF(ISTEXT('S5'!$F$32),NA(),'S5'!$F$32)","v":{"$error":"#N/A"}},{"$f":"IF(ISTEXT('S5'!$F$33),NA(),'S5'!$F$33)","v":{"$error":"#N/A"}},{"$f":"IF(ISTEXT('S5'!$F$34),NA(),'S5'!$F$34)","v":{"$error":"#N/A"}},{"$f":"IF(ISTEXT('S5'!$F$35),NA(),'S5'!$F$35)","v":{"$error":"#N/A"}},{"$f":"IF(ISTEXT('S5'!$F$36),NA(),'S5'!$F$36)","v":{"$error":"#N/A"}},null,{"$f":"IF(ISTEXT('S5'!$F$37),NA(),'S5'!$F$37)","v":{"$error":"#N/A"}},null,{"$f":"IF(ISTEXT('S5'!$F$38),NA(),'S5'!$F$38)","v":{"$error":"#N/A"}}]
[{"$f":"IF(ISBLANK('S5'!G$26),\" \",'S5'!G$26)","v":" "},{"$f":"IF(ISTEXT('S5'!$H$31),NA(),'S5'!$H$31)","v":{"$error":"#N/A"}},{"$f":"IF(ISTEXT('S5'!$H$32),NA(),'S5'!$H$32)","v":{"$error":"#N/A"}},{"$f":"IF(ISTEXT('S5'!$H$33),NA(),'S5'!$H$33)","v":{"$error":"#N/A"}},{"$f":"IF(ISTEXT('S5'!$H$34),NA(),'S5'!$H$34)","v":{"$error":"#N/A"}},{"$f":"IF(ISTEXT('S5'!$H$35),NA(),'S5'!$H$35)","v":{"$error":"#N/A"}},{"$f":"IF(ISTEXT('S5'!$H$36),NA(),'S5'!$H$36)","v":{"$error":"#N/A"}},null,{"$f":"IF(ISTEXT('S5'!$H$37),NA(),'S5'!$H$37)","v":{"$error":"#N/A"}},null,{"$f":"IF(ISTEXT('S5'!$H$38),NA(),'S5'!$H$38)","v":{"$error":"#N/A"}}]
[{"$f":"IF(ISBLANK('S5'!I$26),\" \",'S5'!I$26)","v":" "},{"$f":"IF(ISTEXT('S5'!$J$31),NA(),'S5'!$J$31)","v":{"$error":"#N/A"}},{"$f":"IF(ISTEXT('S5'!$J$32),NA(),'S5'!$J$32)","v":{"$error":"#N/A"}},{"$f":"IF(ISTEXT('S5'!$J$33),NA(),'S5'!$J$33)","v":{"$error":"#N/A"}},{"$f":"IF(ISTEXT('S5'!$J$34),NA(),'S5'!$J$34)","v":{"$error":"#N/A"}},{"$f":"IF(ISTEXT('S5'!$J$35),NA(),'S5'!$J$35)","v":{"$error":"#N/A"}},{"$f":"IF(ISTEXT('S5'!$J$36),NA(),'S5'!$J$36)","v":{"$error":"#N/A"}},null,{"$f":"IF(ISTEXT('S5'!$J$37),NA(),'S5'!$J$37)","v":{"$error":"#N/A"}},null,{"$f":"IF(ISTEXT('S5'!$J$38),NA(),'S5'!$J$38)","v":{"$error":"#N/A"}}]
[{"$f":"IF(ISBLANK('S5'!K$26),\" \",'S5'!K$26)","v":" "},{"$f":"IF(ISTEXT('S5'!$L$31),NA(),'S5'!$L$31)","v":{"$error":"#N/A"}},{"$f":"IF(ISTEXT('S5'!$L$32),NA(),'S5'!$L$32)","v":{"$error":"#N/A"}},{"$f":"IF(ISTEXT('S5'!$L$33),NA(),'S5'!$L$33)","v":{"$error":"#N/A"}},{"$f":"IF(ISTEXT('S5'!$L$34),NA(),'S5'!$L$34)","v":{"$error":"#N/A"}},{"$f":"IF(ISTEXT('S5'!$L$35),NA(),'S5'!$L$35)","v":{"$error":"#N/A"}},{"$f":"IF(ISTEXT('S5'!$L$36),NA(),'S5'!$L$36)","v":{"$error":"#N/A"}},null,{"$f":"IF(ISTEXT('S5'!$L$37),NA(),'S5'!$L$37)","v":{"$error":"#N/A"}},null,{"$f":"IF(ISTEXT('S5'!$L$38),NA(),'S5'!$L$38)","v":{"$error":"#N/A"}}]
[{"$f":"IF(ISBLANK('S5'!M$26),\" \",'S5'!M$26)","v":" "},{"$f":"IF(ISTEXT('S5'!$N$31),NA(),'S5'!$N$31)","v":{"$error":"#N/A"}},{"$f":"IF(ISTEXT('S5'!$N$32),NA(),'S5'!$N$32)","v":{"$error":"#N/A"}},{"$f":"IF(ISTEXT('S5'!$N$33),NA(),'S5'!$N$33)","v":{"$error":"#N/A"}},{"$f":"IF(ISTEXT('S5'!$N$34),NA(),'S5'!$N$34)","v":{"$error":"#N/A"}},{"$f":"IF(ISTEXT('S5'!$N$35),NA(),'S5'!$N$35)","v":{"$error":"#N/A"}},{"$f":"IF(ISTEXT('S5'!$N$36),NA(),'S5'!$N$36)","v":{"$error":"#N/A"}},null,{"$f":"IF(ISTEXT('S5'!$N$37),NA(),'S5'!$N$37)","v":{"$error":"#N/A"}},null,{"$f":"IF(ISTEXT('S5'!$N$38),NA(),'S5'!$N$38)","v":{"$error":"#N/A"}}]
[{"$f":"IF(ISBLANK('S6'!C$8),\" \",'S6'!C$8)","v":" "},{"$f":"IF(ISTEXT('S6'!$D$13),NA(),'S6'!$D$13)","v":{"$error":"#N/A"}},{"$f":"IF(ISTEXT('S6'!$D$14),NA(),'S6'!$D$14)","v":{"$error":"#N/A"}},{"$f":"IF(ISTEXT('S6'!$D$15),NA(),'S6'!$D$15)","v":{"$error":"#N/A"}},{"$f":"IF(ISTEXT('S6'!$D$16),NA(),'S6'!$D$16)","v":{"$error":"#N/A"}},{"$f":"IF(ISTEXT('S6'!$D$17),NA(),'S6'!$D$17)","v":{"$error":"#N/A"}},{"$f":"IF(ISTEXT('S6'!$D$18),NA(),'S6'!$D$18)","v":{"$error":"#N/A"}},null,{"$f":"IF(ISTEXT('S6'!$D$19),NA(),'S6'!$D$19)","v":{"$error":"#N/A"}},null,{"$f":"IF(ISTEXT('S6'!$D$20),NA(),'S6'!$D$20)","v":{"$error":"#N/A"}}]
[{"$f":"IF(ISBLANK('S6'!E$8),\" \",'S6'!E$8)","v":" "},{"$f":"IF(ISTEXT('S6'!$F$13),NA(),'S6'!$F$13)","v":{"$error":"#N/A"}},{"$f":"IF(ISTEXT('S6'!$F$14),NA(),'S6'!$F$14)","v":{"$error":"#N/A"}},{"$f":"IF(ISTEXT('S6'!$F$15),NA(),'S6'!$F$15)","v":{"$error":"#N/A"}},{"$f":"IF(ISTEXT('S6'!$F$16),NA(),'S6'!$F$16)","v":{"$error":"#N/A"}},{"$f":"IF(ISTEXT('S6'!$F$17),NA(),'S6'!$F$17)","v":{"$error":"#N/A"}},{"$f":"IF(ISTEXT('S6'!$F$18),NA(),'S6'!$F$18)","v":{"$error":"#N/A"}},null,{"$f":"IF(ISTEXT('S6'!$F$19),NA(),'S6'!$F$19)","v":{"$error":"#N/A"}},null,{"$f":"IF(ISTEXT('S6'!$F$20),NA(),'S6'!$F$20)","v":{"$error":"#N/A"}}]
[{"$f":"IF(ISBLANK('S6'!G$8),\" \",'S6'!G$8)","v":" "},{"$f":"IF(ISTEXT('S6'!$H$13),NA(),'S6'!$H$13)","v":{"$error":"#N/A"}},{"$f":"IF(ISTEXT('S6'!$H$14),NA(),'S6'!$H$14)","v":{"$error":"#N/A"}},{"$f":"IF(ISTEXT('S6'!$H$15),NA(),'S6'!$H$15)","v":{"$error":"#N/A"}},{"$f":"IF(ISTEXT('S6'!$H$16),NA(),'S6'!$H$16)","v":{"$error":"#N/A"}},{"$f":"IF(ISTEXT('S6'!$H$17),NA(),'S6'!$H$17)","v":{"$error":"#N/A"}},{"$f":"IF(ISTEXT('S6'!$H$18),NA(),'S6'!$H$18)","v":{"$error":"#N/A"}},null,{"$f":"IF(ISTEXT('S6'!$H$19),NA(),'S6'!$H$19)","v":{"$error":"#N/A"}},null,{"$f":"IF(ISTEXT('S6'!$H$20),NA(),'S6'!$H$20)","v":{"$error":"#N/A"}}]
[{"$f":"IF(ISBLANK('S6'!I$8),\" \",'S6'!I$8)","v":" "},{"$f":"IF(ISTEXT('S6'!$J$13),NA(),'S6'!$J$13)","v":{"$error":"#N/A"}},{"$f":"IF(ISTEXT('S6'!$J$14),NA(),'S6'!$J$14)","v":{"$error":"#N/A"}},{"$f":"IF(ISTEXT('S6'!$J$15),NA(),'S6'!$J$15)","v":{"$error":"#N/A"}},{"$f":"IF(ISTEXT('S6'!$J$16),NA(),'S6'!$J$16)","v":{"$error":"#N/A"}},{"$f":"IF(ISTEXT('S6'!$J$17),NA(),'S6'!$J$17)","v":{"$error":"#N/A"}},{"$f":"IF(ISTEXT('S6'!$J$18),NA(),'S6'!$J$18)","v":{"$error":"#N/A"}},null,{"$f":"IF(ISTEXT('S6'!$J$19),NA(),'S6'!$J$19)","v":{"$error":"#N/A"}},null,{"$f":"IF(ISTEXT('S6'!$J$20),NA(),'S6'!$J$20)","v":{"$error":"#N/A"}}]
[{"$f":"IF(ISBLANK('S6'!K$8),\" \",'S6'!K$8)","v":" "},{"$f":"IF(ISTEXT('S6'!$L$13),NA(),'S6'!$L$13)","v":{"$error":"#N/A"}},{"$f":"IF(ISTEXT('S6'!$L$14),NA(),'S6'!$L$14)","v":{"$error":"#N/A"}},{"$f":"IF(ISTEXT('S6'!$L$15),NA(),'S6'!$L$15)","v":{"$error":"#N/A"}},{"$f":"IF(ISTEXT('S6'!$L$16),NA(),'S6'!$L$16)","v":{"$error":"#N/A"}},{"$f":"IF(ISTEXT('S6'!$L$17),NA(),'S6'!$L$17)","v":{"$error":"#N/A"}},{"$f":"IF(ISTEXT('S6'!$L$18),NA(),'S6'!$L$18)","v":{"$error":"#N/A"}},null,{"$f":"IF(ISTEXT('S6'!$L$19),NA(),'S6'!$L$19)","v":{"$error":"#N/A"}},null,{"$f":"IF(ISTEXT('S6'!$L$20),NA(),'S6'!$L$20)","v":{"$error":"#N/A"}}]
[{"$f":"IF(ISBLANK('S6'!M$8),\" \",'S6'!M$8)","v":" "},{"$f":"IF(ISTEXT('S6'!$N$13),NA(),'S6'!$N$13)","v":{"$error":"#N/A"}},{"$f":"IF(ISTEXT('S6'!$N$14),NA(),'S6'!$N$14)","v":{"$error":"#N/A"}},{"$f":"IF(ISTEXT('S6'!$N$15),NA(),'S6'!$N$15)","v":{"$error":"#N/A"}},{"$f":"IF(ISTEXT('S6'!$N$16),NA(),'S6'!$N$16)","v":{"$error":"#N/A"}},{"$f":"IF(ISTEXT('S6'!$N$17),NA(),'S6'!$N$17)","v":{"$error":"#N/A"}},{"$f":"IF(ISTEXT('S6'!$N$18),NA(),'S6'!$N$18)","v":{"$error":"#N/A"}},null,{"$f":"IF(ISTEXT('S6'!$N$19),NA(),'S6'!$N$19)","v":{"$error":"#N/A"}},null,{"$f":"IF(ISTEXT('S6'!$N$20),NA(),'S6'!$N$20)","v":{"$error":"#N/A"}}]
[{"$f":"IF(ISBLANK('S6'!C$26),\" \",'S6'!C$26)","v":" "},{"$f":"IF(ISTEXT('S6'!$D$31),NA(),'S6'!$D$31)","v":{"$error":"#N/A"}},{"$f":"IF(ISTEXT('S6'!$D$32),NA(),'S6'!$D$32)","v":{"$error":"#N/A"}},{"$f":"IF(ISTEXT('S6'!$D$33),NA(),'S6'!$D$33)","v":{"$error":"#N/A"}},{"$f":"IF(ISTEXT('S6'!$D$34),NA(),'S6'!$D$34)","v":{"$error":"#N/A"}},{"$f":"IF(ISTEXT('S6'!$D$35),NA(),'S6'!$D$35)","v":{"$error":"#N/A"}},{"$f":"IF(ISTEXT('S6'!$D$36),NA(),'S6'!$D$36)","v":{"$error":"#N/A"}},null,{"$f":"IF(ISTEXT('S6'!$D$37),NA(),'S6'!$D$37)","v":{"$error":"#N/A"}},null,{"$f":"IF(ISTEXT('S6'!$D$38),NA(),'S6'!$D$38)","v":{"$error":"#N/A"}}]
[{"$f":"IF(ISBLANK('S6'!E$26),\" \",'S6'!E$26)","v":" "},{"$f":"IF(ISTEXT('S6'!$F$31),NA(),'S6'!$F$31)","v":{"$error":"#N/A"}},{"$f":"IF(ISTEXT('S6'!$F$32),NA(),'S6'!$F$32)","v":{"$error":"#N/A"}},{"$f":"IF(ISTEXT('S6'!$F$33),NA(),'S6'!$F$33)","v":{"$error":"#N/A"}},{"$f":"IF(ISTEXT('S6'!$F$34),NA(),'S6'!$F$34)","v":{"$error":"#N/A"}},{"$f":"IF(ISTEXT('S6'!$F$35),NA(),'S6'!$F$35)","v":{"$error":"#N/A"}},{"$f":"IF(ISTEXT('S6'!$F$36),NA(),'S6'!$F$36)","v":{"$error":"#N/A"}},null,{"$f":"IF(ISTEXT('S6'!$F$37),NA(),'S6'!$F$37)","v":{"$error":"#N/A"}},null,{"$f":"IF(ISTEXT('S6'!$F$38),NA(),'S6'!$F$38)","v":{"$error":"#N/A"}}]
[{"$f":"IF(ISBLANK('S6'!G$26),\" \",'S6'!G$26)","v":" "},{"$f":"IF(ISTEXT('S6'!$H$31),NA(),'S6'!$H$31)","v":{"$error":"#N/A"}},{"$f":"IF(ISTEXT('S6'!$H$32),NA(),'S6'!$H$32)","v":{"$error":"#N/A"}},{"$f":"IF(ISTEXT('S6'!$H$33),NA(),'S6'!$H$33)","v":{"$error":"#N/A"}},{"$f":"IF(ISTEXT('S6'!$H$34),NA(),'S6'!$H$34)","v":{"$error":"#N/A"}},{"$f":"IF(ISTEXT('S6'!$H$35),NA(),'S6'!$H$35)","v":{"$error":"#N/A"}},{"$f":"IF(ISTEXT('S6'!$H$36),NA(),'S6'!$H$36)","v":{"$error":"#N/A"}},null,{"$f":"IF(ISTEXT('S6'!$H$37),NA(),'S6'!$H$37)","v":{"$error":"#N/A"}},null,{"$f":"IF(ISTEXT('S6'!$H$38),NA(),'S6'!$H$38)","v":{"$error":"#N/A"}}]
[{"$f":"IF(ISBLANK('S6'!I$26),\" \",'S6'!I$26)","v":" "},{"$f":"IF(ISTEXT('S6'!$J$31),NA(),'S6'!$J$31)","v":{"$error":"#N/A"}},{"$f":"IF(ISTEXT('S6'!$J$32),NA(),'S6'!$J$32)","v":{"$error":"#N/A"}},{"$f":"IF(ISTEXT('S6'!$J$33),NA(),'S6'!$J$33)","v":{"$error":"#N/A"}},{"$f":"IF(ISTEXT('S6'!$J$34),NA(),'S6'!$J$34)","v":{"$error":"#N/A"}},{"$f":"IF(ISTEXT('S6'!$J$35),NA(),'S6'!$J$35)","v":{"$error":"#N/A"}},{"$f":"IF(ISTEXT('S6'!$J$36),NA(),'S6'!$J$36)","v":{"$error":"#N/A"}},null,{"$f":"IF(ISTEXT('S6'!$J$37),NA(),'S6'!$J$37)","v":{"$error":"#N/A"}},null,{"$f":"IF(ISTEXT('S6'!$J$38),NA(),'S6'!$J$38)","v":{"$error":"#N/A"}}]
[{"$f":"IF(ISBLANK('S6'!K$26),\" \",'S6'!K$26)","v":" "},{"$f":"IF(ISTEXT('S6'!$L$31),NA(),'S6'!$L$31)","v":{"$error":"#N/A"}},{"$f":"IF(ISTEXT('S6'!$L$32),NA(),'S6'!$L$32)","v":{"$error":"#N/A"}},{"$f":"IF(ISTEXT('S6'!$L$33),NA(),'S6'!$L$33)","v":{"$error":"#N/A"}},{"$f":"IF(ISTEXT('S6'!$L$34),NA(),'S6'!$L$34)","v":{"$error":"#N/A"}},{"$f":"IF(ISTEXT('S6'!$L$35),NA(),'S6'!$L$35)","v":{"$error":"#N/A"}},{"$f":"IF(ISTEXT('S6'!$L$36),NA(),'S6'!$L$36)","v":{"$error":"#N/A"}},null,{"$f":"IF(ISTEXT('S6'!$L$37),NA(),'S6'!$L$37)","v":{"$error":"#N/A"}},null,{"$f":"IF(ISTEXT('S6'!$L$38),NA(),'S6'!$L$38)","v":{"$error":"#N/A"}}]
[{"$f":"IF(ISBLANK('S6'!M$26),\" \",'S6'!M$26)","v":" "},{"$f":"IF(ISTEXT('S6'!$N$31),NA(),'S6'!$N$31)","v":{"$error":"#N/A"}},{"$f":"IF(ISTEXT('S6'!$N$32),NA(),'S6'!$N$32)","v":{"$error":"#N/A"}},{"$f":"IF(ISTEXT('S6'!$N$33),NA(),'S6'!$N$33)","v":{"$error":"#N/A"}},{"$f":"IF(ISTEXT('S6'!$N$34),NA(),'S6'!$N$34)","v":{"$error":"#N/A"}},{"$f":"IF(ISTEXT('S6'!$N$35),NA(),'S6'!$N$35)","v":{"$error":"#N/A"}},{"$f":"IF(ISTEXT('S6'!$N$36),NA(),'S6'!$N$36)","v":{"$error":"#N/A"}},null,{"$f":"IF(ISTEXT('S6'!$N$37),NA(),'S6'!$N$37)","v":{"$error":"#N/A"}},null,{"$f":"IF(ISTEXT('S6'!$N$38),NA(),'S6'!$N$38)","v":{"$error":"#N/A"}}]
[]
[{"$f":"IF(ISBLANK('S7'!C$8),\" \",'S7'!C$8)","v":" "},{"$f":"IF(ISTEXT('S7'!$D$13),NA(),'S7'!$D$13)","v":{"$error":"#N/A"}},{"$f":"IF(ISTEXT('S7'!$D$14),NA(),'S7'!$D$14)","v":{"$error":"#N/A"}},{"$f":"IF(ISTEXT('S7'!$D$15),NA(),'S7'!$D$15)","v":{"$error":"#N/A"}},{"$f":"IF(ISTEXT('S7'!$D$16),NA(),'S7'!$D$16)","v":{"$error":"#N/A"}},{"$f":"IF(ISTEXT('S7'!$D$17),NA(),'S7'!$D$17)","v":{"$error":"#N/A"}},{"$f":"IF(ISTEXT('S7'!$D$18),NA(),'S7'!$D$18)","v":{"$error":"#N/A"}},null,{"$f":"IF(ISTEXT('S7'!$D$19),NA(),'S7'!$D$19)","v":{"$error":"#N/A"}},null,{"$f":"IF(ISTEXT('S7'!$D$20),NA(),'S7'!$D$20)","v":{"$error":"#N/A"}}]
[{"$f":"IF(ISBLANK('S7'!E$8),\" \",'S7'!E$8)","v":" "},{"$f":"IF(ISTEXT('S7'!$F$13),NA(),'S7'!$F$13)","v":{"$error":"#N/A"}},{"$f":"IF(ISTEXT('S7'!$F$14),NA(),'S7'!$F$14)","v":{"$error":"#N/A"}},{"$f":"IF(ISTEXT('S7'!$F$15),NA(),'S7'!$F$15)","v":{"$error":"#N/A"}},{"$f":"IF(ISTEXT('S7'!$F$16),NA(),'S7'!$F$16)","v":{"$error":"#N/A"}},{"$f":"IF(ISTEXT('S7'!$F$17),NA(),'S7'!$F$17)","v":{"$error":"#N/A"}},{"$f":"IF(ISTEXT('S7'!$F$18),NA(),'S7'!$F$18)","v":{"$error":"#N/A"}},null,{"$f":"IF(ISTEXT('S7'!$F$19),NA(),'S7'!$F$19)","v":{"$error":"#N/A"}},null,{"$f":"IF(ISTEXT('S7'!$F$20),NA(),'S7'!$F$20)","v":{"$error":"#N/A"}}]
[{"$f":"IF(ISBLANK('S7'!G$8),\" \",'S7'!G$8)","v":" "},{"$f":"IF(ISTEXT('S7'!$H$13),NA(),'S7'!$H$13)","v":{"$error":"#N/A"}},{"$f":"IF(ISTEXT('S7'!$H$14),NA(),'S7'!$H$14)","v":{"$error":"#N/A"}},{"$f":"IF(ISTEXT('S7'!$H$15),NA(),'S7'!$H$15)","v":{"$error":"#N/A"}},{"$f":"IF(ISTEXT('S7'!$H$16),NA(),'S7'!$H$16)","v":{"$error":"#N/A"}},{"$f":"IF(ISTEXT('S7'!$H$17),NA(),'S7'!$H$17)","v":{"$error":"#N/A"}},{"$f":"IF(ISTEXT('S7'!$H$18),NA(),'S7'!$H$18)","v":{"$error":"#N/A"}},null,{"$f":"IF(ISTEXT('S7'!$H$19),NA(),'S7'!$H$19)","v":{"$error":"#N/A"}},null,{"$f":"IF(ISTEXT('S7'!$H$20),NA(),'S7'!$H$20)","v":{"$error":"#N/A"}}]
[{"$f":"IF(ISBLANK('S7'!I$8),\" \",'S7'!I$8)","v":" "},{"$f":"IF(ISTEXT('S7'!$J$13),NA(),'S7'!$J$13)","v":{"$error":"#N/A"}},{"$f":"IF(ISTEXT('S7'!$J$14),NA(),'S7'!$J$14)","v":{"$error":"#N/A"}},{"$f":"IF(ISTEXT('S7'!$J$15),NA(),'S7'!$J$15)","v":{"$error":"#N/A"}},{"$f":"IF(ISTEXT('S7'!$J$16),NA(),'S7'!$J$16)","v":{"$error":"#N/A"}},{"$f":"IF(ISTEXT('S7'!$J$17),NA(),'S7'!$J$17)","v":{"$error":"#N/A"}},{"$f":"IF(ISTEXT('S7'!$J$18),NA(),'S7'!$J$18)","v":{"$error":"#N/A"}},null,{"$f":"IF(ISTEXT('S7'!$J$19),NA(),'S7'!$J$19)","v":{"$error":"#N/A"}},null,{"$f":"IF(ISTEXT('S7'!$J$20),NA(),'S7'!$J$20)","v":{"$error":"#N/A"}}]
[{"$f":"IF(ISBLANK('S7'!K$8),\" \",'S7'!K$8)","v":" "},{"$f":"IF(ISTEXT('S7'!$L$13),NA(),'S7'!$L$13)","v":{"$error":"#N/A"}},{"$f":"IF(ISTEXT('S7'!$L$14),NA(),'S7'!$L$14)","v":{"$error":"#N/A"}},{"$f":"IF(ISTEXT('S7'!$L$15),NA(),'S7'!$L$15)","v":{"$error":"#N/A"}},{"$f":"IF(ISTEXT('S7'!$L$16),NA(),'S7'!$L$16)","v":{"$error":"#N/A"}},{"$f":"IF(ISTEXT('S7'!$L$17),NA(),'S7'!$L$17)","v":{"$error":"#N/A"}},{"$f":"IF(ISTEXT('S7'!$L$18),NA(),'S7'!$L$18)","v":{"$error":"#N/A"}},null,{"$f":"IF(ISTEXT('S7'!$L$19),NA(),'S7'!$L$19)","v":{"$error":"#N/A"}},null,{"$f":"IF(ISTEXT('S7'!$L$20),NA(),'S7'!$L$20)","v":{"$error":"#N/A"}}]
[{"$f":"IF(ISBLANK('S7'!M$8),\" \",'S7'!M$8)","v":" "},{"$f":"IF(ISTEXT('S7'!$N$13),NA(),'S7'!$N$13)","v":{"$error":"#N/A"}},{"$f":"IF(ISTEXT('S7'!$N$14),NA(),'S7'!$N$14)","v":{"$error":"#N/A"}},{"$f":"IF(ISTEXT('S7'!$N$15),NA(),'S7'!$N$15)","v":{"$error":"#N/A"}},{"$f":"IF(ISTEXT('S7'!$N$16),NA(),'S7'!$N$16)","v":{"$error":"#N/A"}},{"$f":"IF(ISTEXT('S7'!$N$17),NA(),'S7'!$N$17)","v":{"$error":"#N/A"}},{"$f":"IF(ISTEXT('S7'!$N$18),NA(),'S7'!$N$18)","v":{"$error":"#N/A"}},null,{"$f":"IF(ISTEXT('S7'!$N$19),NA(),'S7'!$N$19)","v":{"$error":"#N/A"}},null,{"$f":"IF(ISTEXT('S7'!$N$20),NA(),'S7'!$N$20)","v":{"$error":"#N/A"}}]
[{"$f":"IF(ISBLANK('S7'!C$26),\" \",'S7'!C$26)","v":" "},{"$f":"IF(ISTEXT('S7'!$D$31),NA(),'S7'!$D$31)","v":{"$error":"#N/A"}},{"$f":"IF(ISTEXT('S7'!$D$32),NA(),'S7'!$D$32)","v":{"$error":"#N/A"}},{"$f":"IF(ISTEXT('S7'!$D$33),NA(),'S7'!$D$33)","v":{"$error":"#N/A"}},{"$f":"IF(ISTEXT('S7'!$D$34),NA(),'S7'!$D$34)","v":{"$error":"#N/A"}},{"$f":"IF(ISTEXT('S7'!$D$35),NA(),'S7'!$D$35)","v":{"$error":"#N/A"}},{"$f":"IF(ISTEXT('S7'!$D$36),NA(),'S7'!$D$36)","v":{"$error":"#N/A"}},null,{"$f":"IF(ISTEXT('S7'!$D$37),NA(),'S7'!$D$37)","v":{"$error":"#N/A"}},null,{"$f":"IF(ISTEXT('S7'!$D$38),NA(),'S7'!$D$38)","v":{"$error":"#N/A"}}]
[{"$f":"IF(ISBLANK('S7'!E$26),\" \",'S7'!E$26)","v":" "},{"$f":"IF(ISTEXT('S7'!$F$31),NA(),'S7'!$F$31)","v":{"$error":"#N/A"}},{"$f":"IF(ISTEXT('S7'!$F$32),NA(),'S7'!$F$32)","v":{"$error":"#N/A"}},{"$f":"IF(ISTEXT('S7'!$F$33),NA(),'S7'!$F$33)","v":{"$error":"#N/A"}},{"$f":"IF(ISTEXT('S7'!$F$34),NA(),'S7'!$F$34)","v":{"$error":"#N/A"}},{"$f":"IF(ISTEXT('S7'!$F$35),NA(),'S7'!$F$35)","v":{"$error":"#N/A"}},{"$f":"IF(ISTEXT('S7'!$F$36),NA(),'S7'!$F$36)","v":{"$error":"#N/A"}},null,{"$f":"IF(ISTEXT('S7'!$F$37),NA(),'S7'!$F$37)","v":{"$error":"#N/A"}},null,{"$f":"IF(ISTEXT('S7'!$F$38),NA(),'S7'!$F$38)","v":{"$error":"#N/A"}}]
[{"$f":"IF(ISBLANK('S7'!G$26),\" \",'S7'!G$26)","v":" "},{"$f":"IF(ISTEXT('S7'!$H$31),NA(),'S7'!$H$31)","v":{"$error":"#N/A"}},{"$f":"IF(ISTEXT('S7'!$H$32),NA(),'S7'!$H$32)","v":{"$error":"#N/A"}},{"$f":"IF(ISTEXT('S7'!$H$33),NA(),'S7'!$H$33)","v":{"$error":"#N/A"}},{"$f":"IF(ISTEXT('S7'!$H$34),NA(),'S7'!$H$34)","v":{"$error":"#N/A"}},{"$f":"IF(ISTEXT('S7'!$H$35),NA(),'S7'!$H$35)","v":{"$error":"#N/A"}},{"$f":"IF(ISTEXT('S7'!$H$36),NA(),'S7'!$H$36)","v":{"$error":"#N/A"}},null,{"$f":"IF(ISTEXT('S7'!$H$37),NA(),'S7'!$H$37)","v":{"$error":"#N/A"}},null,{"$f":"IF(ISTEXT('S7'!$H$38),NA(),'S7'!$H$38)","v":{"$error":"#N/A"}}]
[{"$f":"IF(ISBLANK('S7'!I$26),\" \",'S7'!I$26)","v":" "},{"$f":"IF(ISTEXT('S7'!$J$31),NA(),'S7'!$J$31)","v":{"$error":"#N/A"}},{"$f":"IF(ISTEXT('S7'!$J$32),NA(),'S7'!$J$32)","v":{"$error":"#N/A"}},{"$f":"IF(ISTEXT('S7'!$J$33),NA(),'S7'!$J$33)","v":{"$error":"#N/A"}},{"$f":"IF(ISTEXT('S7'!$J$34),NA(),'S7'!$J$34)","v":{"$error":"#N/A"}},{"$f":"IF(ISTEXT('S7'!$J$35),NA(),'S7'!$J$35)","v":{"$error":"#N/A"}},{"$f":"IF(ISTEXT('S7'!$J$36),NA(),'S7'!$J$36)","v":{"$error":"#N/A"}},null,{"$f":"IF(ISTEXT('S7'!$J$37),NA(),'S7'!$J$37)","v":{"$error":"#N/A"}},null,{"$f":"IF(ISTEXT('S7'!$J$38),NA(),'S7'!$J$38)","v":{"$error":"#N/A"}}]
[{"$f":"IF(ISBLANK('S7'!K$26),\" \",'S7'!K$26)","v":" "},{"$f":"IF(ISTEXT('S7'!$L$31),NA(),'S7'!$L$31)","v":{"$error":"#N/A"}},{"$f":"IF(ISTEXT('S7'!$L$32),NA(),'S7'!$L$32)","v":{"$error":"#N/A"}},{"$f":"IF(ISTEXT('S7'!$L$33),NA(),'S7'!$L$33)","v":{"$error":"#N/A"}},{"$f":"IF(ISTEXT('S7'!$L$34),NA(),'S7'!$L$34)","v":{"$error":"#N/A"}},{"$f":"IF(ISTEXT('S7'!$L$35),NA(),'S7'!$L$35)","v":{"$error":"#N/A"}},{"$f":"IF(ISTEXT('S7'!$L$36),NA(),'S7'!$L$36)","v":{"$error":"#N/A"}},null,{"$f":"IF(ISTEXT('S7'!$L$37),NA(),'S7'!$L$37)","v":{"$error":"#N/A"}},null,{"$f":"IF(ISTEXT('S7'!$L$38),NA(),'S7'!$L$38)","v":{"$error":"#N/A"}}]
[{"$f":"IF(ISBLANK('S7'!M$26),\" \",'S7'!M$26)","v":" "},{"$f":"IF(ISTEXT('S7'!$N$31),NA(),'S7'!$N$31)","v":{"$error":"#N/A"}},{"$f":"IF(ISTEXT('S7'!$N$32),NA(),'S7'!$N$32)","v":{"$error":"#N/A"}},{"$f":"IF(ISTEXT('S7'!$N$33),NA(),'S7'!$N$33)","v":{"$error":"#N/A"}},{"$f":"IF(ISTEXT('S7'!$N$34),NA(),'S7'!$N$34)","v":{"$error":"#N/A"}},{"$f":"IF(ISTEXT('S7'!$N$35),NA(),'S7'!$N$35)","v":{"$error":"#N/A"}},{"$f":"IF(ISTEXT('S7'!$N$36),NA(),'S7'!$N$36)","v":{"$error":"#N/A"}},null,{"$f":"IF(ISTEXT('S7'!$N$37),NA(),'S7'!$N$37)","v":{"$error":"#N/A"}},null,{"$f":"IF(ISTEXT('S7'!$N$38),NA(),'S7'!$N$38)","v":{"$error":"#N/A"}}]
[{"$f":"IF(ISBLANK('S8'!C$8),\" \",'S8'!C$8)","v":" "},{"$f":"IF(ISTEXT('S8'!$D$13),NA(),'S8'!$D$13)","v":{"$error":"#N/A"}},{"$f":"IF(ISTEXT('S8'!$D$14),NA(),'S8'!$D$14)","v":{"$error":"#N/A"}},{"$f":"IF(ISTEXT('S8'!$D$15),NA(),'S8'!$D$15)","v":{"$error":"#N/A"}},{"$f":"IF(ISTEXT('S8'!$D$16),NA(),'S8'!$D$16)","v":{"$error":"#N/A"}},{"$f":"IF(ISTEXT('S8'!$D$17),NA(),'S8'!$D$17)","v":{"$error":"#N/A"}},{"$f":"IF(ISTEXT('S8'!$D$18),NA(),'S8'!$D$18)","v":{"$error":"#N/A"}},null,{"$f":"IF(ISTEXT('S8'!$D$19),NA(),'S8'!$D$19)","v":{"$error":"#N/A"}},null,{"$f":"IF(ISTEXT('S8'!$D$20),NA(),'S8'!$D$20)","v":{"$error":"#N/A"}}]
[{"$f":"IF(ISBLANK('S8'!E$8),\" \",'S8'!E$8)","v":" "},{"$f":"IF(ISTEXT('S8'!$F$13),NA(),'S8'!$F$13)","v":{"$error":"#N/A"}},{"$f":"IF(ISTEXT('S8'!$F$14),NA(),'S8'!$F$14)","v":{"$error":"#N/A"}},{"$f":"IF(ISTEXT('S8'!$F$15),NA(),'S8'!$F$15)","v":{"$error":"#N/A"}},{"$f":"IF(ISTEXT('S8'!$F$16),NA(),'S8'!$F$16)","v":{"$error":"#N/A"}},{"$f":"IF(ISTEXT('S8'!$F$17),NA(),'S8'!$F$17)","v":{"$error":"#N/A"}},{"$f":"IF(ISTEXT('S8'!$F$18),NA(),'S8'!$F$18)","v":{"$error":"#N/A"}},null,{"$f":"IF(ISTEXT('S8'!$F$19),NA(),'S8'!$F$19)","v":{"$error":"#N/A"}},null,{"$f":"IF(ISTEXT('S8'!$F$20),NA(),'S8'!$F$20)","v":{"$error":"#N/A"}}]
[{"$f":"IF(ISBLANK('S8'!G$8),\" \",'S8'!G$8)","v":" "},{"$f":"IF(ISTEXT('S8'!$H$13),NA(),'S8'!$H$13)","v":{"$error":"#N/A"}},{"$f":"IF(ISTEXT('S8'!$H$14),NA(),'S8'!$H$14)","v":{"$error":"#N/A"}},{"$f":"IF(ISTEXT('S8'!$H$15),NA(),'S8'!$H$15)","v":{"$error":"#N/A"}},{"$f":"IF(ISTEXT('S8'!$H$16),NA(),'S8'!$H$16)","v":{"$error":"#N/A"}},{"$f":"IF(ISTEXT('S8'!$H$17),NA(),'S8'!$H$17)","v":{"$error":"#N/A"}},{"$f":"IF(ISTEXT('S8'!$H$18),NA(),'S8'!$H$18)","v":{"$error":"#N/A"}},null,{"$f":"IF(ISTEXT('S8'!$H$19),NA(),'S8'!$H$19)","v":{"$error":"#N/A"}},null,{"$f":"IF(ISTEXT('S8'!$H$20),NA(),'S8'!$H$20)","v":{"$error":"#N/A"}}]
[{"$f":"IF(ISBLANK('S8'!I$8),\" \",'S8'!I$8)","v":" "},{"$f":"IF(ISTEXT('S8'!$J$13),NA(),'S8'!$J$13)","v":{"$error":"#N/A"}},{"$f":"IF(ISTEXT('S8'!$J$14),NA(),'S8'!$J$14)","v":{"$error":"#N/A"}},{"$f":"IF(ISTEXT('S8'!$J$15),NA(),'S8'!$J$15)","v":{"$error":"#N/A"}},{"$f":"IF(ISTEXT('S8'!$J$16),NA(),'S8'!$J$16)","v":{"$error":"#N/A"}},{"$f":"IF(ISTEXT('S8'!$J$17),NA(),'S8'!$J$17)","v":{"$error":"#N/A"}},{"$f":"IF(ISTEXT('S8'!$J$18),NA(),'S8'!$J$18)","v":{"$error":"#N/A"}},null,{"$f":"IF(ISTEXT('S8'!$J$19),NA(),'S8'!$J$19)","v":{"$error":"#N/A"}},null,{"$f":"IF(ISTEXT('S8'!$J$20),NA(),'S8'!$J$20)","v":{"$error":"#N/A"}}]
[{"$f":"IF(ISBLANK('S8'!K$8),\" \",'S8'!K$8)","v":" "},{"$f":"IF(ISTEXT('S8'!$L$13),NA(),'S8'!$L$13)","v":{"$error":"#N/A"}},{"$f":"IF(ISTEXT('S8'!$L$14),NA(),'S8'!$L$14)","v":{"$error":"#N/A"}},{"$f":"IF(ISTEXT('S8'!$L$15),NA(),'S8'!$L$15)","v":{"$error":"#N/A"}},{"$f":"IF(ISTEXT('S8'!$L$16),NA(),'S8'!$L$16)","v":{"$error":"#N/A"}},{"$f":"IF(ISTEXT('S8'!$L$17),NA(),'S8'!$L$17)","v":{"$error":"#N/A"}},{"$f":"IF(ISTEXT('S8'!$L$18),NA(),'S8'!$L$18)","v":{"$error":"#N/A"}},null,{"$f":"IF(ISTEXT('S8'!$L$19),NA(),'S8'!$L$19)","v":{"$error":"#N/A"}},null,{"$f":"IF(ISTEXT('S8'!$L$20),NA(),'S8'!$L$20)","v":{"$error":"#N/A"}}]
[{"$f":"IF(ISBLANK('S8'!M$8),\" \",'S8'!M$8)","v":" "},{"$f":"IF(ISTEXT('S8'!$N$13),NA(),'S8'!$N$13)","v":{"$error":"#N/A"}},{"$f":"IF(ISTEXT('S8'!$N$14),NA(),'S8'!$N$14)","v":{"$error":"#N/A"}},{"$f":"IF(ISTEXT('S8'!$N$15),NA(),'S8'!$N$15)","v":{"$error":"#N/A"}},{"$f":"IF(ISTEXT('S8'!$N$16),NA(),'S8'!$N$16)","v":{"$error":"#N/A"}},{"$f":"IF(ISTEXT('S8'!$N$17),NA(),'S8'!$N$17)","v":{"$error":"#N/A"}},{"$f":"IF(ISTEXT('S8'!$N$18),NA(),'S8'!$N$18)","v":{"$error":"#N/A"}},null,{"$f":"IF(ISTEXT('S8'!$N$19),NA(),'S8'!$N$19)","v":{"$error":"#N/A"}},null,{"$f":"IF(ISTEXT('S8'!$N$20),NA(),'S8'!$N$20)","v":{"$error":"#N/A"}}]
[{"$f":"IF(ISBLANK('S8'!C$26),\" \",'S8'!C$26)","v":" "},{"$f":"IF(ISTEXT('S8'!$D$31),NA(),'S8'!$D$31)","v":{"$error":"#N/A"}},{"$f":"IF(ISTEXT('S8'!$D$32),NA(),'S8'!$D$32)","v":{"$error":"#N/A"}},{"$f":"IF(ISTEXT('S8'!$D$33),NA(),'S8'!$D$33)","v":{"$error":"#N/A"}},{"$f":"IF(ISTEXT('S8'!$D$34),NA(),'S8'!$D$34)","v":{"$error":"#N/A"}},{"$f":"IF(ISTEXT('S8'!$D$35),NA(),'S8'!$D$35)","v":{"$error":"#N/A"}},{"$f":"IF(ISTEXT('S8'!$D$36),NA(),'S8'!$D$36)","v":{"$error":"#N/A"}},null,{"$f":"IF(ISTEXT('S8'!$D$37),NA(),'S8'!$D$37)","v":{"$error":"#N/A"}},null,{"$f":"IF(ISTEXT('S8'!$D$38),NA(),'S8'!$D$38)","v":{"$error":"#N/A"}}]
[{"$f":"IF(ISBLANK('S8'!E$26),\" \",'S8'!E$26)","v":" "},{"$f":"IF(ISTEXT('S8'!$F$31),NA(),'S8'!$F$31)","v":{"$error":"#N/A"}},{"$f":"IF(ISTEXT('S8'!$F$32),NA(),'S8'!$F$32)","v":{"$error":"#N/A"}},{"$f":"IF(ISTEXT('S8'!$F$33),NA(),'S8'!$F$33)","v":{"$error":"#N/A"}},{"$f":"IF(ISTEXT('S8'!$F$34),NA(),'S8'!$F$34)","v":{"$error":"#N/A"}},{"$f":"IF(ISTEXT('S8'!$F$35),NA(),'S8'!$F$35)","v":{"$error":"#N/A"}},{"$f":"IF(ISTEXT('S8'!$F$36),NA(),'S8'!$F$36)","v":{"$error":"#N/A"}},null,{"$f":"IF(ISTEXT('S8'!$F$37),NA(),'S8'!$F$37)","v":{"$error":"#N/A"}},null,{"$f":"IF(ISTEXT('S8'!$F$38),NA(),'S8'!$F$38)","v":{"$error":"#N/A"}}]
[{"$f":"IF(ISBLANK('S8'!G$26),\" \",'S8'!G$26)","v":" "},{"$f":"IF(ISTEXT('S8'!$H$31),NA(),'S8'!$H$31)","v":{"$error":"#N/A"}},{"$f":"IF(ISTEXT('S8'!$H$32),NA(),'S8'!$H$32)","v":{"$error":"#N/A"}},{"$f":"IF(ISTEXT('S8'!$H$33),NA(),'S8'!$H$33)","v":{"$error":"#N/A"}},{"$f":"IF(ISTEXT('S8'!$H$34),NA(),'S8'!$H$34)","v":{"$error":"#N/A"}},{"$f":"IF(ISTEXT('S8'!$H$35),NA(),'S8'!$H$35)","v":{"$error":"#N/A"}},{"$f":"IF(ISTEXT('S8'!$H$36),NA(),'S8'!$H$36)","v":{"$error":"#N/A"}},null,{"$f":"IF(ISTEXT('S8'!$H$37),NA(),'S8'!$H$37)","v":{"$error":"#N/A"}},null,{"$f":"IF(ISTEXT('S8'!$H$38),NA(),'S8'!$H$38)","v":{"$error":"#N/A"}}]
[{"$f":"IF(ISBLANK('S8'!I$26),\" \",'S8'!I$26)","v":" "},{"$f":"IF(ISTEXT('S8'!$J$31),NA(),'S8'!$J$31)","v":{"$error":"#N/A"}},{"$f":"IF(ISTEXT('S8'!$J$32),NA(),'S8'!$J$32)","v":{"$error":"#N/A"}},{"$f":"IF(ISTEXT('S8'!$J$33),NA(),'S8'!$J$33)","v":{"$error":"#N/A"}},{"$f":"IF(ISTEXT('S8'!$J$34),NA(),'S8'!$J$34)","v":{"$error":"#N/A"}},{"$f":"IF(ISTEXT('S8'!$J$35),NA(),'S8'!$J$35)","v":{"$error":"#N/A"}},{"$f":"IF(ISTEXT('S8'!$J$36),NA(),'S8'!$J$36)","v":{"$error":"#N/A"}},null,{"$f":"IF(ISTEXT('S8'!$J$37),NA(),'S8'!$J$37)","v":{"$error":"#N/A"}},null,{"$f":"IF(ISTEXT('S8'!$J$38),NA(),'S8'!$J$38)","v":{"$error":"#N/A"}}]
[{"$f":"IF(ISBLANK('S8'!K$26),\" \",'S8'!K$26)","v":" "},{"$f":"IF(ISTEXT('S8'!$L$31),NA(),'S8'!$L$31)","v":{"$error":"#N/A"}},{"$f":"IF(ISTEXT('S8'!$L$32),NA(),'S8'!$L$32)","v":{"$error":"#N/A"}},{"$f":"IF(ISTEXT('S8'!$L$33),NA(),'S8'!$L$33)","v":{"$error":"#N/A"}},{"$f":"IF(ISTEXT('S8'!$L$34),NA(),'S8'!$L$34)","v":{"$error":"#N/A"}},{"$f":"IF(ISTEXT('S8'!$L$35),NA(),'S8'!$L$35)","v":{"$error":"#N/A"}},{"$f":"IF(ISTEXT('S8'!$L$36),NA(),'S8'!$L$36)","v":{"$error":"#N/A"}},null,{"$f":"IF(ISTEXT('S8'!$L$37),NA(),'S8'!$L$37)","v":{"$error":"#N/A"}},null,{"$f":"IF(ISTEXT('S8'!$L$38),NA(),'S8'!$L$38)","v":{"$error":"#N/A"}}]
[{"$f":"IF(ISBLANK('S8'!M$26),\" \",'S8'!M$26)","v":" "},{"$f":"IF(ISTEXT('S8'!$N$31),NA(),'S8'!$N$31)","v":{"$error":"#N/A"}},{"$f":"IF(ISTEXT('S8'!$N$32),NA(),'S8'!$N$32)","v":{"$error":"#N/A"}},{"$f":"IF(ISTEXT('S8'!$N$33),NA(),'S8'!$N$33)","v":{"$error":"#N/A"}},{"$f":"IF(ISTEXT('S8'!$N$34),NA(),'S8'!$N$34)","v":{"$error":"#N/A"}},{"$f":"IF(ISTEXT('S8'!$N$35),NA(),'S8'!$N$35)","v":{"$error":"#N/A"}},{"$f":"IF(ISTEXT('S8'!$N$36),NA(),'S8'!$N$36)","v":{"$error":"#N/A"}},null,{"$f":"IF(ISTEXT('S8'!$N$37),NA(),'S8'!$N$37)","v":{"$error":"#N/A"}},null,{"$f":"IF(ISTEXT('S8'!$N$38),NA(),'S8'!$N$38)","v":{"$error":"#N/A"}}]
[]
[{"$f":"IF(ISBLANK('S9'!C$8),\" \",'S9'!C$8)","v":" "},{"$f":"IF(ISTEXT('S9'!$D$13),NA(),'S9'!$D$13)","v":{"$error":"#N/A"}},{"$f":"IF(ISTEXT('S9'!$D$14),NA(),'S9'!$D$14)","v":{"$error":"#N/A"}},{"$f":"IF(ISTEXT('S9'!$D$15),NA(),'S9'!$D$15)","v":{"$error":"#N/A"}},{"$f":"IF(ISTEXT('S9'!$D$16),NA(),'S9'!$D$16)","v":{"$error":"#N/A"}},{"$f":"IF(ISTEXT('S9'!$D$17),NA(),'S9'!$D$17)","v":{"$error":"#N/A"}},{"$f":"IF(ISTEXT('S9'!$D$18),NA(),'S9'!$D$18)","v":{"$error":"#N/A"}},null,{"$f":"IF(ISTEXT('S9'!$D$19),NA(),'S9'!$D$19)","v":{"$error":"#N/A"}},null,{"$f":"IF(ISTEXT('S9'!$D$20),NA(),'S9'!$D$20)","v":{"$error":"#N/A"}}]
[{"$f":"IF(ISBLANK('S9'!E$8),\" \",'S9'!E$8)","v":" "},{"$f":"IF(ISTEXT('S9'!$F$13),NA(),'S9'!$F$13)","v":{"$error":"#N/A"}},{"$f":"IF(ISTEXT('S9'!$F$14),NA(),'S9'!$F$14)","v":{"$error":"#N/A"}},{"$f":"IF(ISTEXT('S9'!$F$15),NA(),'S9'!$F$15)","v":{"$error":"#N/A"}},{"$f":"IF(ISTEXT('S9'!$F$16),NA(),'S9'!$F$16)","v":{"$error":"#N/A"}},{"$f":"IF(ISTEXT('S9'!$F$17),NA(),'S9'!$F$17)","v":{"$error":"#N/A"}},{"$f":"IF(ISTEXT('S9'!$F$18),NA(),'S9'!$F$18)","v":{"$error":"#N/A"}},null,{"$f":"IF(ISTEXT('S9'!$F$19),NA(),'S9'!$F$19)","v":{"$error":"#N/A"}},null,{"$f":"IF(ISTEXT('S9'!$F$20),NA(),'S9'!$F$20)","v":{"$error":"#N/A"}}]
[{"$f":"IF(ISBLANK('S9'!G$8),\" \",'S9'!G$8)","v":" "},{"$f":"IF(ISTEXT('S9'!$H$13),NA(),'S9'!$H$13)","v":{"$error":"#N/A"}},{"$f":"IF(ISTEXT('S9'!$H$14),NA(),'S9'!$H$14)","v":{"$error":"#N/A"}},{"$f":"IF(ISTEXT('S9'!$H$15),NA(),'S9'!$H$15)","v":{"$error":"#N/A"}},{"$f":"IF(ISTEXT('S9'!$H$16),NA(),'S9'!$H$16)","v":{"$error":"#N/A"}},{"$f":"IF(ISTEXT('S9'!$H$17),NA(),'S9'!$H$17)","v":{"$error":"#N/A"}},{"$f":"IF(ISTEXT('S9'!$H$18),NA(),'S9'!$H$18)","v":{"$error":"#N/A"}},null,{"$f":"IF(ISTEXT('S9'!$H$19),NA(),'S9'!$H$19)","v":{"$error":"#N/A"}},null,{"$f":"IF(ISTEXT('S9'!$H$20),NA(),'S9'!$H$20)","v":{"$error":"#N/A"}}]
[{"$f":"IF(ISBLANK('S9'!I$8),\" \",'S9'!I$8)","v":" "},{"$f":"IF(ISTEXT('S9'!$J$13),NA(),'S9'!$J$13)","v":{"$error":"#N/A"}},{"$f":"IF(ISTEXT('S9'!$J$14),NA(),'S9'!$J$14)","v":{"$error":"#N/A"}},{"$f":"IF(ISTEXT('S9'!$J$15),NA(),'S9'!$J$15)","v":{"$error":"#N/A"}},{"$f":"IF(ISTEXT('S9'!$J$16),NA(),'S9'!$J$16)","v":{"$error":"#N/A"}},{"$f":"IF(ISTEXT('S9'!$J$17),NA(),'S9'!$J$17)","v":{"$error":"#N/A"}},{"$f":"IF(ISTEXT('S9'!$J$18),NA(),'S9'!$J$18)","v":{"$error":"#N/A"}},null,{"$f":"IF(ISTEXT('S9'!$J$19),NA(),'S9'!$J$19)","v":{"$error":"#N/A"}},null,{"$f":"IF(ISTEXT('S9'!$J$20),NA(),'S9'!$J$20)","v":{"$error":"#N/A"}}]
[{"$f":"IF(ISBLANK('S9'!K$8),\" \",'S9'!K$8)","v":" "},{"$f":"IF(ISTEXT('S9'!$L$13),NA(),'S9'!$L$13)","v":{"$error":"#N/A"}},{"$f":"IF(ISTEXT('S9'!$L$14),NA(),'S9'!$L$14)","v":{"$error":"#N/A"}},{"$f":"IF(ISTEXT('S9'!$L$15),NA(),'S9'!$L$15)","v":{"$error":"#N/A"}},{"$f":"IF(ISTEXT('S9'!$L$16),NA(),'S9'!$L$16)","v":{"$error":"#N/A"}},{"$f":"IF(ISTEXT('S9'!$L$17),NA(),'S9'!$L$17)","v":{"$error":"#N/A"}},{"$f":"IF(ISTEXT('S9'!$L$18),NA(),'S9'!$L$18)","v":{"$error":"#N/A"}},null,{"$f":"IF(ISTEXT('S9'!$L$19),NA(),'S9'!$L$19)","v":{"$error":"#N/A"}},null,{"$f":"IF(ISTEXT('S9'!$L$20),NA(),'S9'!$L$20)","v":{"$error":"#N/A"}}]
[{"$f":"IF(ISBLANK('S9'!M$8),\" \",'S9'!M$8)","v":" "},{"$f":"IF(ISTEXT('S9'!$N$13),NA(),'S9'!$N$13)","v":{"$error":"#N/A"}},{"$f":"IF(ISTEXT('S9'!$N$14),NA(),'S9'!$N$14)","v":{"$error":"#N/A"}},{"$f":"IF(ISTEXT('S9'!$N$15),NA(),'S9'!$N$15)","v":{"$error":"#N/A"}},{"$f":"IF(ISTEXT('S9'!$N$16),NA(),'S9'!$N$16)","v":{"$error":"#N/A"}},{"$f":"IF(ISTEXT('S9'!$N$17),NA(),'S9'!$N$17)","v":{"$error":"#N/A"}},{"$f":"IF(ISTEXT('S9'!$N$18),NA(),'S9'!$N$18)","v":{"$error":"#N/A"}},null,{"$f":"IF(ISTEXT('S9'!$N$19),NA(),'S9'!$N$19)","v":{"$error":"#N/A"}},null,{"$f":"IF(ISTEXT('S9'!$N$20),NA(),'S9'!$N$20)","v":{"$error":"#N/A"}}]
[{"$f":"IF(ISBLANK('S9'!C$26),\" \",'S9'!C$26)","v":" "},{"$f":"IF(ISTEXT('S9'!$D$31),NA(),'S9'!$D$31)","v":{"$error":"#N/A"}},{"$f":"IF(ISTEXT('S9'!$D$32),NA(),'S9'!$D$32)","v":{"$error":"#N/A"}},{"$f":"IF(ISTEXT('S9'!$D$33),NA(),'S9'!$D$33)","v":{"$error":"#N/A"}},{"$f":"IF(ISTEXT('S9'!$D$34),NA(),'S9'!$D$34)","v":{"$error":"#N/A"}},{"$f":"IF(ISTEXT('S9'!$D$35),NA(),'S9'!$D$35)","v":{"$error":"#N/A"}},{"$f":"IF(ISTEXT('S9'!$D$36),NA(),'S9'!$D$36)","v":{"$error":"#N/A"}},null,{"$f":"IF(ISTEXT('S9'!$D$37),NA(),'S9'!$D$37)","v":{"$error":"#N/A"}},null,{"$f":"IF(ISTEXT('S9'!$D$38),NA(),'S9'!$D$38)","v":{"$error":"#N/A"}}]
[{"$f":"IF(ISBLANK('S9'!E$26),\" \",'S9'!E$26)","v":" "},{"$f":"IF(ISTEXT('S9'!$F$31),NA(),'S9'!$F$31)","v":{"$error":"#N/A"}},{"$f":"IF(ISTEXT('S9'!$F$32),NA(),'S9'!$F$32)","v":{"$error":"#N/A"}},{"$f":"IF(ISTEXT('S9'!$F$33),NA(),'S9'!$F$33)","v":{"$error":"#N/A"}},{"$f":"IF(ISTEXT('S9'!$F$34),NA(),'S9'!$F$34)","v":{"$error":"#N/A"}},{"$f":"IF(ISTEXT('S9'!$F$35),NA(),'S9'!$F$35)","v":{"$error":"#N/A"}},{"$f":"IF(ISTEXT('S9'!$F$36),NA(),'S9'!$F$36)","v":{"$error":"#N/A"}},null,{"$f":"IF(ISTEXT('S9'!$F$37),NA(),'S9'!$F$37)","v":{"$error":"#N/A"}},null,{"$f":"IF(ISTEXT('S9'!$F$38),NA(),'S9'!$F$38)","v":{"$error":"#N/A"}}]
[{"$f":"IF(ISBLANK('S9'!G$26),\" \",'S9'!G$26)","v":" "},{"$f":"IF(ISTEXT('S9'!$H$31),NA(),'S9'!$H$31)","v":{"$error":"#N/A"}},{"$f":"IF(ISTEXT('S9'!$H$32),NA(),'S9'!$H$32)","v":{"$error":"#N/A"}},{"$f":"IF(ISTEXT('S9'!$H$33),NA(),'S9'!$H$33)","v":{"$error":"#N/A"}},{"$f":"IF(ISTEXT('S9'!$H$34),NA(),'S9'!$H$34)","v":{"$error":"#N/A"}},{"$f":"IF(ISTEXT('S9'!$H$35),NA(),'S9'!$H$35)","v":{"$error":"#N/A"}},{"$f":"IF(ISTEXT('S9'!$H$36),NA(),'S9'!$H$36)","v":{"$error":"#N/A"}},null,{"$f":"IF(ISTEXT('S9'!$H$37),NA(),'S9'!$H$37)","v":{"$error":"#N/A"}},null,{"$f":"IF(ISTEXT('S9'!$H$38),NA(),'S9'!$H$38)","v":{"$error":"#N/A"}}]
[{"$f":"IF(ISBLANK('S9'!I$26),\" \",'S9'!I$26)","v":" "},{"$f":"IF(ISTEXT('S9'!$J$31),NA(),'S9'!$J$31)","v":{"$error":"#N/A"}},{"$f":"IF(ISTEXT('S9'!$J$32),NA(),'S9'!$J$32)","v":{"$error":"#N/A"}},{"$f":"IF(ISTEXT('S9'!$J$33),NA(),'S9'!$J$33)","v":{"$error":"#N/A"}},{"$f":"IF(ISTEXT('S9'!$J$34),NA(),'S9'!$J$34)","v":{"$error":"#N/A"}},{"$f":"IF(ISTEXT('S9'!$J$35),NA(),'S9'!$J$35)","v":{"$error":"#N/A"}},{"$f":"IF(ISTEXT('S9'!$J$36),NA(),'S9'!$J$36)","v":{"$error":"#N/A"}},null,{"$f":"IF(ISTEXT('S9'!$J$37),NA(),'S9'!$J$37)","v":{"$error":"#N/A"}},null,{"$f":"IF(ISTEXT('S9'!$J$38),NA(),'S9'!$J$38)","v":{"$error":"#N/A"}}]
[{"$f":"IF(ISBLANK('S9'!K$26),\" \",'S9'!K$26)","v":" "},{"$f":"IF(ISTEXT('S9'!$L$31),NA(),'S9'!$L$31)","v":{"$error":"#N/A"}},{"$f":"IF(ISTEXT('S9'!$L$32),NA(),'S9'!$L$32)","v":{"$error":"#N/A"}},{"$f":"IF(ISTEXT('S9'!$L$33),NA(),'S9'!$L$33)","v":{"$error":"#N/A"}},{"$f":"IF(ISTEXT('S9'!$L$34),NA(),'S9'!$L$34)","v":{"$error":"#N/A"}},{"$f":"IF(ISTEXT('S9'!$L$35),NA(),'S9'!$L$35)","v":{"$error":"#N/A"}},{"$f":"IF(ISTEXT('S9'!$L$36),NA(),'S9'!$L$36)","v":{"$error":"#N/A"}},null,{"$f":"IF(ISTEXT('S9'!$L$37),NA(),'S9'!$L$37)","v":{"$error":"#N/A"}},null,{"$f":"IF(ISTEXT('S9'!$L$38),NA(),'S9'!$L$38)","v":{"$error":"#N/A"}}]
[{"$f":"IF(ISBLANK('S9'!M$26),\" \",'S9'!M$26)","v":" "},{"$f":"IF(ISTEXT('S9'!$N$31),NA(),'S9'!$N$31)","v":{"$error":"#N/A"}},{"$f":"IF(ISTEXT('S9'!$N$32),NA(),'S9'!$N$32)","v":{"$error":"#N/A"}},{"$f":"IF(ISTEXT('S9'!$N$33),NA(),'S9'!$N$33)","v":{"$error":"#N/A"}},{"$f":"IF(ISTEXT('S9'!$N$34),NA(),'S9'!$N$34)","v":{"$error":"#N/A"}},{"$f":"IF(ISTEXT('S9'!$N$35),NA(),'S9'!$N$35)","v":{"$error":"#N/A"}},{"$f":"IF(ISTEXT('S9'!$N$36),NA(),'S9'!$N$36)","v":{"$error":"#N/A"}},null,{"$f":"IF(ISTEXT('S9'!$N$37),NA(),'S9'!$N$37)","v":{"$error":"#N/A"}},null,{"$f":"IF(ISTEXT('S9'!$N$38),NA(),'S9'!$N$38)","v":{"$error":"#N/A"}}]
[{"$f":"IF(ISBLANK('S10'!C$8),\" \",'S10'!C$8)","v":" "},{"$f":"IF(ISTEXT('S10'!$D$13),NA(),'S10'!$D$13)","v":{"$error":"#N/A"}},{"$f":"IF(ISTEXT('S10'!$D$14),NA(),'S10'!$D$14)","v":{"$error":"#N/A"}},{"$f":"IF(ISTEXT('S10'!$D$15),NA(),'S10'!$D$15)","v":{"$error":"#N/A"}},{"$f":"IF(ISTEXT('S10'!$D$16),NA(),'S10'!$D$16)","v":{"$error":"#N/A"}},{"$f":"IF(ISTEXT('S10'!$D$17),NA(),'S10'!$D$17)","v":{"$error":"#N/A"}},{"$f":"IF(ISTEXT('S10'!$D$18),NA(),'S10'!$D$18)","v":{"$error":"#N/A"}},null,{"$f":"IF(ISTEXT('S10'!$D$19),NA(),'S10'!$D$19)","v":{"$error":"#N/A"}},null,{"$f":"IF(ISTEXT('S10'!$D$20),NA(),'S10'!$D$20)","v":{"$error":"#N/A"}}]
[{"$f":"IF(ISBLANK('S10'!E$8),\" \",'S10'!E$8)","v":" "},{"$f":"IF(ISTEXT('S10'!$F$13),NA(),'S10'!$F$13)","v":{"$error":"#N/A"}},{"$f":"IF(ISTEXT('S10'!$F$14),NA(),'S10'!$F$14)","v":{"$error":"#N/A"}},{"$f":"IF(ISTEXT('S10'!$F$15),NA(),'S10'!$F$15)","v":{"$error":"#N/A"}},{"$f":"IF(ISTEXT('S10'!$F$16),NA(),'S10'!$F$16)","v":{"$error":"#N/A"}},{"$f":"IF(ISTEXT('S10'!$F$17),NA(),'S10'!$F$17)","v":{"$error":"#N/A"}},{"$f":"IF(ISTEXT('S10'!$F$18),NA(),'S10'!$F$18)","v":{"$error":"#N/A"}},null,{"$f":"IF(ISTEXT('S10'!$F$19),NA(),'S10'!$F$19)","v":{"$error":"#N/A"}},null,{"$f":"IF(ISTEXT('S10'!$F$20),NA(),'S10'!$F$20)","v":{"$error":"#N/A"}}]
[{"$f":"IF(ISBLANK('S10'!G$8),\" \",'S10'!G$8)","v":" "},{"$f":"IF(ISTEXT('S10'!$H$13),NA(),'S10'!$H$13)","v":{"$error":"#N/A"}},{"$f":"IF(ISTEXT('S10'!$H$14),NA(),'S10'!$H$14)","v":{"$error":"#N/A"}},{"$f":"IF(ISTEXT('S10'!$H$15),NA(),'S10'!$H$15)","v":{"$error":"#N/A"}},{"$f":"IF(ISTEXT('S10'!$H$16),NA(),'S10'!$H$16)","v":{"$error":"#N/A"}},{"$f":"IF(ISTEXT('S10'!$H$17),NA(),'S10'!$H$17)","v":{"$error":"#N/A"}},{"$f":"IF(ISTEXT('S10'!$H$18),NA(),'S10'!$H$18)","v":{"$error":"#N/A"}},null,{"$f":"IF(ISTEXT('S10'!$H$19),NA(),'S10'!$H$19)","v":{"$error":"#N/A"}},null,{"$f":"IF(ISTEXT('S10'!$H$20),NA(),'S10'!$H$20)","v":{"$error":"#N/A"}}]
[{"$f":"IF(ISBLANK('S10'!I$8),\" \",'S10'!I$8)","v":" "},{"$f":"IF(ISTEXT('S10'!$J$13),NA(),'S10'!$J$13)","v":{"$error":"#N/A"}},{"$f":"IF(ISTEXT('S10'!$J$14),NA(),'S10'!$J$14)","v":{"$error":"#N/A"}},{"$f":"IF(ISTEXT('S10'!$J$15),NA(),'S10'!$J$15)","v":{"$error":"#N/A"}},{"$f":"IF(ISTEXT('S10'!$J$16),NA(),'S10'!$J$16)","v":{"$error":"#N/A"}},{"$f":"IF(ISTEXT('S10'!$J$17),NA(),'S10'!$J$17)","v":{"$error":"#N/A"}},{"$f":"IF(ISTEXT('S10'!$J$18),NA(),'S10'!$J$18)","v":{"$error":"#N/A"}},null,{"$f":"IF(ISTEXT('S10'!$J$19),NA(),'S10'!$J$19)","v":{"$error":"#N/A"}},null,{"$f":"IF(ISTEXT('S10'!$J$20),NA(),'S10'!$J$20)","v":{"$error":"#N/A"}}]
[{"$f":"IF(ISBLANK('S10'!K$8),\" \",'S10'!K$8)","v":" "},{"$f":"IF(ISTEXT('S10'!$L$13),NA(),'S10'!$L$13)","v":{"$error":"#N/A"}},{"$f":"IF(ISTEXT('S10'!$L$14),NA(),'S10'!$L$14)","v":{"$error":"#N/A"}},{"$f":"IF(ISTEXT('S10'!$L$15),NA(),'S10'!$L$15)","v":{"$error":"#N/A"}},{"$f":"IF(ISTEXT('S10'!$L$16),NA(),'S10'!$L$16)","v":{"$error":"#N/A"}},{"$f":"IF(ISTEXT('S10'!$L$17),NA(),'S10'!$L$17)","v":{"$error":"#N/A"}},{"$f":"IF(ISTEXT('S10'!$L$18),NA(),'S10'!$L$18)","v":{"$error":"#N/A"}},null,{"$f":"IF(ISTEXT('S10'!$L$19),NA(),'S10'!$L$19)","v":{"$error":"#N/A"}},null,{"$f":"IF(ISTEXT('S10'!$L$20),NA(),'S10'!$L$20)","v":{"$error":"#N/A"}}]
[{"$f":"IF(ISBLANK('S10'!M$8),\" \",'S10'!M$8)","v":" "},{"$f":"IF(ISTEXT('S10'!$N$13),NA(),'S10'!$N$13)","v":{"$error":"#N/A"}},{"$f":"IF(ISTEXT('S10'!$N$14),NA(),'S10'!$N$14)","v":{"$error":"#N/A"}},{"$f":"IF(ISTEXT('S10'!$N$15),NA(),'S10'!$N$15)","v":{"$error":"#N/A"}},{"$f":"IF(ISTEXT('S10'!$N$16),NA(),'S10'!$N$16)","v":{"$error":"#N/A"}},{"$f":"IF(ISTEXT('S10'!$N$17),NA(),'S10'!$N$17)","v":{"$error":"#N/A"}},{"$f":"IF(ISTEXT('S10'!$N$18),NA(),'S10'!$N$18)","v":{"$error":"#N/A"}},null,{"$f":"IF(ISTEXT('S10'!$N$19),NA(),'S10'!$N$19)","v":{"$error":"#N/A"}},null,{"$f":"IF(ISTEXT('S10'!$N$20),NA(),'S10'!$N$20)","v":{"$error":"#N/A"}}]
[{"$f":"IF(ISBLANK('S10'!C$26),\" \",'S10'!C$26)","v":" "},{"$f":"IF(ISTEXT('S10'!$D$31),NA(),'S10'!$D$31)","v":{"$error":"#N/A"}},{"$f":"IF(ISTEXT('S10'!$D$32),NA(),'S10'!$D$32)","v":{"$error":"#N/A"}},{"$f":"IF(ISTEXT('S10'!$D$33),NA(),'S10'!$D$33)","v":{"$error":"#N/A"}},{"$f":"IF(ISTEXT('S10'!$D$34),NA(),'S10'!$D$34)","v":{"$error":"#N/A"}},{"$f":"IF(ISTEXT('S10'!$D$35),NA(),'S10'!$D$35)","v":{"$error":"#N/A"}},{"$f":"IF(ISTEXT('S10'!$D$36),NA(),'S10'!$D$36)","v":{"$error":"#N/A"}},null,{"$f":"IF(ISTEXT('S10'!$D$37),NA(),'S10'!$D$37)","v":{"$error":"#N/A"}},null,{"$f":"IF(ISTEXT('S10'!$D$38),NA(),'S10'!$D$38)","v":{"$error":"#N/A"}}]
[{"$f":"IF(ISBLANK('S10'!E$26),\" \",'S10'!E$26)","v":" "},{"$f":"IF(ISTEXT('S10'!$F$31),NA(),'S10'!$F$31)","v":{"$error":"#N/A"}},{"$f":"IF(ISTEXT('S10'!$F$32),NA(),'S10'!$F$32)","v":{"$error":"#N/A"}},{"$f":"IF(ISTEXT('S10'!$F$33),NA(),'S10'!$F$33)","v":{"$error":"#N/A"}},{"$f":"IF(ISTEXT('S10'!$F$34),NA(),'S10'!$F$34)","v":{"$error":"#N/A"}},{"$f":"IF(ISTEXT('S10'!$F$35),NA(),'S10'!$F$35)","v":{"$error":"#N/A"}},{"$f":"IF(ISTEXT('S10'!$F$36),NA(),'S10'!$F$36)","v":{"$error":"#N/A"}},null,{"$f":"IF(ISTEXT('S10'!$F$37),NA(),'S10'!$F$37)","v":{"$error":"#N/A"}},null,{"$f":"IF(ISTEXT('S10'!$F$38),NA(),'S10'!$F$38)","v":{"$error":"#N/A"}}]
[{"$f":"IF(ISBLANK('S10'!G$26),\" \",'S10'!G$26)","v":" "},{"$f":"IF(ISTEXT('S10'!$H$31),NA(),'S10'!$H$31)","v":{"$error":"#N/A"}},{"$f":"IF(ISTEXT('S10'!$H$32),NA(),'S10'!$H$32)","v":{"$error":"#N/A"}},{"$f":"IF(ISTEXT('S10'!$H$33),NA(),'S10'!$H$33)","v":{"$error":"#N/A"}},{"$f":"IF(ISTEXT('S10'!$H$34),NA(),'S10'!$H$34)","v":{"$error":"#N/A"}},{"$f":"IF(ISTEXT('S10'!$H$35),NA(),'S10'!$H$35)","v":{"$error":"#N/A"}},{"$f":"IF(ISTEXT('S10'!$H$36),NA(),'S10'!$H$36)","v":{"$error":"#N/A"}},null,{"$f":"IF(ISTEXT('S10'!$H$37),NA(),'S10'!$H$37)","v":{"$error":"#N/A"}},null,{"$f":"IF(ISTEXT('S10'!$H$38),NA(),'S10'!$H$38)","v":{"$error":"#N/A"}}]
[{"$f":"IF(ISBLANK('S10'!I$26),\" \",'S10'!I$26)","v":" "},{"$f":"IF(ISTEXT('S10'!$J$31),NA(),'S10'!$J$31)","v":{"$error":"#N/A"}},{"$f":"IF(ISTEXT('S10'!$J$32),NA(),'S10'!$J$32)","v":{"$error":"#N/A"}},{"$f":"IF(ISTEXT('S10'!$J$33),NA(),'S10'!$J$33)","v":{"$error":"#N/A"}},{"$f":"IF(ISTEXT('S10'!$J$34),NA(),'S10'!$J$34)","v":{"$error":"#N/A"}},{"$f":"IF(ISTEXT('S10'!$J$35),NA(),'S10'!$J$35)","v":{"$error":"#N/A"}},{"$f":"IF(ISTEXT('S10'!$J$36),NA(),'S10'!$J$36)","v":{"$error":"#N/A"}},null,{"$f":"IF(ISTEXT('S10'!$J$37),NA(),'S10'!$J$37)","v":{"$error":"#N/A"}},null,{"$f":"IF(ISTEXT('S10'!$J$38),NA(),'S10'!$J$38)","v":{"$error":"#N/A"}}]
[{"$f":"IF(ISBLANK('S10'!K$26),\" \",'S10'!K$26)","v":" "},{"$f":"IF(ISTEXT('S10'!$L$31),NA(),'S10'!$L$31)","v":{"$error":"#N/A"}},{"$f":"IF(ISTEXT('S10'!$L$32),NA(),'S10'!$L$32)","v":{"$error":"#N/A"}},{"$f":"IF(ISTEXT('S10'!$L$33),NA(),'S10'!$L$33)","v":{"$error":"#N/A"}},{"$f":"IF(ISTEXT('S10'!$L$34),NA(),'S10'!$L$34)","v":{"$error":"#N/A"}},{"$f":"IF(ISTEXT('S10'!$L$35),NA(),'S10'!$L$35)","v":{"$error":"#N/A"}},{"$f":"IF(ISTEXT('S10'!$L$36),NA(),'S10'!$L$36)","v":{"$error":"#N/A"}},null,{"$f":"IF(ISTEXT('S10'!$L$37),NA(),'S10'!$L$37)","v":{"$error":"#N/A"}},null,{"$f":"IF(ISTEXT('S10'!$L$38),NA(),'S10'!$L$38)","v":{"$error":"#N/A"}}]
[{"$f":"IF(ISBLANK('S10'!M$26),\" \",'S10'!M$26)","v":" "},{"$f":"IF(ISTEXT('S10'!$N$31),NA(),'S10'!$N$31)","v":{"$error":"#N/A"}},{"$f":"IF(ISTEXT('S10'!$N$32),NA(),'S10'!$N$32)","v":{"$error":"#N/A"}},{"$f":"IF(ISTEXT('S10'!$N$33),NA(),'S10'!$N$33)","v":{"$error":"#N/A"}},{"$f":"IF(ISTEXT('S10'!$N$34),NA(),'S10'!$N$34)","v":{"$error":"#N/A"}},{"$f":"IF(ISTEXT('S10'!$N$35),NA(),'S10'!$N$35)","v":{"$error":"#N/A"}},{"$f":"IF(ISTEXT('S10'!$N$36),NA(),'S10'!$N$36)","v":{"$error":"#N/A"}},null,{"$f":"IF(ISTEXT('S10'!$N$37),NA(),'S10'!$N$37)","v":{"$error":"#N/A"}},null,{"$f":"IF(ISTEXT('S10'!$N$38),NA(),'S10'!$N$38)","v":{"$error":"#N/A"}}]
[]
[{"$f":"IF(ISBLANK('S11'!C$8),\" \",'S11'!C$8)","v":" "},{"$f":"IF(ISTEXT('S11'!$D$13),NA(),'S11'!$D$13)","v":{"$error":"#N/A"}},{"$f":"IF(ISTEXT('S11'!$D$14),NA(),'S11'!$D$14)","v":{"$error":"#N/A"}},{"$f":"IF(ISTEXT('S11'!$D$15),NA(),'S11'!$D$15)","v":{"$error":"#N/A"}},{"$f":"IF(ISTEXT('S11'!$D$16),NA(),'S11'!$D$16)","v":{"$error":"#N/A"}},{"$f":"IF(ISTEXT('S11'!$D$17),NA(),'S11'!$D$17)","v":{"$error":"#N/A"}},{"$f":"IF(ISTEXT('S11'!$D$18),NA(),'S11'!$D$18)","v":{"$error":"#N/A"}},null,{"$f":"IF(ISTEXT('S11'!$D$19),NA(),'S11'!$D$19)","v":{"$error":"#N/A"}},null,{"$f":"IF(ISTEXT('S11'!$D$20),NA(),'S11'!$D$20)","v":{"$error":"#N/A"}}]
[{"$f":"IF(ISBLANK('S11'!E$8),\" \",'S11'!E$8)","v":" "},{"$f":"IF(ISTEXT('S11'!$F$13),NA(),'S11'!$F$13)","v":{"$error":"#N/A"}},{"$f":"IF(ISTEXT('S11'!$F$14),NA(),'S11'!$F$14)","v":{"$error":"#N/A"}},{"$f":"IF(ISTEXT('S11'!$F$15),NA(),'S11'!$F$15)","v":{"$error":"#N/A"}},{"$f":"IF(ISTEXT('S11'!$F$16),NA(),'S11'!$F$16)","v":{"$error":"#N/A"}},{"$f":"IF(ISTEXT('S11'!$F$17),NA(),'S11'!$F$17)","v":{"$error":"#N/A"}},{"$f":"IF(ISTEXT('S11'!$F$18),NA(),'S11'!$F$18)","v":{"$error":"#N/A"}},null,{"$f":"IF(ISTEXT('S11'!$F$19),NA(),'S11'!$F$19)","v":{"$error":"#N/A"}},null,{"$f":"IF(ISTEXT('S11'!$F$20),NA(),'S11'!$F$20)","v":{"$error":"#N/A"}}]
[{"$f":"IF(ISBLANK('S11'!G$8),\" \",'S11'!G$8)","v":" "},{"$f":"IF(ISTEXT('S11'!$H$13),NA(),'S11'!$H$13)","v":{"$error":"#N/A"}},{"$f":"IF(ISTEXT('S11'!$H$14),NA(),'S11'!$H$14)","v":{"$error":"#N/A"}},{"$f":"IF(ISTEXT('S11'!$H$15),NA(),'S11'!$H$15)","v":{"$error":"#N/A"}},{"$f":"IF(ISTEXT('S11'!$H$16),NA(),'S11'!$H$16)","v":{"$error":"#N/A"}},{"$f":"IF(ISTEXT('S11'!$H$17),NA(),'S11'!$H$17)","v":{"$error":"#N/A"}},{"$f":"IF(ISTEXT('S11'!$H$18),NA(),'S11'!$H$18)","v":{"$error":"#N/A"}},null,{"$f":"IF(ISTEXT('S11'!$H$19),NA(),'S11'!$H$19)","v":{"$error":"#N/A"}},null,{"$f":"IF(ISTEXT('S11'!$H$20),NA(),'S11'!$H$20)","v":{"$error":"#N/A"}}]
[{"$f":"IF(ISBLANK('S11'!I$8),\" \",'S11'!I$8)","v":" "},{"$f":"IF(ISTEXT('S11'!$J$13),NA(),'S11'!$J$13)","v":{"$error":"#N/A"}},{"$f":"IF(ISTEXT('S11'!$J$14),NA(),'S11'!$J$14)","v":{"$error":"#N/A"}},{"$f":"IF(ISTEXT('S11'!$J$15),NA(),'S11'!$J$15)","v":{"$error":"#N/A"}},{"$f":"IF(ISTEXT('S11'!$J$16),NA(),'S11'!$J$16)","v":{"$error":"#N/A"}},{"$f":"IF(ISTEXT('S11'!$J$17),NA(),'S11'!$J$17)","v":{"$error":"#N/A"}},{"$f":"IF(ISTEXT('S11'!$J$18),NA(),'S11'!$J$18)","v":{"$error":"#N/A"}},null,{"$f":"IF(ISTEXT('S11'!$J$19),NA(),'S11'!$J$19)","v":{"$error":"#N/A"}},null,{"$f":"IF(ISTEXT('S11'!$J$20),NA(),'S11'!$J$20)","v":{"$error":"#N/A"}}]
[{"$f":"IF(ISBLANK('S11'!K$8),\" \",'S11'!K$8)","v":" "},{"$f":"IF(ISTEXT('S11'!$L$13),NA(),'S11'!$L$13)","v":{"$error":"#N/A"}},{"$f":"IF(ISTEXT('S11'!$L$14),NA(),'S11'!$L$14)","v":{"$error":"#N/A"}},{"$f":"IF(ISTEXT('S11'!$L$15),NA(),'S11'!$L$15)","v":{"$error":"#N/A"}},{"$f":"IF(ISTEXT('S11'!$L$16),NA(),'S11'!$L$16)","v":{"$error":"#N/A"}},{"$f":"IF(ISTEXT('S11'!$L$17),NA(),'S11'!$L$17)","v":{"$error":"#N/A"}},{"$f":"IF(ISTEXT('S11'!$L$18),NA(),'S11'!$L$18)","v":{"$error":"#N/A"}},null,{"$f":"IF(ISTEXT('S11'!$L$19),NA(),'S11'!$L$19)","v":{"$error":"#N/A"}},null,{"$f":"IF(ISTEXT('S11'!$L$20),NA(),'S11'!$L$20)","v":{"$error":"#N/A"}}]
[{"$f":"IF(ISBLANK('S11'!M$8),\" \",'S11'!M$8)","v":" "},{"$f":"IF(ISTEXT('S11'!$N$13),NA(),'S11'!$N$13)","v":{"$error":"#N/A"}},{"$f":"IF(ISTEXT('S11'!$N$14),NA(),'S11'!$N$14)","v":{"$error":"#N/A"}},{"$f":"IF(ISTEXT('S11'!$N$15),NA(),'S11'!$N$15)","v":{"$error":"#N/A"}},{"$f":"IF(ISTEXT('S11'!$N$16),NA(),'S11'!$N$16)","v":{"$error":"#N/A"}},{"$f":"IF(ISTEXT('S11'!$N$17),NA(),'S11'!$N$17)","v":{"$error":"#N/A"}},{"$f":"IF(ISTEXT('S11'!$N$18),NA(),'S11'!$N$18)","v":{"$error":"#N/A"}},null,{"$f":"IF(ISTEXT('S11'!$N$19),NA(),'S11'!$N$19)","v":{"$error":"#N/A"}},null,{"$f":"IF(ISTEXT('S11'!$N$20),NA(),'S11'!$N$20)","v":{"$error":"#N/A"}}]
[{"$f":"IF(ISBLANK('S11'!C$26),\" \",'S11'!C$26)","v":" "},{"$f":"IF(ISTEXT('S11'!$D$31),NA(),'S11'!$D$31)","v":{"$error":"#N/A"}},{"$f":"IF(ISTEXT('S11'!$D$32),NA(),'S11'!$D$32)","v":{"$error":"#N/A"}},{"$f":"IF(ISTEXT('S11'!$D$33),NA(),'S11'!$D$33)","v":{"$error":"#N/A"}},{"$f":"IF(ISTEXT('S11'!$D$34),NA(),'S11'!$D$34)","v":{"$error":"#N/A"}},{"$f":"IF(ISTEXT('S11'!$D$35),NA(),'S11'!$D$35)","v":{"$error":"#N/A"}},{"$f":"IF(ISTEXT('S11'!$D$36),NA(),'S11'!$D$36)","v":{"$error":"#N/A"}},null,{"$f":"IF(ISTEXT('S11'!$D$37),NA(),'S11'!$D$37)","v":{"$error":"#N/A"}},null,{"$f":"IF(ISTEXT('S11'!$D$38),NA(),'S11'!$D$38)","v":{"$error":"#N/A"}}]
[{"$f":"IF(ISBLANK('S11'!E$26),\" \",'S11'!E$26)","v":" "},{"$f":"IF(ISTEXT('S11'!$F$31),NA(),'S11'!$F$31)","v":{"$error":"#N/A"}},{"$f":"IF(ISTEXT('S11'!$F$32),NA(),'S11'!$F$32)","v":{"$error":"#N/A"}},{"$f":"IF(ISTEXT('S11'!$F$33),NA(),'S11'!$F$33)","v":{"$error":"#N/A"}},{"$f":"IF(ISTEXT('S11'!$F$34),NA(),'S11'!$F$34)","v":{"$error":"#N/A"}},{"$f":"IF(ISTEXT('S11'!$F$35),NA(),'S11'!$F$35)","v":{"$error":"#N/A"}},{"$f":"IF(ISTEXT('S11'!$F$36),NA(),'S11'!$F$36)","v":{"$error":"#N/A"}},null,{"$f":"IF(ISTEXT('S11'!$F$37),NA(),'S11'!$F$37)","v":{"$error":"#N/A"}},null,{"$f":"IF(ISTEXT('S11'!$F$38),NA(),'S11'!$F$38)","v":{"$error":"#N/A"}}]
[{"$f":"IF(ISBLANK('S11'!G$26),\" \",'S11'!G$26)","v":" "},{"$f":"IF(ISTEXT('S11'!$H$31),NA(),'S11'!$H$31)","v":{"$error":"#N/A"}},{"$f":"IF(ISTEXT('S11'!$H$32),NA(),'S11'!$H$32)","v":{"$error":"#N/A"}},{"$f":"IF(ISTEXT('S11'!$H$33),NA(),'S11'!$H$33)","v":{"$error":"#N/A"}},{"$f":"IF(ISTEXT('S11'!$H$34),NA(),'S11'!$H$34)","v":{"$error":"#N/A"}},{"$f":"IF(ISTEXT('S11'!$H$35),NA(),'S11'!$H$35)","v":{"$error":"#N/A"}},{"$f":"IF(ISTEXT('S11'!$H$36),NA(),'S11'!$H$36)","v":{"$error":"#N/A"}},null,{"$f":"IF(ISTEXT('S11'!$H$37),NA(),'S11'!$H$37)","v":{"$error":"#N/A"}},null,{"$f":"IF(ISTEXT('S11'!$H$38),NA(),'S11'!$H$38)","v":{"$error":"#N/A"}}]
[{"$f":"IF(ISBLANK('S11'!I$26),\" \",'S11'!I$26)","v":" "},{"$f":"IF(ISTEXT('S11'!$J$31),NA(),'S11'!$J$31)","v":{"$error":"#N/A"}},{"$f":"IF(ISTEXT('S11'!$J$32),NA(),'S11'!$J$32)","v":{"$error":"#N/A"}},{"$f":"IF(ISTEXT('S11'!$J$33),NA(),'S11'!$J$33)","v":{"$error":"#N/A"}},{"$f":"IF(ISTEXT('S11'!$J$34),NA(),'S11'!$J$34)","v":{"$error":"#N/A"}},{"$f":"IF(ISTEXT('S11'!$J$35),NA(),'S11'!$J$35)","v":{"$error":"#N/A"}},{"$f":"IF(ISTEXT('S11'!$J$36),NA(),'S11'!$J$36)","v":{"$error":"#N/A"}},null,{"$f":"IF(ISTEXT('S11'!$J$37),NA(),'S11'!$J$37)","v":{"$error":"#N/A"}},null,{"$f":"IF(ISTEXT('S11'!$J$38),NA(),'S11'!$J$38)","v":{"$error":"#N/A"}}]
[{"$f":"IF(ISBLANK('S11'!K$26),\" \",'S11'!K$26)","v":" "},{"$f":"IF(ISTEXT('S11'!$L$31),NA(),'S11'!$L$31)","v":{"$error":"#N/A"}},{"$f":"IF(ISTEXT('S11'!$L$32),NA(),'S11'!$L$32)","v":{"$error":"#N/A"}},{"$f":"IF(ISTEXT('S11'!$L$33),NA(),'S11'!$L$33)","v":{"$error":"#N/A"}},{"$f":"IF(ISTEXT('S11'!$L$34),NA(),'S11'!$L$34)","v":{"$error":"#N/A"}},{"$f":"IF(ISTEXT('S11'!$L$35),NA(),'S11'!$L$35)","v":{"$error":"#N/A"}},{"$f":"IF(ISTEXT('S11'!$L$36),NA(),'S11'!$L$36)","v":{"$error":"#N/A"}},null,{"$f":"IF(ISTEXT('S11'!$L$37),NA(),'S11'!$L$37)","v":{"$error":"#N/A"}},null,{"$f":"IF(ISTEXT('S11'!$L$38),NA(),'S11'!$L$38)","v":{"$error":"#N/A"}}]
[{"$f":"IF(ISBLANK('S11'!M$26),\" \",'S11'!M$26)","v":" "},{"$f":"IF(ISTEXT('S11'!$N$31),NA(),'S11'!$N$31)","v":{"$error":"#N/A"}},{"$f":"IF(ISTEXT('S11'!$N$32),NA(),'S11'!$N$32)","v":{"$error":"#N/A"}},{"$f":"IF(ISTEXT('S11'!$N$33),NA(),'S11'!$N$33)","v":{"$error":"#N/A"}},{"$f":"IF(ISTEXT('S11'!$N$34),NA(),'S11'!$N$34)","v":{"$error":"#N/A"}},{"$f":"IF(ISTEXT('S11'!$N$35),NA(),'S11'!$N$35)","v":{"$error":"#N/A"}},{"$f":"IF(ISTEXT('S11'!$N$36),NA(),'S11'!$N$36)","v":{"$error":"#N/A"}},null,{"$f":"IF(ISTEXT('S11'!$N$37),NA(),'S11'!$N$37)","v":{"$error":"#N/A"}},null,{"$f":"IF(ISTEXT('S11'!$N$38),NA(),'S11'!$N$38)","v":{"$error":"#N/A"}}]
[{"$f":"IF(ISBLANK('S12'!C$8),\" \",'S12'!C$8)","v":" "},{"$f":"IF(ISTEXT('S12'!$D$13),NA(),'S12'!$D$13)","v":{"$error":"#N/A"}},{"$f":"IF(ISTEXT('S12'!$D$14),NA(),'S12'!$D$14)","v":{"$error":"#N/A"}},{"$f":"IF(ISTEXT('S12'!$D$15),NA(),'S12'!$D$15)","v":{"$error":"#N/A"}},{"$f":"IF(ISTEXT('S12'!$D$16),NA(),'S12'!$D$16)","v":{"$error":"#N/A"}},{"$f":"IF(ISTEXT('S12'!$D$17),NA(),'S12'!$D$17)","v":{"$error":"#N/A"}},{"$f":"IF(ISTEXT('S12'!$D$18),NA(),'S12'!$D$18)","v":{"$error":"#N/A"}},null,{"$f":"IF(ISTEXT('S12'!$D$19),NA(),'S12'!$D$19)","v":{"$error":"#N/A"}},null,{"$f":"IF(ISTEXT('S12'!$D$20),NA(),'S12'!$D$20)","v":{"$error":"#N/A"}}]
[{"$f":"IF(ISBLANK('S12'!E$8),\" \",'S12'!E$8)","v":" "},{"$f":"IF(ISTEXT('S12'!$F$13),NA(),'S12'!$F$13)","v":{"$error":"#N/A"}},{"$f":"IF(ISTEXT('S12'!$F$14),NA(),'S12'!$F$14)","v":{"$error":"#N/A"}},{"$f":"IF(ISTEXT('S12'!$F$15),NA(),'S12'!$F$15)","v":{"$error":"#N/A"}},{"$f":"IF(ISTEXT('S12'!$F$16),NA(),'S12'!$F$16)","v":{"$error":"#N/A"}},{"$f":"IF(ISTEXT('S12'!$F$17),NA(),'S12'!$F$17)","v":{"$error":"#N/A"}},{"$f":"IF(ISTEXT('S12'!$F$18),NA(),'S12'!$F$18)","v":{"$error":"#N/A"}},null,{"$f":"IF(ISTEXT('S12'!$F$19),NA(),'S12'!$F$19)","v":{"$error":"#N/A"}},null,{"$f":"IF(ISTEXT('S12'!$F$20),NA(),'S12'!$F$20)","v":{"$error":"#N/A"}}]
[{"$f":"IF(ISBLANK('S12'!G$8),\" \",'S12'!G$8)","v":" "},{"$f":"IF(ISTEXT('S12'!$H$13),NA(),'S12'!$H$13)","v":{"$error":"#N/A"}},{"$f":"IF(ISTEXT('S12'!$H$14),NA(),'S12'!$H$14)","v":{"$error":"#N/A"}},{"$f":"IF(ISTEXT('S12'!$H$15),NA(),'S12'!$H$15)","v":{"$error":"#N/A"}},{"$f":"IF(ISTEXT('S12'!$H$16),NA(),'S12'!$H$16)","v":{"$error":"#N/A"}},{"$f":"IF(ISTEXT('S12'!$H$17),NA(),'S12'!$H$17)","v":{"$error":"#N/A"}},{"$f":"IF(ISTEXT('S12'!$H$18),NA(),'S12'!$H$18)","v":{"$error":"#N/A"}},null,{"$f":"IF(ISTEXT('S12'!$H$19),NA(),'S12'!$H$19)","v":{"$error":"#N/A"}},null,{"$f":"IF(ISTEXT('S12'!$H$20),NA(),'S12'!$H$20)","v":{"$error":"#N/A"}}]
[{"$f":"IF(ISBLANK('S12'!I$8),\" \",'S12'!I$8)","v":" "},{"$f":"IF(ISTEXT('S12'!$J$13),NA(),'S12'!$J$13)","v":{"$error":"#N/A"}},{"$f":"IF(ISTEXT('S12'!$J$14),NA(),'S12'!$J$14)","v":{"$error":"#N/A"}},{"$f":"IF(ISTEXT('S12'!$J$15),NA(),'S12'!$J$15)","v":{"$error":"#N/A"}},{"$f":"IF(ISTEXT('S12'!$J$16),NA(),'S12'!$J$16)","v":{"$error":"#N/A"}},{"$f":"IF(ISTEXT('S12'!$J$17),NA(),'S12'!$J$17)","v":{"$error":"#N/A"}},{"$f":"IF(ISTEXT('S12'!$J$18),NA(),'S12'!$J$18)","v":{"$error":"#N/A"}},null,{"$f":"IF(ISTEXT('S12'!$J$19),NA(),'S12'!$J$19)","v":{"$error":"#N/A"}},null,{"$f":"IF(ISTEXT('S12'!$J$20),NA(),'S12'!$J$20)","v":{"$error":"#N/A"}}]
[{"$f":"IF(ISBLANK('S12'!K$8),\" \",'S12'!K$8)","v":" "},{"$f":"IF(ISTEXT('S12'!$L$13),NA(),'S12'!$L$13)","v":{"$error":"#N/A"}},{"$f":"IF(ISTEXT('S12'!$L$14),NA(),'S12'!$L$14)","v":{"$error":"#N/A"}},{"$f":"IF(ISTEXT('S12'!$L$15),NA(),'S12'!$L$15)","v":{"$error":"#N/A"}},{"$f":"IF(ISTEXT('S12'!$L$16),NA(),'S12'!$L$16)","v":{"$error":"#N/A"}},{"$f":"IF(ISTEXT('S12'!$L$17),NA(),'S12'!$L$17)","v":{"$error":"#N/A"}},{"$f":"IF(ISTEXT('S12'!$L$18),NA(),'S12'!$L$18)","v":{"$error":"#N/A"}},null,{"$f":"IF(ISTEXT('S12'!$L$19),NA(),'S12'!$L$19)","v":{"$error":"#N/A"}},null,{"$f":"IF(ISTEXT('S12'!$L$20),NA(),'S12'!$L$20)","v":{"$error":"#N/A"}}]
[{"$f":"IF(ISBLANK('S12'!M$8),\" \",'S12'!M$8)","v":" "},{"$f":"IF(ISTEXT('S12'!$N$13),NA(),'S12'!$N$13)","v":{"$error":"#N/A"}},{"$f":"IF(ISTEXT('S12'!$N$14),NA(),'S12'!$N$14)","v":{"$error":"#N/A"}},{"$f":"IF(ISTEXT('S12'!$N$15),NA(),'S12'!$N$15)","v":{"$error":"#N/A"}},{"$f":"IF(ISTEXT('S12'!$N$16),NA(),'S12'!$N$16)","v":{"$error":"#N/A"}},{"$f":"IF(ISTEXT('S12'!$N$17),NA(),'S12'!$N$17)","v":{"$error":"#N/A"}},{"$f":"IF(ISTEXT('S12'!$N$18),NA(),'S12'!$N$18)","v":{"$error":"#N/A"}},null,{"$f":"IF(ISTEXT('S12'!$N$19),NA(),'S12'!$N$19)","v":{"$error":"#N/A"}},null,{"$f":"IF(ISTEXT('S12'!$N$20),NA(),'S12'!$N$20)","v":{"$error":"#N/A"}}]
[{"$f":"IF(ISBLANK('S12'!C$26),\" \",'S12'!C$26)","v":"19"},{"$f":"IF(ISTEXT('S12'!$D$31),NA(),'S12'!$D$31)","v":{"$error":"#N/A"}},{"$f":"IF(ISTEXT('S12'!$D$32),NA(),'S12'!$D$32)","v":{"$error":"#N/A"}},{"$f":"IF(ISTEXT('S12'!$D$33),NA(),'S12'!$D$33)","v":{"$error":"#N/A"}},{"$f":"IF(ISTEXT('S12'!$D$34),NA(),'S12'!$D$34)","v":{"$error":"#N/A"}},{"$f":"IF(ISTEXT('S12'!$D$35),NA(),'S12'!$D$35)","v":{"$error":"#N/A"}},{"$f":"IF(ISTEXT('S12'!$D$36),NA(),'S12'!$D$36)","v":{"$error":"#N/A"}},null,{"$f":"IF(ISTEXT('S12'!$D$37),NA(),'S12'!$D$37)","v":{"$error":"#N/A"}},null,{"$f":"IF(ISTEXT('S12'!$D$38),NA(),'S12'!$D$38)","v":{"$error":"#N/A"}}]
[{"$f":"IF(ISBLANK('S12'!E$26),\" \",'S12'!E$26)","v":"20"},{"$f":"IF(ISTEXT('S12'!$F$31),NA(),'S12'!$F$31)","v":{"$error":"#N/A"}},{"$f":"IF(ISTEXT('S12'!$F$32),NA(),'S12'!$F$32)","v":{"$error":"#N/A"}},{"$f":"IF(ISTEXT('S12'!$F$33),NA(),'S12'!$F$33)","v":{"$error":"#N/A"}},{"$f":"IF(ISTEXT('S12'!$F$34),NA(),'S12'!$F$34)","v":{"$error":"#N/A"}},{"$f":"IF(ISTEXT('S12'!$F$35),NA(),'S12'!$F$35)","v":{"$error":"#N/A"}},{"$f":"IF(ISTEXT('S12'!$F$36),NA(),'S12'!$F$36)","v":{"$error":"#N/A"}},null,{"$f":"IF(ISTEXT('S12'!$F$37),NA(),'S12'!$F$37)","v":{"$error":"#N/A"}},null,{"$f":"IF(ISTEXT('S12'!$F$38),NA(),'S12'!$F$38)","v":{"$error":"#N/A"}}]
[{"$f":"IF(ISBLANK('S12'!G$26),\" \",'S12'!G$26)","v":"21"},{"$f":"IF(ISTEXT('S12'!$H$31),NA(),'S12'!$H$31)","v":{"$error":"#N/A"}},{"$f":"IF(ISTEXT('S12'!$H$32),NA(),'S12'!$H$32)","v":{"$error":"#N/A"}},{"$f":"IF(ISTEXT('S12'!$H$33),NA(),'S12'!$H$33)","v":{"$error":"#N/A"}},{"$f":"IF(ISTEXT('S12'!$H$34),NA(),'S12'!$H$34)","v":{"$error":"#N/A"}},{"$f":"IF(ISTEXT('S12'!$H$35),NA(),'S12'!$H$35)","v":{"$error":"#N/A"}},{"$f":"IF(ISTEXT('S12'!$H$36),NA(),'S12'!$H$36)","v":{"$error":"#N/A"}},null,{"$f":"IF(ISTEXT('S12'!$H$37),NA(),'S12'!$H$37)","v":{"$error":"#N/A"}},null,{"$f":"IF(ISTEXT('S12'!$H$38),NA(),'S12'!$H$38)","v":{"$error":"#N/A"}}]
[{"$f":"IF(ISBLANK('S12'!I$26),\" \",'S12'!I$26)","v":"22"},{"$f":"IF(ISTEXT('S12'!$J$31),NA(),'S12'!$J$31)","v":{"$error":"#N/A"}},{"$f":"IF(ISTEXT('S12'!$J$32),NA(),'S12'!$J$32)","v":{"$error":"#N/A"}},{"$f":"IF(ISTEXT('S12'!$J$33),NA(),'S12'!$J$33)","v":{"$error":"#N/A"}},{"$f":"IF(ISTEXT('S12'!$J$34),NA(),'S12'!$J$34)","v":{"$error":"#N/A"}},{"$f":"IF(ISTEXT('S12'!$J$35),NA(),'S12'!$J$35)","v":{"$error":"#N/A"}},{"$f":"IF(ISTEXT('S12'!$J$36),NA(),'S12'!$J$36)","v":{"$error":"#N/A"}},null,{"$f":"IF(ISTEXT('S12'!$J$37),NA(),'S12'!$J$37)","v":{"$error":"#N/A"}},null,{"$f":"IF(ISTEXT('S12'!$J$38),NA(),'S12'!$J$38)","v":{"$error":"#N/A"}}]
[{"$f":"IF(ISBLANK('S12'!K$26),\" \",'S12'!K$26)","v":"23"},{"$f":"IF(ISTEXT('S12'!$L$31),NA(),'S12'!$L$31)","v":{"$error":"#N/A"}},{"$f":"IF(ISTEXT('S12'!$L$32),NA(),'S12'!$L$32)","v":{"$error":"#N/A"}},{"$f":"IF(ISTEXT('S12'!$L$33),NA(),'S12'!$L$33)","v":{"$error":"#N/A"}},{"$f":"IF(ISTEXT('S12'!$L$34),NA(),'S12'!$L$34)","v":{"$error":"#N/A"}},{"$f":"IF(ISTEXT('S12'!$L$35),NA(),'S12'!$L$35)","v":{"$error":"#N/A"}},{"$f":"IF(ISTEXT('S12'!$L$36),NA(),'S12'!$L$36)","v":{"$error":"#N/A"}},null,{"$f":"IF(ISTEXT('S12'!$L$37),NA(),'S12'!$L$37)","v":{"$error":"#N/A"}},null,{"$f":"IF(ISTEXT('S12'!$L$38),NA(),'S12'!$L$38)","v":{"$error":"#N/A"}}]
[{"$f":"IF(ISBLANK('S12'!M$26),\" \",'S12'!M$26)","v":"24"},{"$f":"IF(ISTEXT('S12'!$N$31),NA(),'S12'!$N$31)","v":{"$error":"#N/A"}},{"$f":"IF(ISTEXT('S12'!$N$32),NA(),'S12'!$N$32)","v":{"$error":"#N/A"}},{"$f":"IF(ISTEXT('S12'!$N$33),NA(),'S12'!$N$33)","v":{"$error":"#N/A"}},{"$f":"IF(ISTEXT('S12'!$N$34),NA(),'S12'!$N$34)","v":{"$error":"#N/A"}},{"$f":"IF(ISTEXT('S12'!$N$35),NA(),'S12'!$N$35)","v":{"$error":"#N/A"}},{"$f":"IF(ISTEXT('S12'!$N$36),NA(),'S12'!$N$36)","v":{"$error":"#N/A"}},null,{"$f":"IF(ISTEXT('S12'!$N$37),NA(),'S12'!$N$37)","v":{"$error":"#N/A"}},null,{"$f":"IF(ISTEXT('S12'!$N$38),NA(),'S12'!$N$38)","v":{"$error":"#N/A"}}]

{"sheet":"S14","index":19,"n_rows":145,"n_cols":9,"rows_kept":145,"cut":false,"hidden":true,"merged":[]}
[null,200,100,50,30,16,8,4,0.375]
[null,{"$f":"'S1'!$D$20","v":"  "},{"$f":"'S1'!$D$19","v":"  "},{"$f":"'S1'!$D$18","v":"  "},{"$f":"'S1'!$D$17","v":"  "},{"$f":"'S1'!$D$16","v":"  "},{"$f":"'S1'!$D$15","v":"  "},{"$f":"'S1'!$D$14","v":"  "},{"$f":"'S1'!$D$13","v":"  "}]
[null,{"$f":"'S1'!$F$20","v":"  "},{"$f":"'S1'!$F$19","v":"  "},{"$f":"'S1'!$F$18","v":"  "},{"$f":"'S1'!$F$17","v":"  "},{"$f":"'S1'!$F$16","v":"  "},{"$f":"'S1'!$F$15","v":"  "},{"$f":"'S1'!$F$14","v":"  "},{"$f":"'S1'!$F$13","v":"  "}]
[null,{"$f":"'S1'!$H$20","v":"  "},{"$f":"'S1'!$H$19","v":"  "},{"$f":"'S1'!$H$18","v":"  "},{"$f":"'S1'!$H$17","v":"  "},{"$f":"'S1'!$H$16","v":"  "},{"$f":"'S1'!$H$15","v":"  "},{"$f":"'S1'!$H$14","v":"  "},{"$f":"'S1'!$H$13","v":"  "}]
[null,{"$f":"'S1'!$J$20","v":"  "},{"$f":"'S1'!$J$19","v":"  "},{"$f":"'S1'!$J$18","v":"  "},{"$f":"'S1'!$J$17","v":"  "},{"$f":"'S1'!$J$16","v":"  "},{"$f":"'S1'!$J$15","v":"  "},{"$f":"'S1'!$J$14","v":"  "},{"$f":"'S1'!$J$13","v":"  "}]
[null,{"$f":"'S1'!$L$20","v":"  "},{"$f":"'S1'!$L$19","v":"  "},{"$f":"'S1'!$L$18","v":"  "},{"$f":"'S1'!$L$17","v":"  "},{"$f":"'S1'!$L$16","v":"  "},{"$f":"'S1'!$L$15","v":"  "},{"$f":"'S1'!$L$14","v":"  "},{"$f":"'S1'!$L$13","v":"  "}]
[null,{"$f":"'S1'!$N$20","v":"  "},{"$f":"'S1'!$N$19","v":"  "},{"$f":"'S1'!$N$18","v":"  "},{"$f":"'S1'!$N$17","v":"  "},{"$f":"'S1'!$N$16","v":"  "},{"$f":"'S1'!$N$15","v":"  "},{"$f":"'S1'!$N$14","v":"  "},{"$f":"'S1'!$N$13","v":"  "}]
[null,{"$f":"'S1'!$D$38","v":"  "},{"$f":"'S1'!$D$37","v":"  "},{"$f":"'S1'!$D$36","v":"  "},{"$f":"'S1'!$D$35","v":"  "},{"$f":"'S1'!$D$34","v":"  "},{"$f":"'S1'!$D$33","v":"  "},{"$f":"'S1'!$D$32","v":"  "},{"$f":"'S1'!$D$31","v":"  "}]
[null,{"$f":"'S1'!$F$38","v":"  "},{"$f":"'S1'!$F$37","v":"  "},{"$f":"'S1'!$F$36","v":"  "},{"$f":"'S1'!$F$35","v":"  "},{"$f":"'S1'!$F$34","v":"  "},{"$f":"'S1'!$F$33","v":"  "},{"$f":"'S1'!$F$32","v":"  "},{"$f":"'S1'!$F$31","v":"  "}]
[null,{"$f":"'S1'!$H$38","v":"  "},{"$f":"'S1'!$H$37","v":"  "},{"$f":"'S1'!$H$36","v":"  "},{"$f":"'S1'!$H$35","v":"  "},{"$f":"'S1'!$H$34","v":"  "},{"$f":"'S1'!$H$33","v":"  "},{"$f":"'S1'!$H$32","v":"  "},{"$f":"'S1'!$H$31","v":"  "}]
[null,{"$f":"'S1'!$J$38","v":"  "},{"$f":"'S1'!$J$37","v":"  "},{"$f":"'S1'!$J$36","v":"  "},{"$f":"'S1'!$J$35","v":"  "},{"$f":"'S1'!$J$34","v":"  "},{"$f":"'S1'!$J$33","v":"  "},{"$f":"'S1'!$J$32","v":"  "},{"$f":"'S1'!$J$31","v":"  "}]
[null,{"$f":"'S1'!$L$38","v":"  "},{"$f":"'S1'!$L$37","v":"  "},{"$f":"'S1'!$L$36","v":"  "},{"$f":"'S1'!$L$35","v":"  "},{"$f":"'S1'!$L$34","v":"  "},{"$f":"'S1'!$L$33","v":"  "},{"$f":"'S1'!$L$32","v":"  "},{"$f":"'S1'!$L$31","v":"  "}]
[null,{"$f":"'S1'!$N$38","v":"  "},{"$f":"'S1'!$N$37","v":"  "},{"$f":"'S1'!$N$36","v":"  "},{"$f":"'S1'!$N$35","v":"  "},{"$f":"'S1'!$N$34","v":"  "},{"$f":"'S1'!$N$33","v":"  "},{"$f":"'S1'!$N$32","v":"  "},{"$f":"'S1'!$N$31","v":"  "}]
[null,{"$f":"'S2'!$D$20","v":"  "},{"$f":"'S2'!$D$19","v":"  "},{"$f":"'S2'!$D$18","v":"  "},{"$f":"'S2'!$D$17","v":"  "},{"$f":"'S2'!$D$16","v":"  "},{"$f":"'S2'!$D$15","v":"  "},{"$f":"'S2'!$D$14","v":"  "},{"$f":"'S2'!$D$13","v":"  "}]
[null,{"$f":"'S2'!$F$20","v":"  "},{"$f":"'S2'!$F$19","v":"  "},{"$f":"'S2'!$F$18","v":"  "},{"$f":"'S2'!$F$17","v":"  "},{"$f":"'S2'!$F$16","v":"  "},{"$f":"'S2'!$F$15","v":"  "},{"$f":"'S2'!$F$14","v":"  "},{"$f":"'S2'!$F$13","v":"  "}]
[null,{"$f":"'S2'!$H$20","v":"  "},{"$f":"'S2'!$H$19","v":"  "},{"$f":"'S2'!$H$18","v":"  "},{"$f":"'S2'!$H$17","v":"  "},{"$f":"'S2'!$H$16","v":"  "},{"$f":"'S2'!$H$15","v":"  "},{"$f":"'S2'!$H$14","v":"  "},{"$f":"'S2'!$H$13","v":"  "}]
[null,{"$f":"'S2'!$J$20","v":"  "},{"$f":"'S2'!$J$19","v":"  "},{"$f":"'S2'!$J$18","v":"  "},{"$f":"'S2'!$J$17","v":"  "},{"$f":"'S2'!$J$16","v":"  "},{"$f":"'S2'!$J$15","v":"  "},{"$f":"'S2'!$J$14","v":"  "},{"$f":"'S2'!$J$13","v":"  "}]
[null,{"$f":"'S2'!$L$20","v":"  "},{"$f":"'S2'!$L$19","v":"  "},{"$f":"'S2'!$L$18","v":"  "},{"$f":"'S2'!$L$17","v":"  "},{"$f":"'S2'!$L$16","v":"  "},{"$f":"'S2'!$L$15","v":"  "},{"$f":"'S2'!$L$14","v":"  "},{"$f":"'S2'!$L$13","v":"  "}]
[null,{"$f":"'S2'!$N$20","v":"  "},{"$f":"'S2'!$N$19","v":"  "},{"$f":"'S2'!$N$18","v":"  "},{"$f":"'S2'!$N$17","v":"  "},{"$f":"'S2'!$N$16","v":"  "},{"$f":"'S2'!$N$15","v":"  "},{"$f":"'S2'!$N$14","v":"  "},{"$f":"'S2'!$N$13","v":"  "}]
[null,{"$f":"'S2'!$D$38","v":"  "},{"$f":"'S2'!$D$37","v":"  "},{"$f":"'S2'!$D$36","v":"  "},{"$f":"'S2'!$D$35","v":"  "},{"$f":"'S2'!$D$34","v":"  "},{"$f":"'S2'!$D$33","v":"  "},{"$f":"'S2'!$D$32","v":"  "},{"$f":"'S2'!$D$31","v":"  "}]
[null,{"$f":"'S2'!$F$38","v":"  "},{"$f":"'S2'!$F$37","v":"  "},{"$f":"'S2'!$F$36","v":"  "},{"$f":"'S2'!$F$35","v":"  "},{"$f":"'S2'!$F$34","v":"  "},{"$f":"'S2'!$F$33","v":"  "},{"$f":"'S2'!$F$32","v":"  "},{"$f":"'S2'!$F$31","v":"  "}]
[null,{"$f":"'S2'!$H$38","v":"  "},{"$f":"'S2'!$H$37","v":"  "},{"$f":"'S2'!$H$36","v":"  "},{"$f":"'S2'!$H$35","v":"  "},{"$f":"'S2'!$H$34","v":"  "},{"$f":"'S2'!$H$33","v":"  "},{"$f":"'S2'!$H$32","v":"  "},{"$f":"'S2'!$H$31","v":"  "}]
[null,{"$f":"'S2'!$J$38","v":"  "},{"$f":"'S2'!$J$37","v":"  "},{"$f":"'S2'!$J$36","v":"  "},{"$f":"'S2'!$J$35","v":"  "},{"$f":"'S2'!$J$34","v":"  "},{"$f":"'S2'!$J$33","v":"  "},{"$f":"'S2'!$J$32","v":"  "},{"$f":"'S2'!$J$31","v":"  "}]
[null,{"$f":"'S2'!$L$38","v":"  "},{"$f":"'S2'!$L$37","v":"  "},{"$f":"'S2'!$L$36","v":"  "},{"$f":"'S2'!$L$35","v":"  "},{"$f":"'S2'!$L$34","v":"  "},{"$f":"'S2'!$L$33","v":"  "},{"$f":"'S2'!$L$32","v":"  "},{"$f":"'S2'!$L$31","v":"  "}]
[null,{"$f":"'S2'!$N$38","v":"  "},{"$f":"'S2'!$N$37","v":"  "},{"$f":"'S2'!$N$36","v":"  "},{"$f":"'S2'!$N$35","v":"  "},{"$f":"'S2'!$N$34","v":"  "},{"$f":"'S2'!$N$33","v":"  "},{"$f":"'S2'!$N$32","v":"  "},{"$f":"'S2'!$N$31","v":"  "}]
[null,{"$f":"'S3'!$D$20","v":"  "},{"$f":"'S3'!$D$19","v":"  "},{"$f":"'S3'!$D$18","v":"  "},{"$f":"'S3'!$D$17","v":"  "},{"$f":"'S3'!$D$16","v":"  "},{"$f":"'S3'!$D$15","v":"  "},{"$f":"'S3'!$D$14","v":"  "},{"$f":"'S3'!$D$13","v":"  "}]
[null,{"$f":"'S3'!$F$20","v":"  "},{"$f":"'S3'!$F$19","v":"  "},{"$f":"'S3'!$F$18","v":"  "},{"$f":"'S3'!$F$17","v":"  "},{"$f":"'S3'!$F$16","v":"  "},{"$f":"'S3'!$F$15","v":"  "},{"$f":"'S3'!$F$14","v":"  "},{"$f":"'S3'!$F$13","v":"  "}]
[null,{"$f":"'S3'!$H$20","v":"  "},{"$f":"'S3'!$H$19","v":"  "},{"$f":"'S3'!$H$18","v":"  "},{"$f":"'S3'!$H$17","v":"  "},{"$f":"'S3'!$H$16","v":"  "},{"$f":"'S3'!$H$15","v":"  "},{"$f":"'S3'!$H$14","v":"  "},{"$f":"'S3'!$H$13","v":"  "}]
[null,{"$f":"'S3'!$J$20","v":"  "},{"$f":"'S3'!$J$19","v":"  "},{"$f":"'S3'!$J$18","v":"  "},{"$f":"'S3'!$J$17","v":"  "},{"$f":"'S3'!$J$16","v":"  "},{"$f":"'S3'!$J$15","v":"  "},{"$f":"'S3'!$J$14","v":"  "},{"$f":"'S3'!$J$13","v":"  "}]
[null,{"$f":"'S3'!$L$20","v":"  "},{"$f":"'S3'!$L$19","v":"  "},{"$f":"'S3'!$L$18","v":"  "},{"$f":"'S3'!$L$17","v":"  "},{"$f":"'S3'!$L$16","v":"  "},{"$f":"'S3'!$L$15","v":"  "},{"$f":"'S3'!$L$14","v":"  "},{"$f":"'S3'!$L$13","v":"  "}]
[null,{"$f":"'S3'!$N$20","v":"  "},{"$f":"'S3'!$N$19","v":"  "},{"$f":"'S3'!$N$18","v":"  "},{"$f":"'S3'!$N$17","v":"  "},{"$f":"'S3'!$N$16","v":"  "},{"$f":"'S3'!$N$15","v":"  "},{"$f":"'S3'!$N$14","v":"  "},{"$f":"'S3'!$N$13","v":"  "}]
[null,{"$f":"'S3'!$D$38","v":"  "},{"$f":"'S3'!$D$37","v":"  "},{"$f":"'S3'!$D$36","v":"  "},{"$f":"'S3'!$D$35","v":"  "},{"$f":"'S3'!$D$34","v":"  "},{"$f":"'S3'!$D$33","v":"  "},{"$f":"'S3'!$D$32","v":"  "},{"$f":"'S3'!$D$31","v":"  "}]
[null,{"$f":"'S3'!$F$38","v":"  "},{"$f":"'S3'!$F$37","v":"  "},{"$f":"'S3'!$F$36","v":"  "},{"$f":"'S3'!$F$35","v":"  "},{"$f":"'S3'!$F$34","v":"  "},{"$f":"'S3'!$F$33","v":"  "},{"$f":"'S3'!$F$32","v":"  "},{"$f":"'S3'!$F$31","v":"  "}]
[null,{"$f":"'S3'!$H$38","v":"  "},{"$f":"'S3'!$H$37","v":"  "},{"$f":"'S3'!$H$36","v":"  "},{"$f":"'S3'!$H$35","v":"  "},{"$f":"'S3'!$H$34","v":"  "},{"$f":"'S3'!$H$33","v":"  "},{"$f":"'S3'!$H$32","v":"  "},{"$f":"'S3'!$H$31","v":"  "}]
[null,{"$f":"'S3'!$J$38","v":"  "},{"$f":"'S3'!$J$37","v":"  "},{"$f":"'S3'!$J$36","v":"  "},{"$f":"'S3'!$J$35","v":"  "},{"$f":"'S3'!$J$34","v":"  "},{"$f":"'S3'!$J$33","v":"  "},{"$f":"'S3'!$J$32","v":"  "},{"$f":"'S3'!$J$31","v":"  "}]
[null,{"$f":"'S3'!$L$38","v":"  "},{"$f":"'S3'!$L$37","v":"  "},{"$f":"'S3'!$L$36","v":"  "},{"$f":"'S3'!$L$35","v":"  "},{"$f":"'S3'!$L$34","v":"  "},{"$f":"'S3'!$L$33","v":"  "},{"$f":"'S3'!$L$32","v":"  "},{"$f":"'S3'!$L$31","v":"  "}]
[null,{"$f":"'S3'!$N$38","v":"  "},{"$f":"'S3'!$N$37","v":"  "},{"$f":"'S3'!$N$36","v":"  "},{"$f":"'S3'!$N$35","v":"  "},{"$f":"'S3'!$N$34","v":"  "},{"$f":"'S3'!$N$33","v":"  "},{"$f":"'S3'!$N$32","v":"  "},{"$f":"'S3'!$N$31","v":"  "}]
[null,{"$f":"'S4'!$D$20","v":"  "},{"$f":"'S4'!$D$19","v":"  "},{"$f":"'S4'!$D$18","v":"  "},{"$f":"'S4'!$D$17","v":"  "},{"$f":"'S4'!$D$16","v":"  "},{"$f":"'S4'!$D$15","v":"  "},{"$f":"'S4'!$D$14","v":"  "},{"$f":"'S4'!$D$13","v":"  "}]
[null,{"$f":"'S4'!$F$20","v":"  "},{"$f":"'S4'!$F$19","v":"  "},{"$f":"'S4'!$F$18","v":"  "},{"$f":"'S4'!$F$17","v":"  "},{"$f":"'S4'!$F$16","v":"  "},{"$f":"'S4'!$F$15","v":"  "},{"$f":"'S4'!$F$14","v":"  "},{"$f":"'S4'!$F$13","v":"  "}]
[null,{"$f":"'S4'!$H$20","v":"  "},{"$f":"'S4'!$H$19","v":"  "},{"$f":"'S4'!$H$18","v":"  "},{"$f":"'S4'!$H$17","v":"  "},{"$f":"'S4'!$H$16","v":"  "},{"$f":"'S4'!$H$15","v":"  "},{"$f":"'S4'!$H$14","v":"  "},{"$f":"'S4'!$H$13","v":"  "}]
[null,{"$f":"'S4'!$J$20","v":"  "},{"$f":"'S4'!$J$19","v":"  "},{"$f":"'S4'!$J$18","v":"  "},{"$f":"'S4'!$J$17","v":"  "},{"$f":"'S4'!$J$16","v":"  "},{"$f":"'S4'!$J$15","v":"  "},{"$f":"'S4'!$J$14","v":"  "},{"$f":"'S4'!$J$13","v":"  "}]
[null,{"$f":"'S4'!$L$20","v":"  "},{"$f":"'S4'!$L$19","v":"  "},{"$f":"'S4'!$L$18","v":"  "},{"$f":"'S4'!$L$17","v":"  "},{"$f":"'S4'!$L$16","v":"  "},{"$f":"'S4'!$L$15","v":"  "},{"$f":"'S4'!$L$14","v":"  "},{"$f":"'S4'!$L$13","v":"  "}]
[null,{"$f":"'S4'!$N$20","v":"  "},{"$f":"'S4'!$N$19","v":"  "},{"$f":"'S4'!$N$18","v":"  "},{"$f":"'S4'!$N$17","v":"  "},{"$f":"'S4'!$N$16","v":"  "},{"$f":"'S4'!$N$15","v":"  "},{"$f":"'S4'!$N$14","v":"  "},{"$f":"'S4'!$N$13","v":"  "}]
[null,{"$f":"'S4'!$D$38","v":"  "},{"$f":"'S4'!$D$37","v":"  "},{"$f":"'S4'!$D$36","v":"  "},{"$f":"'S4'!$D$35","v":"  "},{"$f":"'S4'!$D$34","v":"  "},{"$f":"'S4'!$D$33","v":"  "},{"$f":"'S4'!$D$32","v":"  "},{"$f":"'S4'!$D$31","v":"  "}]
[null,{"$f":"'S4'!$F$38","v":"  "},{"$f":"'S4'!$F$37","v":"  "},{"$f":"'S4'!$F$36","v":"  "},{"$f":"'S4'!$F$35","v":"  "},{"$f":"'S4'!$F$34","v":"  "},{"$f":"'S4'!$F$33","v":"  "},{"$f":"'S4'!$F$32","v":"  "},{"$f":"'S4'!$F$31","v":"  "}]
[null,{"$f":"'S4'!$H$38","v":"  "},{"$f":"'S4'!$H$37","v":"  "},{"$f":"'S4'!$H$36","v":"  "},{"$f":"'S4'!$H$35","v":"  "},{"$f":"'S4'!$H$34","v":"  "},{"$f":"'S4'!$H$33","v":"  "},{"$f":"'S4'!$H$32","v":"  "},{"$f":"'S4'!$H$31","v":"  "}]
[null,{"$f":"'S4'!$J$38","v":"  "},{"$f":"'S4'!$J$37","v":"  "},{"$f":"'S4'!$J$36","v":"  "},{"$f":"'S4'!$J$35","v":"  "},{"$f":"'S4'!$J$34","v":"  "},{"$f":"'S4'!$J$33","v":"  "},{"$f":"'S4'!$J$32","v":"  "},{"$f":"'S4'!$J$31","v":"  "}]
[null,{"$f":"'S4'!$L$38","v":"  "},{"$f":"'S4'!$L$37","v":"  "},{"$f":"'S4'!$L$36","v":"  "},{"$f":"'S4'!$L$35","v":"  "},{"$f":"'S4'!$L$34","v":"  "},{"$f":"'S4'!$L$33","v":"  "},{"$f":"'S4'!$L$32","v":"  "},{"$f":"'S4'!$L$31","v":"  "}]
[null,{"$f":"'S4'!$N$38","v":"  "},{"$f":"'S4'!$N$37","v":"  "},{"$f":"'S4'!$N$36","v":"  "},{"$f":"'S4'!$N$35","v":"  "},{"$f":"'S4'!$N$34","v":"  "},{"$f":"'S4'!$N$33","v":"  "},{"$f":"'S4'!$N$32","v":"  "},{"$f":"'S4'!$N$31","v":"  "}]
[null,{"$f":"'S5'!$D$20","v":"  "},{"$f":"'S5'!$D$19","v":"  "},{"$f":"'S5'!$D$18","v":"  "},{"$f":"'S5'!$D$17","v":"  "},{"$f":"'S5'!$D$16","v":"  "},{"$f":"'S5'!$D$15","v":"  "},{"$f":"'S5'!$D$14","v":"  "},{"$f":"'S5'!$D$13","v":"  "}]
[null,{"$f":"'S5'!$F$20","v":"  "},{"$f":"'S5'!$F$19","v":"  "},{"$f":"'S5'!$F$18","v":"  "},{"$f":"'S5'!$F$17","v":"  "},{"$f":"'S5'!$F$16","v":"  "},{"$f":"'S5'!$F$15","v":"  "},{"$f":"'S5'!$F$14","v":"  "},{"$f":"'S5'!$F$13","v":"  "}]
[null,{"$f":"'S5'!$H$20","v":"  "},{"$f":"'S5'!$H$19","v":"  "},{"$f":"'S5'!$H$18","v":"  "},{"$f":"'S5'!$H$17","v":"  "},{"$f":"'S5'!$H$16","v":"  "},{"$f":"'S5'!$H$15","v":"  "},{"$f":"'S5'!$H$14","v":"  "},{"$f":"'S5'!$H$13","v":"  "}]
[null,{"$f":"'S5'!$J$20","v":"  "},{"$f":"'S5'!$J$19","v":"  "},{"$f":"'S5'!$J$18","v":"  "},{"$f":"'S5'!$J$17","v":"  "},{"$f":"'S5'!$J$16","v":"  "},{"$f":"'S5'!$J$15","v":"  "},{"$f":"'S5'!$J$14","v":"  "},{"$f":"'S5'!$J$13","v":"  "}]
[null,{"$f":"'S5'!$L$20","v":"  "},{"$f":"'S5'!$L$19","v":"  "},{"$f":"'S5'!$L$18","v":"  "},{"$f":"'S5'!$L$17","v":"  "},{"$f":"'S5'!$L$16","v":"  "},{"$f":"'S5'!$L$15","v":"  "},{"$f":"'S5'!$L$14","v":"  "},{"$f":"'S5'!$L$13","v":"  "}]
[null,{"$f":"'S5'!$N$20","v":"  "},{"$f":"'S5'!$N$19","v":"  "},{"$f":"'S5'!$N$18","v":"  "},{"$f":"'S5'!$N$17","v":"  "},{"$f":"'S5'!$N$16","v":"  "},{"$f":"'S5'!$N$15","v":"  "},{"$f":"'S5'!$N$14","v":"  "},{"$f":"'S5'!$N$13","v":"  "}]
[null,{"$f":"'S5'!$D$38","v":"  "},{"$f":"'S5'!$D$37","v":"  "},{"$f":"'S5'!$D$36","v":"  "},{"$f":"'S5'!$D$35","v":"  "},{"$f":"'S5'!$D$34","v":"  "},{"$f":"'S5'!$D$33","v":"  "},{"$f":"'S5'!$D$32","v":"  "},{"$f":"'S5'!$D$31","v":"  "}]
[null,{"$f":"'S5'!$F$38","v":"  "},{"$f":"'S5'!$F$37","v":"  "},{"$f":"'S5'!$F$36","v":"  "},{"$f":"'S5'!$F$35","v":"  "},{"$f":"'S5'!$F$34","v":"  "},{"$f":"'S5'!$F$33","v":"  "},{"$f":"'S5'!$F$32","v":"  "},{"$f":"'S5'!$F$31","v":"  "}]
[null,{"$f":"'S5'!$H$38","v":"  "},{"$f":"'S5'!$H$37","v":"  "},{"$f":"'S5'!$H$36","v":"  "},{"$f":"'S5'!$H$35","v":"  "},{"$f":"'S5'!$H$34","v":"  "},{"$f":"'S5'!$H$33","v":"  "},{"$f":"'S5'!$H$32","v":"  "},{"$f":"'S5'!$H$31","v":"  "}]
[null,{"$f":"'S5'!$J$38","v":"  "},{"$f":"'S5'!$J$37","v":"  "},{"$f":"'S5'!$J$36","v":"  "},{"$f":"'S5'!$J$35","v":"  "},{"$f":"'S5'!$J$34","v":"  "},{"$f":"'S5'!$J$33","v":"  "},{"$f":"'S5'!$J$32","v":"  "},{"$f":"'S5'!$J$31","v":"  "}]
[null,{"$f":"'S5'!$L$38","v":"  "},{"$f":"'S5'!$L$37","v":"  "},{"$f":"'S5'!$L$36","v":"  "},{"$f":"'S5'!$L$35","v":"  "},{"$f":"'S5'!$L$34","v":"  "},{"$f":"'S5'!$L$33","v":"  "},{"$f":"'S5'!$L$32","v":"  "},{"$f":"'S5'!$L$31","v":"  "}]
[null,{"$f":"'S5'!$N$38","v":"  "},{"$f":"'S5'!$N$37","v":"  "},{"$f":"'S5'!$N$36","v":"  "},{"$f":"'S5'!$N$35","v":"  "},{"$f":"'S5'!$N$34","v":"  "},{"$f":"'S5'!$N$33","v":"  "},{"$f":"'S5'!$N$32","v":"  "},{"$f":"'S5'!$N$31","v":"  "}]
[null,{"$f":"'S6'!$D$20","v":"  "},{"$f":"'S6'!$D$19","v":"  "},{"$f":"'S6'!$D$18","v":"  "},{"$f":"'S6'!$D$17","v":"  "},{"$f":"'S6'!$D$16","v":"  "},{"$f":"'S6'!$D$15","v":"  "},{"$f":"'S6'!$D$14","v":"  "},{"$f":"'S6'!$D$13","v":"  "}]
[null,{"$f":"'S6'!$F$20","v":"  "},{"$f":"'S6'!$F$19","v":"  "},{"$f":"'S6'!$F$18","v":"  "},{"$f":"'S6'!$F$17","v":"  "},{"$f":"'S6'!$F$16","v":"  "},{"$f":"'S6'!$F$15","v":"  "},{"$f":"'S6'!$F$14","v":"  "},{"$f":"'S6'!$F$13","v":"  "}]
[null,{"$f":"'S6'!$H$20","v":"  "},{"$f":"'S6'!$H$19","v":"  "},{"$f":"'S6'!$H$18","v":"  "},{"$f":"'S6'!$H$17","v":"  "},{"$f":"'S6'!$H$16","v":"  "},{"$f":"'S6'!$H$15","v":"  "},{"$f":"'S6'!$H$14","v":"  "},{"$f":"'S6'!$H$13","v":"  "}]
[null,{"$f":"'S6'!$J$20","v":"  "},{"$f":"'S6'!$J$19","v":"  "},{"$f":"'S6'!$J$18","v":"  "},{"$f":"'S6'!$J$17","v":"  "},{"$f":"'S6'!$J$16","v":"  "},{"$f":"'S6'!$J$15","v":"  "},{"$f":"'S6'!$J$14","v":"  "},{"$f":"'S6'!$J$13","v":"  "}]
[null,{"$f":"'S6'!$L$20","v":"  "},{"$f":"'S6'!$L$19","v":"  "},{"$f":"'S6'!$L$18","v":"  "},{"$f":"'S6'!$L$17","v":"  "},{"$f":"'S6'!$L$16","v":"  "},{"$f":"'S6'!$L$15","v":"  "},{"$f":"'S6'!$L$14","v":"  "},{"$f":"'S6'!$L$13","v":"  "}]
[null,{"$f":"'S6'!$N$20","v":"  "},{"$f":"'S6'!$N$19","v":"  "},{"$f":"'S6'!$N$18","v":"  "},{"$f":"'S6'!$N$17","v":"  "},{"$f":"'S6'!$N$16","v":"  "},{"$f":"'S6'!$N$15","v":"  "},{"$f":"'S6'!$N$14","v":"  "},{"$f":"'S6'!$N$13","v":"  "}]
[null,{"$f":"'S6'!$D$38","v":"  "},{"$f":"'S6'!$D$37","v":"  "},{"$f":"'S6'!$D$36","v":"  "},{"$f":"'S6'!$D$35","v":"  "},{"$f":"'S6'!$D$34","v":"  "},{"$f":"'S6'!$D$33","v":"  "},{"$f":"'S6'!$D$32","v":"  "},{"$f":"'S6'!$D$31","v":"  "}]
[null,{"$f":"'S6'!$F$38","v":"  "},{"$f":"'S6'!$F$37","v":"  "},{"$f":"'S6'!$F$36","v":"  "},{"$f":"'S6'!$F$35","v":"  "},{"$f":"'S6'!$F$34","v":"  "},{"$f":"'S6'!$F$33","v":"  "},{"$f":"'S6'!$F$32","v":"  "},{"$f":"'S6'!$F$31","v":"  "}]
[null,{"$f":"'S6'!$H$38","v":"  "},{"$f":"'S6'!$H$37","v":"  "},{"$f":"'S6'!$H$36","v":"  "},{"$f":"'S6'!$H$35","v":"  "},{"$f":"'S6'!$H$34","v":"  "},{"$f":"'S6'!$H$33","v":"  "},{"$f":"'S6'!$H$32","v":"  "},{"$f":"'S6'!$H$31","v":"  "}]
[null,{"$f":"'S6'!$J$38","v":"  "},{"$f":"'S6'!$J$37","v":"  "},{"$f":"'S6'!$J$36","v":"  "},{"$f":"'S6'!$J$35","v":"  "},{"$f":"'S6'!$J$34","v":"  "},{"$f":"'S6'!$J$33","v":"  "},{"$f":"'S6'!$J$32","v":"  "},{"$f":"'S6'!$J$31","v":"  "}]
[null,{"$f":"'S6'!$L$38","v":"  "},{"$f":"'S6'!$L$37","v":"  "},{"$f":"'S6'!$L$36","v":"  "},{"$f":"'S6'!$L$35","v":"  "},{"$f":"'S6'!$L$34","v":"  "},{"$f":"'S6'!$L$33","v":"  "},{"$f":"'S6'!$L$32","v":"  "},{"$f":"'S6'!$L$31","v":"  "}]
[null,{"$f":"'S6'!$N$38","v":"  "},{"$f":"'S6'!$N$37","v":"  "},{"$f":"'S6'!$N$36","v":"  "},{"$f":"'S6'!$N$35","v":"  "},{"$f":"'S6'!$N$34","v":"  "},{"$f":"'S6'!$N$33","v":"  "},{"$f":"'S6'!$N$32","v":"  "},{"$f":"'S6'!$N$31","v":"  "}]
[null,{"$f":"'S7'!$D$20","v":"  "},{"$f":"'S7'!$D$19","v":"  "},{"$f":"'S7'!$D$18","v":"  "},{"$f":"'S7'!$D$17","v":"  "},{"$f":"'S7'!$D$16","v":"  "},{"$f":"'S7'!$D$15","v":"  "},{"$f":"'S7'!$D$14","v":"  "},{"$f":"'S7'!$D$13","v":"  "}]
[null,{"$f":"'S7'!$F$20","v":"  "},{"$f":"'S7'!$F$19","v":"  "},{"$f":"'S7'!$F$18","v":"  "},{"$f":"'S7'!$F$17","v":"  "},{"$f":"'S7'!$F$16","v":"  "},{"$f":"'S7'!$F$15","v":"  "},{"$f":"'S7'!$F$14","v":"  "},{"$f":"'S7'!$F$13","v":"  "}]
[null,{"$f":"'S7'!$H$20","v":"  "},{"$f":"'S7'!$H$19","v":"  "},{"$f":"'S7'!$H$18","v":"  "},{"$f":"'S7'!$H$17","v":"  "},{"$f":"'S7'!$H$16","v":"  "},{"$f":"'S7'!$H$15","v":"  "},{"$f":"'S7'!$H$14","v":"  "},{"$f":"'S7'!$H$13","v":"  "}]
[null,{"$f":"'S7'!$J$20","v":"  "},{"$f":"'S7'!$J$19","v":"  "},{"$f":"'S7'!$J$18","v":"  "},{"$f":"'S7'!$J$17","v":"  "},{"$f":"'S7'!$J$16","v":"  "},{"$f":"'S7'!$J$15","v":"  "},{"$f":"'S7'!$J$14","v":"  "},{"$f":"'S7'!$J$13","v":"  "}]
[null,{"$f":"'S7'!$L$20","v":"  "},{"$f":"'S7'!$L$19","v":"  "},{"$f":"'S7'!$L$18","v":"  "},{"$f":"'S7'!$L$17","v":"  "},{"$f":"'S7'!$L$16","v":"  "},{"$f":"'S7'!$L$15","v":"  "},{"$f":"'S7'!$L$14","v":"  "},{"$f":"'S7'!$L$13","v":"  "}]
[null,{"$f":"'S7'!$N$20","v":"  "},{"$f":"'S7'!$N$19","v":"  "},{"$f":"'S7'!$N$18","v":"  "},{"$f":"'S7'!$N$17","v":"  "},{"$f":"'S7'!$N$16","v":"  "},{"$f":"'S7'!$N$15","v":"  "},{"$f":"'S7'!$N$14","v":"  "},{"$f":"'S7'!$N$13","v":"  "}]
[null,{"$f":"'S7'!$D$38","v":"  "},{"$f":"'S7'!$D$37","v":"  "},{"$f":"'S7'!$D$36","v":"  "},{"$f":"'S7'!$D$35","v":"  "},{"$f":"'S7'!$D$34","v":"  "},{"$f":"'S7'!$D$33","v":"  "},{"$f":"'S7'!$D$32","v":"  "},{"$f":"'S7'!$D$31","v":"  "}]
[null,{"$f":"'S7'!$F$38","v":"  "},{"$f":"'S7'!$F$37","v":"  "},{"$f":"'S7'!$F$36","v":"  "},{"$f":"'S7'!$F$35","v":"  "},{"$f":"'S7'!$F$34","v":"  "},{"$f":"'S7'!$F$33","v":"  "},{"$f":"'S7'!$F$32","v":"  "},{"$f":"'S7'!$F$31","v":"  "}]
[null,{"$f":"'S7'!$H$38","v":"  "},{"$f":"'S7'!$H$37","v":"  "},{"$f":"'S7'!$H$36","v":"  "},{"$f":"'S7'!$H$35","v":"  "},{"$f":"'S7'!$H$34","v":"  "},{"$f":"'S7'!$H$33","v":"  "},{"$f":"'S7'!$H$32","v":"  "},{"$f":"'S7'!$H$31","v":"  "}]
[null,{"$f":"'S7'!$J$38","v":"  "},{"$f":"'S7'!$J$37","v":"  "},{"$f":"'S7'!$J$36","v":"  "},{"$f":"'S7'!$J$35","v":"  "},{"$f":"'S7'!$J$34","v":"  "},{"$f":"'S7'!$J$33","v":"  "},{"$f":"'S7'!$J$32","v":"  "},{"$f":"'S7'!$J$31","v":"  "}]
[null,{"$f":"'S7'!$L$38","v":"  "},{"$f":"'S7'!$L$37","v":"  "},{"$f":"'S7'!$L$36","v":"  "},{"$f":"'S7'!$L$35","v":"  "},{"$f":"'S7'!$L$34","v":"  "},{"$f":"'S7'!$L$33","v":"  "},{"$f":"'S7'!$L$32","v":"  "},{"$f":"'S7'!$L$31","v":"  "}]
[null,{"$f":"'S7'!$N$38","v":"  "},{"$f":"'S7'!$N$37","v":"  "},{"$f":"'S7'!$N$36","v":"  "},{"$f":"'S7'!$N$35","v":"  "},{"$f":"'S7'!$N$34","v":"  "},{"$f":"'S7'!$N$33","v":"  "},{"$f":"'S7'!$N$32","v":"  "},{"$f":"'S7'!$N$31","v":"  "}]
[null,{"$f":"'S8'!$D$20","v":"  "},{"$f":"'S8'!$D$19","v":"  "},{"$f":"'S8'!$D$18","v":"  "},{"$f":"'S8'!$D$17","v":"  "},{"$f":"'S8'!$D$16","v":"  "},{"$f":"'S8'!$D$15","v":"  "},{"$f":"'S8'!$D$14","v":"  "},{"$f":"'S8'!$D$13","v":"  "}]
[null,{"$f":"'S8'!$F$20","v":"  "},{"$f":"'S8'!$F$19","v":"  "},{"$f":"'S8'!$F$18","v":"  "},{"$f":"'S8'!$F$17","v":"  "},{"$f":"'S8'!$F$16","v":"  "},{"$f":"'S8'!$F$15","v":"  "},{"$f":"'S8'!$F$14","v":"  "},{"$f":"'S8'!$F$13","v":"  "}]
[null,{"$f":"'S8'!$H$20","v":"  "},{"$f":"'S8'!$H$19","v":"  "},{"$f":"'S8'!$H$18","v":"  "},{"$f":"'S8'!$H$17","v":"  "},{"$f":"'S8'!$H$16","v":"  "},{"$f":"'S8'!$H$15","v":"  "},{"$f":"'S8'!$H$14","v":"  "},{"$f":"'S8'!$H$13","v":"  "}]
[null,{"$f":"'S8'!$J$20","v":"  "},{"$f":"'S8'!$J$19","v":"  "},{"$f":"'S8'!$J$18","v":"  "},{"$f":"'S8'!$J$17","v":"  "},{"$f":"'S8'!$J$16","v":"  "},{"$f":"'S8'!$J$15","v":"  "},{"$f":"'S8'!$J$14","v":"  "},{"$f":"'S8'!$J$13","v":"  "}]
[null,{"$f":"'S8'!$L$20","v":"  "},{"$f":"'S8'!$L$19","v":"  "},{"$f":"'S8'!$L$18","v":"  "},{"$f":"'S8'!$L$17","v":"  "},{"$f":"'S8'!$L$16","v":"  "},{"$f":"'S8'!$L$15","v":"  "},{"$f":"'S8'!$L$14","v":"  "},{"$f":"'S8'!$L$13","v":"  "}]
[null,{"$f":"'S8'!$N$20","v":"  "},{"$f":"'S8'!$N$19","v":"  "},{"$f":"'S8'!$N$18","v":"  "},{"$f":"'S8'!$N$17","v":"  "},{"$f":"'S8'!$N$16","v":"  "},{"$f":"'S8'!$N$15","v":"  "},{"$f":"'S8'!$N$14","v":"  "},{"$f":"'S8'!$N$13","v":"  "}]
[null,{"$f":"'S8'!$D$38","v":"  "},{"$f":"'S8'!$D$37","v":"  "},{"$f":"'S8'!$D$36","v":"  "},{"$f":"'S8'!$D$35","v":"  "},{"$f":"'S8'!$D$34","v":"  "},{"$f":"'S8'!$D$33","v":"  "},{"$f":"'S8'!$D$32","v":"  "},{"$f":"'S8'!$D$31","v":"  "}]
[null,{"$f":"'S8'!$F$38","v":"  "},{"$f":"'S8'!$F$37","v":"  "},{"$f":"'S8'!$F$36","v":"  "},{"$f":"'S8'!$F$35","v":"  "},{"$f":"'S8'!$F$34","v":"  "},{"$f":"'S8'!$F$33","v":"  "},{"$f":"'S8'!$F$32","v":"  "},{"$f":"'S8'!$F$31","v":"  "}]
[null,{"$f":"'S8'!$H$38","v":"  "},{"$f":"'S8'!$H$37","v":"  "},{"$f":"'S8'!$H$36","v":"  "},{"$f":"'S8'!$H$35","v":"  "},{"$f":"'S8'!$H$34","v":"  "},{"$f":"'S8'!$H$33","v":"  "},{"$f":"'S8'!$H$32","v":"  "},{"$f":"'S8'!$H$31","v":"  "}]
[null,{"$f":"'S8'!$J$38","v":"  "},{"$f":"'S8'!$J$37","v":"  "},{"$f":"'S8'!$J$36","v":"  "},{"$f":"'S8'!$J$35","v":"  "},{"$f":"'S8'!$J$34","v":"  "},{"$f":"'S8'!$J$33","v":"  "},{"$f":"'S8'!$J$32","v":"  "},{"$f":"'S8'!$J$31","v":"  "}]
[null,{"$f":"'S8'!$L$38","v":"  "},{"$f":"'S8'!$L$37","v":"  "},{"$f":"'S8'!$L$36","v":"  "},{"$f":"'S8'!$L$35","v":"  "},{"$f":"'S8'!$L$34","v":"  "},{"$f":"'S8'!$L$33","v":"  "},{"$f":"'S8'!$L$32","v":"  "},{"$f":"'S8'!$L$31","v":"  "}]
[null,{"$f":"'S8'!$N$38","v":"  "},{"$f":"'S8'!$N$37","v":"  "},{"$f":"'S8'!$N$36","v":"  "},{"$f":"'S8'!$N$35","v":"  "},{"$f":"'S8'!$N$34","v":"  "},{"$f":"'S8'!$N$33","v":"  "},{"$f":"'S8'!$N$32","v":"  "},{"$f":"'S8'!$N$31","v":"  "}]
[null,{"$f":"'S9'!$D$20","v":"  "},{"$f":"'S9'!$D$19","v":"  "},{"$f":"'S9'!$D$18","v":"  "},{"$f":"'S9'!$D$17","v":"  "},{"$f":"'S9'!$D$16","v":"  "},{"$f":"'S9'!$D$15","v":"  "},{"$f":"'S9'!$D$14","v":"  "},{"$f":"'S9'!$D$13","v":"  "}]
[null,{"$f":"'S9'!$F$20","v":"  "},{"$f":"'S9'!$F$19","v":"  "},{"$f":"'S9'!$F$18","v":"  "},{"$f":"'S9'!$F$17","v":"  "},{"$f":"'S9'!$F$16","v":"  "},{"$f":"'S9'!$F$15","v":"  "},{"$f":"'S9'!$F$14","v":"  "},{"$f":"'S9'!$F$13","v":"  "}]
[null,{"$f":"'S9'!$H$20","v":"  "},{"$f":"'S9'!$H$19","v":"  "},{"$f":"'S9'!$H$18","v":"  "},{"$f":"'S9'!$H$17","v":"  "},{"$f":"'S9'!$H$16","v":"  "},{"$f":"'S9'!$H$15","v":"  "},{"$f":"'S9'!$H$14","v":"  "},{"$f":"'S9'!$H$13","v":"  "}]
[null,{"$f":"'S9'!$J$20","v":"  "},{"$f":"'S9'!$J$19","v":"  "},{"$f":"'S9'!$J$18","v":"  "},{"$f":"'S9'!$J$17","v":"  "},{"$f":"'S9'!$J$16","v":"  "},{"$f":"'S9'!$J$15","v":"  "},{"$f":"'S9'!$J$14","v":"  "},{"$f":"'S9'!$J$13","v":"  "}]
[null,{"$f":"'S9'!$L$20","v":"  "},{"$f":"'S9'!$L$19","v":"  "},{"$f":"'S9'!$L$18","v":"  "},{"$f":"'S9'!$L$17","v":"  "},{"$f":"'S9'!$L$16","v":"  "},{"$f":"'S9'!$L$15","v":"  "},{"$f":"'S9'!$L$14","v":"  "},{"$f":"'S9'!$L$13","v":"  "}]
[null,{"$f":"'S9'!$N$20","v":"  "},{"$f":"'S9'!$N$19","v":"  "},{"$f":"'S9'!$N$18","v":"  "},{"$f":"'S9'!$N$17","v":"  "},{"$f":"'S9'!$N$16","v":"  "},{"$f":"'S9'!$N$15","v":"  "},{"$f":"'S9'!$N$14","v":"  "},{"$f":"'S9'!$N$13","v":"  "}]
[null,{"$f":"'S9'!$D$38","v":"  "},{"$f":"'S9'!$D$37","v":"  "},{"$f":"'S9'!$D$36","v":"  "},{"$f":"'S9'!$D$35","v":"  "},{"$f":"'S9'!$D$34","v":"  "},{"$f":"'S9'!$D$33","v":"  "},{"$f":"'S9'!$D$32","v":"  "},{"$f":"'S9'!$D$31","v":"  "}]
[null,{"$f":"'S9'!$F$38","v":"  "},{"$f":"'S9'!$F$37","v":"  "},{"$f":"'S9'!$F$36","v":"  "},{"$f":"'S9'!$F$35","v":"  "},{"$f":"'S9'!$F$34","v":"  "},{"$f":"'S9'!$F$33","v":"  "},{"$f":"'S9'!$F$32","v":"  "},{"$f":"'S9'!$F$31","v":"  "}]
[null,{"$f":"'S9'!$H$38","v":"  "},{"$f":"'S9'!$H$37","v":"  "},{"$f":"'S9'!$H$36","v":"  "},{"$f":"'S9'!$H$35","v":"  "},{"$f":"'S9'!$H$34","v":"  "},{"$f":"'S9'!$H$33","v":"  "},{"$f":"'S9'!$H$32","v":"  "},{"$f":"'S9'!$H$31","v":"  "}]
[null,{"$f":"'S9'!$J$38","v":"  "},{"$f":"'S9'!$J$37","v":"  "},{"$f":"'S9'!$J$36","v":"  "},{"$f":"'S9'!$J$35","v":"  "},{"$f":"'S9'!$J$34","v":"  "},{"$f":"'S9'!$J$33","v":"  "},{"$f":"'S9'!$J$32","v":"  "},{"$f":"'S9'!$J$31","v":"  "}]
[null,{"$f":"'S9'!$L$38","v":"  "},{"$f":"'S9'!$L$37","v":"  "},{"$f":"'S9'!$L$36","v":"  "},{"$f":"'S9'!$L$35","v":"  "},{"$f":"'S9'!$L$34","v":"  "},{"$f":"'S9'!$L$33","v":"  "},{"$f":"'S9'!$L$32","v":"  "},{"$f":"'S9'!$L$31","v":"  "}]
[null,{"$f":"'S9'!$N$38","v":"  "},{"$f":"'S9'!$N$37","v":"  "},{"$f":"'S9'!$N$36","v":"  "},{"$f":"'S9'!$N$35","v":"  "},{"$f":"'S9'!$N$34","v":"  "},{"$f":"'S9'!$N$33","v":"  "},{"$f":"'S9'!$N$32","v":"  "},{"$f":"'S9'!$N$31","v":"  "}]
[null,{"$f":"'S10'!$D$20","v":"  "},{"$f":"'S10'!$D$19","v":"  "},{"$f":"'S10'!$D$18","v":"  "},{"$f":"'S10'!$D$17","v":"  "},{"$f":"'S10'!$D$16","v":"  "},{"$f":"'S10'!$D$15","v":"  "},{"$f":"'S10'!$D$14","v":"  "},{"$f":"'S10'!$D$13","v":"  "}]
[null,{"$f":"'S10'!$F$20","v":"  "},{"$f":"'S10'!$F$19","v":"  "},{"$f":"'S10'!$F$18","v":"  "},{"$f":"'S10'!$F$17","v":"  "},{"$f":"'S10'!$F$16","v":"  "},{"$f":"'S10'!$F$15","v":"  "},{"$f":"'S10'!$F$14","v":"  "},{"$f":"'S10'!$F$13","v":"  "}]
[null,{"$f":"'S10'!$H$20","v":"  "},{"$f":"'S10'!$H$19","v":"  "},{"$f":"'S10'!$H$18","v":"  "},{"$f":"'S10'!$H$17","v":"  "},{"$f":"'S10'!$H$16","v":"  "},{"$f":"'S10'!$H$15","v":"  "},{"$f":"'S10'!$H$14","v":"  "},{"$f":"'S10'!$H$13","v":"  "}]
[null,{"$f":"'S10'!$J$20","v":"  "},{"$f":"'S10'!$J$19","v":"  "},{"$f":"'S10'!$J$18","v":"  "},{"$f":"'S10'!$J$17","v":"  "},{"$f":"'S10'!$J$16","v":"  "},{"$f":"'S10'!$J$15","v":"  "},{"$f":"'S10'!$J$14","v":"  "},{"$f":"'S10'!$J$13","v":"  "}]
[null,{"$f":"'S10'!$L$20","v":"  "},{"$f":"'S10'!$L$19","v":"  "},{"$f":"'S10'!$L$18","v":"  "},{"$f":"'S10'!$L$17","v":"  "},{"$f":"'S10'!$L$16","v":"  "},{"$f":"'S10'!$L$15","v":"  "},{"$f":"'S10'!$L$14","v":"  "},{"$f":"'S10'!$L$13","v":"  "}]
[null,{"$f":"'S10'!$N$20","v":"  "},{"$f":"'S10'!$N$19","v":"  "},{"$f":"'S10'!$N$18","v":"  "},{"$f":"'S10'!$N$17","v":"  "},{"$f":"'S10'!$N$16","v":"  "},{"$f":"'S10'!$N$15","v":"  "},{"$f":"'S10'!$N$14","v":"  "},{"$f":"'S10'!$N$13","v":"  "}]
[null,{"$f":"'S10'!$D$38","v":"  "},{"$f":"'S10'!$D$37","v":"  "},{"$f":"'S10'!$D$36","v":"  "},{"$f":"'S10'!$D$35","v":"  "},{"$f":"'S10'!$D$34","v":"  "},{"$f":"'S10'!$D$33","v":"  "},{"$f":"'S10'!$D$32","v":"  "},{"$f":"'S10'!$D$31","v":"  "}]
[null,{"$f":"'S10'!$F$38","v":"  "},{"$f":"'S10'!$F$37","v":"  "},{"$f":"'S10'!$F$36","v":"  "},{"$f":"'S10'!$F$35","v":"  "},{"$f":"'S10'!$F$34","v":"  "},{"$f":"'S10'!$F$33","v":"  "},{"$f":"'S10'!$F$32","v":"  "},{"$f":"'S10'!$F$31","v":"  "}]
[null,{"$f":"'S10'!$H$38","v":"  "},{"$f":"'S10'!$H$37","v":"  "},{"$f":"'S10'!$H$36","v":"  "},{"$f":"'S10'!$H$35","v":"  "},{"$f":"'S10'!$H$34","v":"  "},{"$f":"'S10'!$H$33","v":"  "},{"$f":"'S10'!$H$32","v":"  "},{"$f":"'S10'!$H$31","v":"  "}]
[null,{"$f":"'S10'!$J$38","v":"  "},{"$f":"'S10'!$J$37","v":"  "},{"$f":"'S10'!$J$36","v":"  "},{"$f":"'S10'!$J$35","v":"  "},{"$f":"'S10'!$J$34","v":"  "},{"$f":"'S10'!$J$33","v":"  "},{"$f":"'S10'!$J$32","v":"  "},{"$f":"'S10'!$J$31","v":"  "}]
[null,{"$f":"'S10'!$L$38","v":"  "},{"$f":"'S10'!$L$37","v":"  "},{"$f":"'S10'!$L$36","v":"  "},{"$f":"'S10'!$L$35","v":"  "},{"$f":"'S10'!$L$34","v":"  "},{"$f":"'S10'!$L$33","v":"  "},{"$f":"'S10'!$L$32","v":"  "},{"$f":"'S10'!$L$31","v":"  "}]
[null,{"$f":"'S10'!$N$38","v":"  "},{"$f":"'S10'!$N$37","v":"  "},{"$f":"'S10'!$N$36","v":"  "},{"$f":"'S10'!$N$35","v":"  "},{"$f":"'S10'!$N$34","v":"  "},{"$f":"'S10'!$N$33","v":"  "},{"$f":"'S10'!$N$32","v":"  "},{"$f":"'S10'!$N$31","v":"  "}]
[null,{"$f":"'S11'!$D$20","v":"  "},{"$f":"'S11'!$D$19","v":"  "},{"$f":"'S11'!$D$18","v":"  "},{"$f":"'S11'!$D$17","v":"  "},{"$f":"'S11'!$D$16","v":"  "},{"$f":"'S11'!$D$15","v":"  "},{"$f":"'S11'!$D$14","v":"  "},{"$f":"'S11'!$D$13","v":"  "}]
[null,{"$f":"'S11'!$F$20","v":"  "},{"$f":"'S11'!$F$19","v":"  "},{"$f":"'S11'!$F$18","v":"  "},{"$f":"'S11'!$F$17","v":"  "},{"$f":"'S11'!$F$16","v":"  "},{"$f":"'S11'!$F$15","v":"  "},{"$f":"'S11'!$F$14","v":"  "},{"$f":"'S11'!$F$13","v":"  "}]
[null,{"$f":"'S11'!$H$20","v":"  "},{"$f":"'S11'!$H$19","v":"  "},{"$f":"'S11'!$H$18","v":"  "},{"$f":"'S11'!$H$17","v":"  "},{"$f":"'S11'!$H$16","v":"  "},{"$f":"'S11'!$H$15","v":"  "},{"$f":"'S11'!$H$14","v":"  "},{"$f":"'S11'!$H$13","v":"  "}]
[null,{"$f":"'S11'!$J$20","v":"  "},{"$f":"'S11'!$J$19","v":"  "},{"$f":"'S11'!$J$18","v":"  "},{"$f":"'S11'!$J$17","v":"  "},{"$f":"'S11'!$J$16","v":"  "},{"$f":"'S11'!$J$15","v":"  "},{"$f":"'S11'!$J$14","v":"  "},{"$f":"'S11'!$J$13","v":"  "}]
[null,{"$f":"'S11'!$L$20","v":"  "},{"$f":"'S11'!$L$19","v":"  "},{"$f":"'S11'!$L$18","v":"  "},{"$f":"'S11'!$L$17","v":"  "},{"$f":"'S11'!$L$16","v":"  "},{"$f":"'S11'!$L$15","v":"  "},{"$f":"'S11'!$L$14","v":"  "},{"$f":"'S11'!$L$13","v":"  "}]
[null,{"$f":"'S11'!$N$20","v":"  "},{"$f":"'S11'!$N$19","v":"  "},{"$f":"'S11'!$N$18","v":"  "},{"$f":"'S11'!$N$17","v":"  "},{"$f":"'S11'!$N$16","v":"  "},{"$f":"'S11'!$N$15","v":"  "},{"$f":"'S11'!$N$14","v":"  "},{"$f":"'S11'!$N$13","v":"  "}]
[null,{"$f":"'S11'!$D$38","v":"  "},{"$f":"'S11'!$D$37","v":"  "},{"$f":"'S11'!$D$36","v":"  "},{"$f":"'S11'!$D$35","v":"  "},{"$f":"'S11'!$D$34","v":"  "},{"$f":"'S11'!$D$33","v":"  "},{"$f":"'S11'!$D$32","v":"  "},{"$f":"'S11'!$D$31","v":"  "}]
[null,{"$f":"'S11'!$F$38","v":"  "},{"$f":"'S11'!$F$37","v":"  "},{"$f":"'S11'!$F$36","v":"  "},{"$f":"'S11'!$F$35","v":"  "},{"$f":"'S11'!$F$34","v":"  "},{"$f":"'S11'!$F$33","v":"  "},{"$f":"'S11'!$F$32","v":"  "},{"$f":"'S11'!$F$31","v":"  "}]
[null,{"$f":"'S11'!$H$38","v":"  "},{"$f":"'S11'!$H$37","v":"  "},{"$f":"'S11'!$H$36","v":"  "},{"$f":"'S11'!$H$35","v":"  "},{"$f":"'S11'!$H$34","v":"  "},{"$f":"'S11'!$H$33","v":"  "},{"$f":"'S11'!$H$32","v":"  "},{"$f":"'S11'!$H$31","v":"  "}]
[null,{"$f":"'S11'!$J$38","v":"  "},{"$f":"'S11'!$J$37","v":"  "},{"$f":"'S11'!$J$36","v":"  "},{"$f":"'S11'!$J$35","v":"  "},{"$f":"'S11'!$J$34","v":"  "},{"$f":"'S11'!$J$33","v":"  "},{"$f":"'S11'!$J$32","v":"  "},{"$f":"'S11'!$J$31","v":"  "}]
[null,{"$f":"'S11'!$L$38","v":"  "},{"$f":"'S11'!$L$37","v":"  "},{"$f":"'S11'!$L$36","v":"  "},{"$f":"'S11'!$L$35","v":"  "},{"$f":"'S11'!$L$34","v":"  "},{"$f":"'S11'!$L$33","v":"  "},{"$f":"'S11'!$L$32","v":"  "},{"$f":"'S11'!$L$31","v":"  "}]
[null,{"$f":"'S11'!$N$38","v":"  "},{"$f":"'S11'!$N$37","v":"  "},{"$f":"'S11'!$N$36","v":"  "},{"$f":"'S11'!$N$35","v":"  "},{"$f":"'S11'!$N$34","v":"  "},{"$f":"'S11'!$N$33","v":"  "},{"$f":"'S11'!$N$32","v":"  "},{"$f":"'S11'!$N$31","v":"  "}]
[null,{"$f":"'S12'!$D$20","v":"  "},{"$f":"'S12'!$D$19","v":"  "},{"$f":"'S12'!$D$18","v":"  "},{"$f":"'S12'!$D$17","v":"  "},{"$f":"'S12'!$D$16","v":"  "},{"$f":"'S12'!$D$15","v":"  "},{"$f":"'S12'!$D$14","v":"  "},{"$f":"'S12'!$D$13","v":"  "}]
[null,{"$f":"'S12'!$F$20","v":"  "},{"$f":"'S12'!$F$19","v":"  "},{"$f":"'S12'!$F$18","v":"  "},{"$f":"'S12'!$F$17","v":"  "},{"$f":"'S12'!$F$16","v":"  "},{"$f":"'S12'!$F$15","v":"  "},{"$f":"'S12'!$F$14","v":"  "},{"$f":"'S12'!$F$13","v":"  "}]
[null,{"$f":"'S12'!$H$20","v":"  "},{"$f":"'S12'!$H$19","v":"  "},{"$f":"'S12'!$H$18","v":"  "},{"$f":"'S12'!$H$17","v":"  "},{"$f":"'S12'!$H$16","v":"  "},{"$f":"'S12'!$H$15","v":"  "},{"$f":"'S12'!$H$14","v":"  "},{"$f":"'S12'!$H$13","v":"  "}]
[null,{"$f":"'S12'!$J$20","v":"  "},{"$f":"'S12'!$J$19","v":"  "},{"$f":"'S12'!$J$18","v":"  "},{"$f":"'S12'!$J$17","v":"  "},{"$f":"'S12'!$J$16","v":"  "},{"$f":"'S12'!$J$15","v":"  "},{"$f":"'S12'!$J$14","v":"  "},{"$f":"'S12'!$J$13","v":"  "}]
[null,{"$f":"'S12'!$L$20","v":"  "},{"$f":"'S12'!$L$19","v":"  "},{"$f":"'S12'!$L$18","v":"  "},{"$f":"'S12'!$L$17","v":"  "},{"$f":"'S12'!$L$16","v":"  "},{"$f":"'S12'!$L$15","v":"  "},{"$f":"'S12'!$L$14","v":"  "},{"$f":"'S12'!$L$13","v":"  "}]
[null,{"$f":"'S12'!$N$20","v":"  "},{"$f":"'S12'!$N$19","v":"  "},{"$f":"'S12'!$N$18","v":"  "},{"$f":"'S12'!$N$17","v":"  "},{"$f":"'S12'!$N$16","v":"  "},{"$f":"'S12'!$N$15","v":"  "},{"$f":"'S12'!$N$14","v":"  "},{"$f":"'S12'!$N$13","v":"  "}]
[null,{"$f":"'S12'!$D$38","v":"  "},{"$f":"'S12'!$D$37","v":"  "},{"$f":"'S12'!$D$36","v":"  "},{"$f":"'S12'!$D$35","v":"  "},{"$f":"'S12'!$D$34","v":"  "},{"$f":"'S12'!$D$33","v":"  "},{"$f":"'S12'!$D$32","v":"  "},{"$f":"'S12'!$D$31","v":"  "}]
[null,{"$f":"'S12'!$F$38","v":"  "},{"$f":"'S12'!$F$37","v":"  "},{"$f":"'S12'!$F$36","v":"  "},{"$f":"'S12'!$F$35","v":"  "},{"$f":"'S12'!$F$34","v":"  "},{"$f":"'S12'!$F$33","v":"  "},{"$f":"'S12'!$F$32","v":"  "},{"$f":"'S12'!$F$31","v":"  "}]
[null,{"$f":"'S12'!$H$38","v":"  "},{"$f":"'S12'!$H$37","v":"  "},{"$f":"'S12'!$H$36","v":"  "},{"$f":"'S12'!$H$35","v":"  "},{"$f":"'S12'!$H$34","v":"  "},{"$f":"'S12'!$H$33","v":"  "},{"$f":"'S12'!$H$32","v":"  "},{"$f":"'S12'!$H$31","v":"  "}]
[null,{"$f":"'S12'!$J$38","v":"  "},{"$f":"'S12'!$J$37","v":"  "},{"$f":"'S12'!$J$36","v":"  "},{"$f":"'S12'!$J$35","v":"  "},{"$f":"'S12'!$J$34","v":"  "},{"$f":"'S12'!$J$33","v":"  "},{"$f":"'S12'!$J$32","v":"  "},{"$f":"'S12'!$J$31","v":"  "}]
[null,{"$f":"'S12'!$L$38","v":"  "},{"$f":"'S12'!$L$37","v":"  "},{"$f":"'S12'!$L$36","v":"  "},{"$f":"'S12'!$L$35","v":"  "},{"$f":"'S12'!$L$34","v":"  "},{"$f":"'S12'!$L$33","v":"  "},{"$f":"'S12'!$L$32","v":"  "},{"$f":"'S12'!$L$31","v":"  "}]
[null,{"$f":"'S12'!$N$38","v":"  "},{"$f":"'S12'!$N$37","v":"  "},{"$f":"'S12'!$N$36","v":"  "},{"$f":"'S12'!$N$35","v":"  "},{"$f":"'S12'!$N$34","v":"  "},{"$f":"'S12'!$N$33","v":"  "},{"$f":"'S12'!$N$32","v":"  "},{"$f":"'S12'!$N$31","v":"  "}]

{"sheet":"Avg","index":20,"n_rows":7,"n_cols":11,"rows_kept":7,"cut":false,"hidden":false,"merged":[[6,0,6,1],[1,0,1,9],[1,10,1,11],[3,0,3,1],[4,0,4,1],[5,0,5,1]]}
[]
["Average Gradations",null,null,null,null,null,null,null,null,null,{"$f":"IF(ISBLANK('S1'!M4),\" \",'S1'!M4)","v":"B3"}]
[]
["Sieve",null,200,100,50,30,16,8,4,0.375]
["Count",null,{"$f":"COUNT('S14'!B2:B145)","v":0},{"$f":"COUNT('S14'!C2:C145)","v":0},{"$f":"COUNT('S14'!D2:D145)","v":0},{"$f":"COUNT('S14'!E2:E145)","v":0},{"$f":"COUNT('S14'!F2:F145)","v":0},{"$f":"COUNT('S14'!G2:G145)","v":0},{"$f":"COUNT('S14'!H2:H145)","v":0},{"$f":"COUNT('S14'!I2:I145)","v":0}]
["Avg",null,{"$f":"AVERAGE('S14'!B2:B145)","v":{"$error":"#DIV/0!"}},{"$f":"AVERAGE('S14'!C2:C145)","v":{"$error":"#DIV/0!"}},{"$f":"AVERAGE('S14'!D2:D145)","v":{"$error":"#DIV/0!"}},{"$f":"AVERAGE('S14'!E2:E145)","v":{"$error":"#DIV/0!"}},{"$f":"AVERAGE('S14'!F2:F145)","v":{"$error":"#DIV/0!"}},{"$f":"AVERAGE('S14'!G2:G145)","v":{"$error":"#DIV/0!"}},{"$f":"AVERAGE('S14'!H2:H145)","v":{"$error":"#DIV/0!"}},{"$f":"AVERAGE('S14'!I2:I145)","v":{"$error":"#DIV/0!"}}]
["St Dev",null,{"$f":"STDEV('S14'!B2:B145)","v":{"$error":"#DIV/0!"}},{"$f":"STDEV('S14'!C2:C145)","v":{"$error":"#DIV/0!"}},{"$f":"STDEV('S14'!D2:D145)","v":{"$error":"#DIV/0!"}},{"$f":"STDEV('S14'!E2:E145)","v":{"$error":"#DIV/0!"}},{"$f":"STDEV('S14'!F2:F145)","v":{"$error":"#DIV/0!"}},{"$f":"STDEV('S14'!G2:G145)","v":{"$error":"#DIV/0!"}},{"$f":"STDEV('S14'!H2:H145)","v":{"$error":"#DIV/0!"}},{"$f":"STDEV('S14'!I2:I145)","v":{"$error":"#DIV/0!"}}]

{"sheet":"AP","index":21,"n_rows":32,"n_cols":19,"rows_kept":32,"cut":false,"hidden":true,"merged":[[25,0,27,0],[29,0,31,0],[33,0,35,0],[26,2,26,3],[30,2,30,3],[21,0,23,0],[5,0,7,0],[9,0,11,0],[1,0,3,0],[13,0,15,0],[17,0,19,0]]}
[null,null,null,null,null,null,null,{"$f":"'S1'!M4","v":"B3"}]
[0.375,"Max",105]
[]
[null,"Min",95]
[]
[4,"Max",100]
[null,null,null,"Major Unit",{"$f":"IF($H$1=\"B2\",1,IF($H$1=\"B1\",1,IF($H$1=\"B3\",2)))","v":2}]
[null,"Min",{"$f":"IF($H$1=\"B2\",95,IF($H$1=\"B1\",95,IF($H$1=\"B3\",80)))","v":80}]
[]
[8,"Max",100]
[null,null,null,"Major Unit",{"$f":"IF($H$1=\"B2\",1,IF($H$1=\"B1\",5,IF($H$1=\"B3\",5)))","v":5}]
[null,"Min",{"$f":"IF(H1=\"B1\",70,IF(H1=\"B2\",95,IF(H1=\"B3\",65)))","v":65}]
[]
[16,"Max",{"$f":"IF(H1=\"B2\",100,80)","v":80}]
[]
[null,"Min",{"$f":"IF($H$1=\"B2\",85,40)","v":40}]
[]
[30,"Max",{"$f":"IF($H$1=\"B2\",90,65)","v":65}]
[]
[null,"Min",{"$f":"IF($H$1=\"B2\",65,20)","v":20}]
[]
[50,"Max",{"$f":"IF($H$1=\"B2\",60,40)","v":40}]
[]
[null,"Min",{"$f":"IF($H$1=\"B2\",30,7)","v":7}]
[]
[100,"Max",{"$f":"IF($H$1=\"B2\",25,20)","v":20}]
[]
[null,"Min",{"$f":"IF($H$1=\"B2\",5,2)","v":2},null,null,null,null,null,null,null,null,null,null,null,null,null,null,null,"`"]
[]
[200,"Max",{"$f":"IF($H$1=\"B2\",5,10)","v":10}]
[]
[null,"Min",0]